maven-notifications mailing list archives

Site index · List index
Message view « Date » · « Thread »
Top « Date » · « Thread »
From Hudson <Hud...@sonatype.org>
Subject Build failed in Hudson: Maven-2.2.x-bootstrap » 1.5,osx #1
Date Fri, 01 May 2009 12:22:26 GMT
See http://grid.sonatype.org/ci/job/Maven-2.2.x-bootstrap/./jdk=1.5,label=osx/1/

------------------------------------------
[...truncated 6629 lines...]
     [exec]   testitMNG3441(org.apache.maven.it.MavenITmng3441MetadataUpdatedFromDeploymentRepositoryTest)
     [exec]   testitMNG3428(org.apache.maven.it.MavenITmng3428PluginDescriptorArtifactsIncompleteTest)
     [exec]   testitMNG3422(org.apache.maven.it.MavenITmng3422ActiveComponentCollectionTest)
     [exec]   testitMNG3415(org.apache.maven.it.MavenITmng3415JunkRepositoryMetadataTest)
     [exec]   testShouldNotRepeatedlyUpdateOnResourceNotFoundException(org.apache.maven.it.MavenITmng3415JunkRepositoryMetadataTest)
     [exec]   testitMNG3396(org.apache.maven.it.MavenITmng3396DependencyManagementForOverConstrainedRangesTest)
     [exec]   testitMNG3394a(org.apache.maven.it.MavenITmng3394POMPluginVersionDominanceTest)
     [exec]   testitMNG3394b(org.apache.maven.it.MavenITmng3394POMPluginVersionDominanceTest)
     [exec]   testitMNG3380(org.apache.maven.it.MavenITmng3380ManagedRelocatedTransdepsTest)
     [exec]   testitMNG3379(org.apache.maven.it.MavenITmng3379ParallelArtifactDownloadsTest)
     [exec]   testitMNG3372(org.apache.maven.it.MavenITmng3372DirectInvocationOfPluginsTest)
     [exec]   testDependencyTreeInvocation(org.apache.maven.it.MavenITmng3372DirectInvocationOfPluginsTest)
     [exec]   testitMNG3355(org.apache.maven.it.MavenITmng3355TranslatedPathInterpolationTest)
     [exec]   testitMNG3331a(org.apache.maven.it.MavenITmng3331ModulePathNormalizationTest)
     [exec]   testitMNG3331b(org.apache.maven.it.MavenITmng3331ModulePathNormalizationTest)
     [exec]   testitMNG3314(org.apache.maven.it.MavenITmng3314OfflineSnapshotsTest)
     [exec]   testitMNG3288(org.apache.maven.it.MavenITmng3288SystemScopeDirTest)
     [exec]   testitMNG3284(org.apache.maven.it.MavenITmng3284UsingCachedPluginsTest)
     [exec]   testitMNG3271(org.apache.maven.it.MavenITmng3271DefaultReportsSuppressionTest)
     [exec]   testitMNG3221a(org.apache.maven.it.MavenITmng3221InfiniteForkingTest)
     [exec]   testitMNG3221b(org.apache.maven.it.MavenITmng3221InfiniteForkingTest)
     [exec]   testMultipleProfileParams(org.apache.maven.it.MavenITmng3268MultipleDashPCommandLineTest)
     [exec]   testitMNG3259(org.apache.maven.it.MavenITmng3259DepsDroppedInMultiModuleBuildTest)
     [exec]   testitMNG3220a(org.apache.maven.it.MavenITmng3220ImportScopeTest)
     [exec]   testitMNG3220b(org.apache.maven.it.MavenITmng3220ImportScopeTest)
     [exec]   testitMNG3217(org.apache.maven.it.MavenITmng3217InterPluginDependencyTest)
     [exec]   testitMNG3139(org.apache.maven.it.MavenITmng3139UseCachedMetadataOfBlacklistedRepoTest)
     [exec]   testit(org.apache.maven.it.MavenITmng3118TestClassPathOrderTest)
     [exec]   testProfilesWithMultipleActivators(org.apache.maven.it.MavenITmng3106ProfileMultipleActivatorsTest)
     [exec]   testitMNG3099(org.apache.maven.it.MavenITmng3099SettingsProfilesWithNoPomTest)
     [exec]   testitMNG3057(org.apache.maven.it.MavenITmng3057VersionExprTransformationsTest)
     [exec]   testitMNG3052(org.apache.maven.it.MavenITmng3052DepRepoAggregationTest)
     [exec]   testitMNG3023A(org.apache.maven.it.MavenITmng3023ReactorDependencyResolutionTest)
     [exec]   testitMNG3023B(org.apache.maven.it.MavenITmng3023ReactorDependencyResolutionTest)
     [exec]   testitMNG3023C(org.apache.maven.it.MavenITmng3023ReactorDependencyResolutionTest)
     [exec]   testitMNG3012(org.apache.maven.it.MavenITmng3012CoreClassImportTest)
     [exec]   testitLifecycleInvocation(org.apache.maven.it.MavenITmng2972OverridePluginDependencyTest)
     [exec]   testitCommandLineInvocation(org.apache.maven.it.MavenITmng2972OverridePluginDependencyTest)
     [exec]   testitMNG2926(org.apache.maven.it.MavenITmng2926PluginPrefixOrderTest)
     [exec]   testitMNG2921(org.apache.maven.it.MavenITmng2921ActiveAttachedArtifactsTest)
     [exec]   testitMNG2892(org.apache.maven.it.MavenITmng2892HideCorePlexusUtilsTest)
     [exec]   testParentUnresolvable(org.apache.maven.it.MavenITmng2883LegacyRepoOfflineTest)
     [exec]   testDependencyUnresolvable(org.apache.maven.it.MavenITmng2883LegacyRepoOfflineTest)
     [exec]   testPluginUnresolvable(org.apache.maven.it.MavenITmng2883LegacyRepoOfflineTest)
     [exec]   testitMNG2878(org.apache.maven.it.MavenITmng2878DefaultReportXmlImportTest)
     [exec]   testitFileRepo(org.apache.maven.it.MavenITmng2865MirrorWildcardTest)
     [exec]   testitLocalhostRepo(org.apache.maven.it.MavenITmng2865MirrorWildcardTest)
     [exec]   testitExternalRepo(org.apache.maven.it.MavenITmng2865MirrorWildcardTest)
     [exec]   testitCentralRepo(org.apache.maven.it.MavenITmng2865MirrorWildcardTest)
     [exec]   testitMNG2861(org.apache.maven.it.MavenITmng2861RelocationsAndRangesTest)
     [exec]   testitMNG2843(org.apache.maven.it.MavenITmng2843PluginConfigPropertiesInjectionTest)
     [exec]   testitMNG2831(org.apache.maven.it.MavenITmng2831CustomArtifactHandlerAndCustomLifecycleTest)
     [exec]   testit(org.apache.maven.it.MavenITmng2820PomCommentsTest)
     [exec]   testitMNG2790(org.apache.maven.it.MavenITmng2790LastUpdatedMetadataTest)
     [exec]   testitMNG2749(org.apache.maven.it.MavenITmng2749ExtensionAvailableToPluginTest)
     [exec]   testitMNG2744(org.apache.maven.it.MavenITmng2744checksumVerificationTest)
     [exec]   testitMNG2739_RepositoryId(org.apache.maven.it.MavenITmng2739RequiredRepositoryElementsTest)
     [exec]   testitMNG2739_RepositoryUrl(org.apache.maven.it.MavenITmng2739RequiredRepositoryElementsTest)
     [exec]   testIT(org.apache.maven.it.MavenITmng2720SiblingClasspathArtifactsTest)
     [exec]   testitMNG2695(org.apache.maven.it.MavenITmng2695OfflinePluginSnapshotsTest)
     [exec]   testNoClassDefFromMojoLoad(org.apache.maven.it.MavenITmng2690MojoLoadingErrorsTest)
     [exec]   testNoClassDefFromMojoConfiguration(org.apache.maven.it.MavenITmng2690MojoLoadingErrorsTest)
     [exec]   testMojoComponentLookupException(org.apache.maven.it.MavenITmng2690MojoLoadingErrorsTest)
     [exec]   testMojoRequirementComponentLookupException(org.apache.maven.it.MavenITmng2690MojoLoadingErrorsTest)
     [exec]   testitMNG2668(org.apache.maven.it.MavenITmng2668UsePluginDependenciesForSortingTest)
     [exec]   testitMNG2605(org.apache.maven.it.MavenITmng2605BogusProfileActivationTest)
     [exec]   testitNoProfile(org.apache.maven.it.MavenITmng2591MergeInheritedPluginConfigTest)
     [exec]   testitWithProfile(org.apache.maven.it.MavenITmng2591MergeInheritedPluginConfigTest)
     [exec]   testitMNG2562(org.apache.maven.it.MavenITmng2562TimestampTest)
     [exec]   testitMNG2539(org.apache.maven.it.MavenITmng2539PluginDependenciesComeFromPluginReposTest)
     [exec]   testitMNG2432(org.apache.maven.it.MavenITmng2432PluginPrefixOrderTest)
     [exec]   testit(org.apache.maven.it.MavenITmng2387InactiveProxyTest)
     [exec]   testit(org.apache.maven.it.MavenITmng2362DeployedPomEncodingTest)
     [exec]   testitMNG2339a(org.apache.maven.it.MavenITmng2339BadProjectInterpolationTest)
     [exec]   testitMNG2339b(org.apache.maven.it.MavenITmng2339BadProjectInterpolationTest)
     [exec]   testitMNG2318(org.apache.maven.it.MavenITmng2318LocalParentResolutionTest)
     [exec]   testitMNG2309(org.apache.maven.it.MavenITmng2309ProfileInjectionOrderTest)
     [exec]   testitMNG2293(org.apache.maven.it.MavenITmng2293CustomPluginParamImplTest)
     [exec]   testitMNG2277(org.apache.maven.it.MavenITmng2277AggregatorAndResolutionPluginsTest)
     [exec]   testitMNG2254(org.apache.maven.it.MavenITmng2254PomEncodingTest)
     [exec]   testitMNG2234(org.apache.maven.it.MavenITmng2234ActiveProfilesFromSettingsTest)
     [exec]   testitMNG2228(org.apache.maven.it.MavenITmng2228ComponentInjectionTest)
     [exec]   testitMNG2201(org.apache.maven.it.MavenITmng2201PluginConfigInterpolationTest)
     [exec]   testitMNG2196(org.apache.maven.it.MavenITmng2196ParentResolutionTest)
     [exec]   testitMNG2174(org.apache.maven.it.MavenITmng2174PluginDepsManagedByParentProfileTest)
     [exec]   testitMNG2136(org.apache.maven.it.MavenITmng2136ActiveByDefaultProfileTest)
     [exec]   testitMNG2130(org.apache.maven.it.MavenITmng2130ParentLookupFromReactorCacheTest)
     [exec]   testitMNG2124(org.apache.maven.it.MavenITmng2124PomInterpolationWithParentValuesTest)
     [exec]   testitMNG2123(org.apache.maven.it.MavenITmng2123VersionRangeDependencyTest)
     [exec]   testitInheritedIdFields(org.apache.maven.it.MavenITmng2068ReactorRelativeParentsTest)
     [exec]   testitExplicitIdFields(org.apache.maven.it.MavenITmng2068ReactorRelativeParentsTest)
     [exec]   testitComplex(org.apache.maven.it.MavenITmng2068ReactorRelativeParentsTest)
     [exec]   testitMNG2054(org.apache.maven.it.MavenITmng2054PluginExecutionInheritanceTest)
     [exec]   testitMNG2052(org.apache.maven.it.MavenITmng2052InterpolateWithSettingsProfilePropertiesTest)
     [exec]   testitMNG2045(org.apache.maven.it.MavenITmng2045testJarDependenciesBrokenInReactorTest)
     [exec]   testitMNG2006(org.apache.maven.it.MavenITmng2006ChildPathAwareUrlInheritanceTest)
     [exec]   testitInheritSuppression(org.apache.maven.it.MavenITmng1999DefaultReportsInheritanceTest)
     [exec]   testitOverrideSuppression(org.apache.maven.it.MavenITmng1999DefaultReportsInheritanceTest)
     [exec]   testitMNG1992(org.apache.maven.it.MavenITmng1992SystemPropOverridesPomPropTest)
     [exec]   testitMNG1957(org.apache.maven.it.MavenITmng1957JdkActivationWithVersionRangeTest)
     [exec]   testitMNG1908(org.apache.maven.it.MavenITmng1908LegacySnapshotUpdateTest)
     [exec]   testVersion(org.apache.maven.it.MavenITmng1830ShowVersionTest)
     [exec]   testitMNG1703(org.apache.maven.it.MavenITmng1703PluginMgmtDepInheritanceTest)
     [exec]   testitMNG1493(org.apache.maven.it.MavenITmng1493NonStandardModulePomNamesTest)
     [exec]   testitMNG1491(org.apache.maven.it.MavenITmng1491ReactorArtifactIdCollisionTest)
     [exec]   testitMNG1415(org.apache.maven.it.MavenITmng1415QuotedSystemPropertiesTest)
     [exec]   testitMNG1412(org.apache.maven.it.MavenITmng1412DependenciesOrderTest)
     [exec]   testitMNG1349(org.apache.maven.it.MavenITmng1349ChecksumFormatsTest)
     [exec]   testitMNG1233(org.apache.maven.it.MavenITmng1233WarDepWithProvidedScopeTest)
     [exec]   testitMNG1088(org.apache.maven.it.MavenITmng1088ReactorDepResolutionTest)
     [exec]   testitMNG1052(org.apache.maven.it.MavenITmng1052PluginMngtConfigTest)
     [exec]   testitMNG1021(org.apache.maven.it.MavenITmng1021EqualAttachmentBuildNumberTest)
     [exec]   testitMNG0985(org.apache.maven.it.MavenITmng0985NonExecutedPluginMngtGoalsTest)
     [exec]   testitMNG0956(org.apache.maven.it.MavenITmng0956ComponentInjectionViaProjectLevelPluginDepTest)
     [exec]   testit(org.apache.maven.it.MavenITmng0947OptionalDependencyTest)
     [exec]   testitMNG0870(org.apache.maven.it.MavenITmng0870ReactorAwarePluginDiscoveryTest)
     [exec]   testitMNG866(org.apache.maven.it.MavenITmng0866EvaluateDefaultValueTest)
     [exec]   testitMNG848(org.apache.maven.it.MavenITmng0848SystemPropOverridesDefaultValueTest)
     [exec]   testitMNG836(org.apache.maven.it.MavenITmng0836PluginParentResolutionTest)
     [exec]   testitMNG0823(org.apache.maven.it.MavenITmng0823MojoContextPassingTest)
     [exec]   testitMNG0820(org.apache.maven.it.MavenITmng0820ConflictResolutionTest)
     [exec]   testitMNG0818(org.apache.maven.it.MavenITmng0818WarDepsNotTransitiveTest)
     [exec]   testitMNG814(org.apache.maven.it.MavenITmng0814ExplicitProfileActivationTest)
     [exec]   testitMNG0786(org.apache.maven.it.MavenITmng0786ProfileAwareReactorTest)
     [exec]   testitMNG0781(org.apache.maven.it.MavenITmng0781PluginConfigVsExecConfigTest)
     [exec]   testitMNG773(org.apache.maven.it.MavenITmng0773SettingsProfileReactorPollutionTest)
     [exec]   testitMNG768(org.apache.maven.it.MavenITmng0768OfflineModeTest)
     [exec]   testitMNG761(org.apache.maven.it.MavenITmng0761MissingSnapshotDistRepoTest)
     [exec]   testitMNG731(org.apache.maven.it.MavenITmng0731LegacyRepoLayoutTest)
     [exec]   testitMNG680(org.apache.maven.it.MavenITmng0680ParentBasedirTest)
     [exec]   testitMNG674(org.apache.maven.it.MavenITmng0674PluginParameterAliasTest)
     [exec]   testitMNG666(org.apache.maven.it.MavenITmng0666IgnoreLegacyPomTest)
     [exec]   testitMNG557(org.apache.maven.it.MavenITmng0557UserSettingsCliOptionTest)
     [exec]   testitBasic(org.apache.maven.it.MavenITmng0553SettingsAuthzEncryptionTest)
     [exec]   testitRelocation(org.apache.maven.it.MavenITmng0553SettingsAuthzEncryptionTest)
     [exec]   testitMNG522(org.apache.maven.it.MavenITmng0522PluginMgmtConfigTest)
     [exec]   testitMNG507(org.apache.maven.it.MavenITmng0507ArtifactRelocationTest)
     [exec]   testitMNG505(org.apache.maven.it.MavenITmng0505VersionRangeTest)
     [exec]   testitMNG496(org.apache.maven.it.MavenITmng0496IgnoreUnknownPluginParametersTest)
     [exec]   testitMNG479(org.apache.maven.it.MavenITmng0479OverrideCentralRepoTest)
     [exec]   testitMNG471(org.apache.maven.it.MavenITmng0471CustomLifecycleTest)
     [exec]   testitReportConfigOverridesBuildDefaults(org.apache.maven.it.MavenITmng0469ReportConfigTest)
     [exec]   testitBuildConfigDominantDuringBuild(org.apache.maven.it.MavenITmng0469ReportConfigTest)
     [exec]   testitBuildConfigIrrelevantForReports(org.apache.maven.it.MavenITmng0469ReportConfigTest)
     [exec]   testitLifecycleInvocation(org.apache.maven.it.MavenITmng0449PluginVersionResolutionTest)
     [exec]   testitCliInvocation(org.apache.maven.it.MavenITmng0449PluginVersionResolutionTest)
     [exec]   testitMNG377(org.apache.maven.it.MavenITmng0377PluginLookupFromPrefixTest)
     [exec]   testitMNG294(org.apache.maven.it.MavenITmng0294MergeGlobalAndUserSettingsTest)
     [exec]   testitMNG282(org.apache.maven.it.MavenITmng0282NonReactorExecWhenProjectIndependentTest)
     [exec]   testitMNG0249(org.apache.maven.it.MavenITmng0249ResolveDepsFromReactorTest)
     [exec]   testitFailFast(org.apache.maven.it.MavenITmng0095ReactorFailureBehaviorTest)
     [exec]   testitFailNever(org.apache.maven.it.MavenITmng0095ReactorFailureBehaviorTest)
     [exec]   testitFailAtEnd(org.apache.maven.it.MavenITmng0095ReactorFailureBehaviorTest)
     [exec]   testit0144(org.apache.maven.it.MavenIT0144LifecycleExecutionOrderTest)
     [exec]   testitCompileScope(org.apache.maven.it.MavenIT0143TransitiveDependencyScopesTest)
     [exec]   testitProvidedScope(org.apache.maven.it.MavenIT0143TransitiveDependencyScopesTest)
     [exec]   testitRuntimeScope(org.apache.maven.it.MavenIT0143TransitiveDependencyScopesTest)
     [exec]   testitTestScope(org.apache.maven.it.MavenIT0143TransitiveDependencyScopesTest)
     [exec]   testit0142(org.apache.maven.it.MavenIT0142DirectDependencyScopesTest)
     [exec]   testit0140(org.apache.maven.it.MavenIT0140Test)
     [exec]   testit0139(org.apache.maven.it.MavenIT0139Test)
     [exec]   testit0138(org.apache.maven.it.MavenIT0138PluginLifecycleTest)
     [exec]   testit0137(org.apache.maven.it.MavenIT0137EarLifecycleTest)
     [exec]   testit0136(org.apache.maven.it.MavenIT0136RarLifecycleTest)
     [exec]   testit0135(org.apache.maven.it.MavenIT0135EjbLifecycleTest)
     [exec]   testit0134(org.apache.maven.it.MavenIT0134WarLifecycleTest)
     [exec]   testit0133(org.apache.maven.it.MavenIT0133JarLifecycleTest)
     [exec]   testit0132(org.apache.maven.it.MavenIT0132PomLifecycleTest)
     [exec]   testit0131(org.apache.maven.it.MavenIT0131SiteLifecycleTest)
     [exec]   testit0130(org.apache.maven.it.MavenIT0130CleanLifecycleTest)
     [exec]   testit0113(org.apache.maven.it.MavenIT0113ServerAuthzAvailableToWagonMgrInPluginTest)
     [exec]   testit0090(org.apache.maven.it.MavenIT0090Test)
     [exec]   testit0087(org.apache.maven.it.MavenIT0087Test)
     [exec]   testit0086(org.apache.maven.it.MavenIT0086Test)
     [exec]   testit0085(org.apache.maven.it.MavenIT0085Test)
     [exec]   testit0072(org.apache.maven.it.MavenIT0072Test)
     [exec]   testit0071(org.apache.maven.it.MavenIT0071Test)
     [exec]   testit0064(org.apache.maven.it.MavenIT0064Test)
     [exec]   testit0063(org.apache.maven.it.MavenIT0063Test)
     [exec]   testit0056(org.apache.maven.it.MavenIT0056Test)
     [exec]   testit0052(org.apache.maven.it.MavenIT0052Test)
     [exec]   testit0051(org.apache.maven.it.MavenIT0051Test)
     [exec]   testit0041(org.apache.maven.it.MavenIT0041Test)
     [exec]   testit0040(org.apache.maven.it.MavenIT0040Test)
     [exec]   testit0039(org.apache.maven.it.MavenIT0039Test)
     [exec]   testit0038(org.apache.maven.it.MavenIT0038Test)
     [exec]   testit0037(org.apache.maven.it.MavenIT0037Test)
     [exec]   testit0036(org.apache.maven.it.MavenIT0036Test)
     [exec]   testit0032(org.apache.maven.it.MavenIT0032Test)
     [exec]   testit0030(org.apache.maven.it.MavenIT0030Test)
     [exec]   testit0025(org.apache.maven.it.MavenIT0025Test)
     [exec]   testit0024(org.apache.maven.it.MavenIT0024Test)
     [exec]   testit0023(org.apache.maven.it.MavenIT0023Test)
     [exec]   testit0021(org.apache.maven.it.MavenIT0021Test)
     [exec]   testit0019(org.apache.maven.it.MavenIT0019Test)
     [exec]   testit0018(org.apache.maven.it.MavenIT0018Test)
     [exec]   testit0012(org.apache.maven.it.MavenIT0012Test)
     [exec]   testit0011(org.apache.maven.it.MavenIT0011Test)
     [exec]   testit0010(org.apache.maven.it.MavenIT0010Test)
     [exec]   testit0009(org.apache.maven.it.MavenIT0009Test)
     [exec]   testit0008(org.apache.maven.it.MavenIT0008Test)
     [exec] 
     [exec] Tests run: 373, Failures: 0, Errors: 212, Skipped: 0
     [exec] 
     [exec] [INFO] ------------------------------------------------------------------------
     [exec] [ERROR] BUILD FAILURE
     [exec] [INFO] ------------------------------------------------------------------------
     [exec] [INFO] There are test failures.
     [exec] 
     [exec] Please refer to /private/tmp/maven-integration-tests-2.1.x/core-it-suite/target/surefire-reports
for the individual test results.
     [exec] [INFO] ------------------------------------------------------------------------
     [exec] [INFO] Trace
     [exec] org.apache.maven.BuildFailureException: There are test failures.
     [exec] 
     [exec] Please refer to /private/tmp/maven-integration-tests-2.1.x/core-it-suite/target/surefire-reports
for the individual test results.
     [exec] 	at org.apache.maven.lifecycle.DefaultLifecycleExecutor.executeGoals(DefaultLifecycleExecutor.java:699)
     [exec] 	at org.apache.maven.lifecycle.DefaultLifecycleExecutor.executeGoalWithLifecycle(DefaultLifecycleExecutor.java:540)
     [exec] 	at org.apache.maven.lifecycle.DefaultLifecycleExecutor.executeGoal(DefaultLifecycleExecutor.java:519)
     [exec] 	at org.apache.maven.lifecycle.DefaultLifecycleExecutor.executeGoalAndHandleFailures(DefaultLifecycleExecutor.java:371)
     [exec] 	at org.apache.maven.lifecycle.DefaultLifecycleExecutor.executeTaskSegments(DefaultLifecycleExecutor.java:332)
     [exec] 	at org.apache.maven.lifecycle.DefaultLifecycleExecutor.execute(DefaultLifecycleExecutor.java:181)
     [exec] 	at org.apache.maven.DefaultMaven.doExecute(DefaultMaven.java:356)
     [exec] 	at org.apache.maven.DefaultMaven.execute(DefaultMaven.java:137)
     [exec] 	at org.apache.maven.cli.MavenCli.main(MavenCli.java:356)
     [exec] 	at sun.reflect.NativeMethodAccessorImpl.invoke0(Native Method)
     [exec] 	at sun.reflect.NativeMethodAccessorImpl.invoke(NativeMethodAccessorImpl.java:39)
     [exec] 	at sun.reflect.DelegatingMethodAccessorImpl.invoke(DelegatingMethodAccessorImpl.java:25)
     [exec] 	at java.lang.reflect.Method.invoke(Method.java:585)
     [exec] 	at org.codehaus.classworlds.Launcher.launchEnhanced(Launcher.java:315)
     [exec] 	at org.codehaus.classworlds.Launcher.launch(Launcher.java:255)
     [exec] 	at org.codehaus.classworlds.Launcher.mainWithExitCode(Launcher.java:430)
     [exec] 	at org.codehaus.classworlds.Launcher.main(Launcher.java:375)
     [exec] Caused by: org.apache.maven.plugin.MojoFailureException: There are test failures.
     [exec] 
     [exec] Please refer to /private/tmp/maven-integration-tests-2.1.x/core-it-suite/target/surefire-reports
for the individual test results.
     [exec] 	at org.apache.maven.plugin.surefire.SurefirePlugin.execute(SurefirePlugin.java:575)
     [exec] 	at org.apache.maven.plugin.DefaultPluginManager.executeMojo(DefaultPluginManager.java:483)
     [exec] 	at org.apache.maven.lifecycle.DefaultLifecycleExecutor.executeGoals(DefaultLifecycleExecutor.java:678)
     [exec] 	... 16 more
     [exec] [INFO] ------------------------------------------------------------------------
     [exec] [INFO] Total time: 82 minutes 3 seconds
     [exec] [INFO] Finished at: Fri May 01 07:21:36 CDT 2009
     [exec] [INFO] Final Memory: 32M/65M
     [exec] [INFO] ------------------------------------------------------------------------

BUILD FAILED
http://grid.sonatype.org/ci/job/Maven-2.2.x-bootstrap/./jdk=1.5,label=osx/ws/maven-2.2.x/build.xml
:291: exec returned: 1

Total time: 101 minutes 2 seconds


Mime
View raw message