maven-notifications mailing list archives

Site index · List index
Message view « Date » · « Thread »
Top « Date » · « Thread »
From Hudson <Hud...@sonatype.org>
Subject Build failed in Hudson: Maven-2.2.x-bootstrap » 1.5,ubuntu #8
Date Mon, 01 Jun 2009 22:08:18 GMT
See http://grid.sonatype.org/ci/job/Maven-2.2.x-bootstrap/./jdk=1.5,label=ubuntu/8/changes

Changes:

[Benjamin Bentmann] o Added license header

------------------------------------------
[...truncated 5165 lines...]
     [exec] Caused by: org.apache.maven.artifact.resolver.ArtifactResolutionException: Unable
to read local copy of metadata: Cannot read metadata from '/opt/repos/bootstrap-maven-2.1.x/org/apache/maven/its/core-integration-testing/2.1-SNAPSHOT/maven-metadata-central.xml':
input contained no data
     [exec]   org.apache.maven.its:core-integration-testing:pom:2.1-SNAPSHOT
     [exec] 	at org.apache.maven.artifact.transform.SnapshotTransformation.transformForResolve(SnapshotTransformation.java:68)
     [exec] 	at org.apache.maven.artifact.transform.DefaultArtifactTransformationManager.transformForResolve(DefaultArtifactTransformationManager.java:55)
     [exec] 	at org.apache.maven.artifact.resolver.DefaultArtifactResolver.resolve(DefaultArtifactResolver.java:145)
     [exec] 	at org.apache.maven.artifact.resolver.DefaultArtifactResolver.resolve(DefaultArtifactResolver.java:90)
     [exec] 	at org.apache.maven.project.DefaultMavenProjectBuilder.findModelFromRepository(DefaultMavenProjectBuilder.java:558)
     [exec] 	... 25 more
     [exec] Caused by: org.apache.maven.artifact.repository.metadata.RepositoryMetadataResolutionException:
Unable to read local copy of metadata: Cannot read metadata from '/opt/repos/bootstrap-maven-2.1.x/org/apache/maven/its/core-integration-testing/2.1-SNAPSHOT/maven-metadata-central.xml':
input contained no data
     [exec] 	at org.apache.maven.artifact.repository.metadata.DefaultRepositoryMetadataManager.resolve(DefaultRepositoryMetadataManager.java:175)
     [exec] 	at org.apache.maven.artifact.transform.AbstractVersionTransformation.resolveVersion(AbstractVersionTransformation.java:65)
     [exec] 	at org.apache.maven.artifact.transform.SnapshotTransformation.transformForResolve(SnapshotTransformation.java:63)
     [exec] 	... 29 more
     [exec] Caused by: org.apache.maven.artifact.repository.metadata.RepositoryMetadataReadException:
Cannot read metadata from '/opt/repos/bootstrap-maven-2.1.x/org/apache/maven/its/core-integration-testing/2.1-SNAPSHOT/maven-metadata-central.xml':
input contained no data
     [exec] 	at org.apache.maven.artifact.repository.metadata.DefaultRepositoryMetadataManager.readMetadata(DefaultRepositoryMetadataManager.java:318)
     [exec] 	at org.apache.maven.artifact.repository.metadata.DefaultRepositoryMetadataManager.loadMetadata(DefaultRepositoryMetadataManager.java:275)
     [exec] 	at org.apache.maven.artifact.repository.metadata.DefaultRepositoryMetadataManager.mergeMetadata(DefaultRepositoryMetadataManager.java:198)
     [exec] 	at org.apache.maven.artifact.repository.metadata.DefaultRepositoryMetadataManager.resolve(DefaultRepositoryMetadataManager.java:166)
     [exec] 	... 31 more
     [exec] Caused by: java.io.EOFException: input contained no data
     [exec] 	at hidden.org.codehaus.plexus.util.xml.pull.MXParser.fillBuf(MXParser.java:2982)
     [exec] 	at hidden.org.codehaus.plexus.util.xml.pull.MXParser.more(MXParser.java:3025)
     [exec] 	at hidden.org.codehaus.plexus.util.xml.pull.MXParser.parseProlog(MXParser.java:1410)
     [exec] 	at hidden.org.codehaus.plexus.util.xml.pull.MXParser.nextImpl(MXParser.java:1395)
     [exec] 	at hidden.org.codehaus.plexus.util.xml.pull.MXParser.next(MXParser.java:1093)
     [exec] 	at org.apache.maven.artifact.repository.metadata.io.xpp3.MetadataXpp3Reader.read(MetadataXpp3Reader.java:949)
     [exec] 	at org.apache.maven.artifact.repository.metadata.DefaultRepositoryMetadataManager.readMetadata(DefaultRepositoryMetadataManager.java:310)
     [exec] 	... 34 more
     [exec] [INFO] ------------------------------------------------------------------------
     [exec] [INFO] Total time: 1 second
     [exec] [INFO] Finished at: Mon Jun 01 16:02:17 GMT-06:00 2009
     [exec] [INFO] Final Memory: 1M/14M
     [exec] [INFO] ------------------------------------------------------------------------
     [exec] 	at org.apache.maven.it.Verifier.executeGoals(Verifier.java:1275)
     [exec] 	at org.apache.maven.it.Verifier.executeGoal(Verifier.java:1128)
     [exec] 	at org.apache.maven.it.Verifier.executeGoal(Verifier.java:1122)
     [exec] 	at org.apache.maven.it.MavenITmng2591MergeInheritedPluginConfigTest.testit(MavenITmng2591MergeInheritedPluginConfigTest.java:70)
     [exec] 	at org.apache.maven.it.MavenITmng2591MergeInheritedPluginConfigTest.testitWithProfile(MavenITmng2591MergeInheritedPluginConfigTest.java:60)
     [exec] 	at sun.reflect.NativeMethodAccessorImpl.invoke0(Native Method)
     [exec] 	at sun.reflect.NativeMethodAccessorImpl.invoke(NativeMethodAccessorImpl.java:39)
     [exec] 	at sun.reflect.DelegatingMethodAccessorImpl.invoke(DelegatingMethodAccessorImpl.java:25)
     [exec] 	at java.lang.reflect.Method.invoke(Method.java:585)
     [exec] 	at junit.framework.TestCase.runTest(TestCase.java:164)
     [exec] 	at org.apache.maven.it.AbstractMavenIntegrationTestCase.runTest(AbstractMavenIntegrationTestCase.java:198)
     [exec] 	at junit.framework.TestCase.runBare(TestCase.java:130)
     [exec] 	at junit.framework.TestResult$1.protect(TestResult.java:106)
     [exec] 	at junit.framework.TestResult.runProtected(TestResult.java:124)
     [exec] 	at junit.framework.TestResult.run(TestResult.java:109)
     [exec] 	at junit.framework.TestCase.run(TestCase.java:120)
     [exec] 	at junit.framework.TestSuite.runTest(TestSuite.java:230)
     [exec] 	at junit.framework.TestSuite.run(TestSuite.java:225)
     [exec] 	at junit.framework.TestSuite.runTest(TestSuite.java:230)
     [exec] 	at junit.framework.TestSuite.run(TestSuite.java:225)
     [exec] 	at sun.reflect.NativeMethodAccessorImpl.invoke0(Native Method)
     [exec] 	at sun.reflect.NativeMethodAccessorImpl.invoke(NativeMethodAccessorImpl.java:39)
     [exec] 	at sun.reflect.DelegatingMethodAccessorImpl.invoke(DelegatingMethodAccessorImpl.java:25)
     [exec] 	at java.lang.reflect.Method.invoke(Method.java:585)
     [exec] 	at org.apache.maven.surefire.junit.JUnitTestSet.execute(JUnitTestSet.java:213)
     [exec] 	at org.apache.maven.surefire.suite.AbstractDirectoryTestSuite.executeTestSet(AbstractDirectoryTestSuite.java:140)
     [exec] 	at org.apache.maven.surefire.suite.AbstractDirectoryTestSuite.execute(AbstractDirectoryTestSuite.java:127)
     [exec] 	at org.apache.maven.surefire.Surefire.run(Surefire.java:177)
     [exec] 	at sun.reflect.NativeMethodAccessorImpl.invoke0(Native Method)
     [exec] 	at sun.reflect.NativeMethodAccessorImpl.invoke(NativeMethodAccessorImpl.java:39)
     [exec] 	at sun.reflect.DelegatingMethodAccessorImpl.invoke(DelegatingMethodAccessorImpl.java:25)
     [exec] 	at java.lang.reflect.Method.invoke(Method.java:585)
     [exec] 	at org.apache.maven.surefire.booter.SurefireBooter.runSuitesInProcess(SurefireBooter.java:345)
     [exec] 	at org.apache.maven.surefire.booter.SurefireBooter.run(SurefireBooter.java:241)
     [exec] 	at org.apache.maven.plugin.surefire.SurefirePlugin.execute(SurefirePlugin.java:537)
     [exec] 	at org.apache.maven.plugin.DefaultPluginManager.executeMojo(DefaultPluginManager.java:483)
     [exec] 	at org.apache.maven.lifecycle.DefaultLifecycleExecutor.executeGoals(DefaultLifecycleExecutor.java:678)
     [exec] 	at org.apache.maven.lifecycle.DefaultLifecycleExecutor.executeGoalWithLifecycle(DefaultLifecycleExecutor.java:540)
     [exec] 	at org.apache.maven.lifecycle.DefaultLifecycleExecutor.executeGoal(DefaultLifecycleExecutor.java:519)
     [exec] 	at org.apache.maven.lifecycle.DefaultLifecycleExecutor.executeGoalAndHandleFailures(DefaultLifecycleExecutor.java:371)
     [exec] 	at org.apache.maven.lifecycle.DefaultLifecycleExecutor.executeTaskSegments(DefaultLifecycleExecutor.java:332)
     [exec] 	at org.apache.maven.lifecycle.DefaultLifecycleExecutor.execute(DefaultLifecycleExecutor.java:181)
     [exec] 	at org.apache.maven.DefaultMaven.doExecute(DefaultMaven.java:356)
     [exec] 	at org.apache.maven.DefaultMaven.execute(DefaultMaven.java:137)
     [exec] 	at org.apache.maven.cli.MavenCli.main(MavenCli.java:356)
     [exec] 	at sun.reflect.NativeMethodAccessorImpl.invoke0(Native Method)
     [exec] 	at sun.reflect.NativeMethodAccessorImpl.invoke(NativeMethodAccessorImpl.java:39)
     [exec] 	at sun.reflect.DelegatingMethodAccessorImpl.invoke(DelegatingMethodAccessorImpl.java:25)
     [exec] 	at java.lang.reflect.Method.invoke(Method.java:585)
     [exec] 	at org.codehaus.classworlds.Launcher.launchEnhanced(Launcher.java:315)
     [exec] 	at org.codehaus.classworlds.Launcher.launch(Launcher.java:255)
     [exec] 	at org.codehaus.classworlds.Launcher.mainWithExitCode(Launcher.java:430)
     [exec] 	at org.codehaus.classworlds.Launcher.main(Launcher.java:375)
     [exec] Caused by: org.apache.maven.plugin.InvalidPluginException: Unable to build project
for plugin 'org.apache.maven.its.plugins:maven-it-plugin-configuration': Cannot find parent:
org.apache.maven.its:core-integration-testing for project: org.apache.maven.its.plugins:maven-it-plugins:pom:null
for project org.apache.maven.its.plugins:maven-it-plugins:pom:null
     [exec] 	at org.apache.maven.plugin.DefaultPluginManager.checkRequiredMavenVersion(DefaultPluginManager.java:286)
     [exec] 	at org.apache.maven.plugin.DefaultPluginManager.verifyVersionedPlugin(DefaultPluginManager.java:198)
     [exec] 	at org.apache.maven.plugin.DefaultPluginManager.verifyPlugin(DefaultPluginManager.java:177)
     [exec] 	at org.apache.maven.lifecycle.DefaultLifecycleExecutor.verifyPlugin(DefaultLifecycleExecutor.java:1517)
     [exec] 	... 17 more
     [exec] Caused by: org.apache.maven.project.ProjectBuildingException: Cannot find parent:
org.apache.maven.its:core-integration-testing for project: org.apache.maven.its.plugins:maven-it-plugins:pom:null
for project org.apache.maven.its.plugins:maven-it-plugins:pom:null
     [exec] 	at org.apache.maven.project.DefaultMavenProjectBuilder.assembleLineage(DefaultMavenProjectBuilder.java:1405)
     [exec] 	at org.apache.maven.project.DefaultMavenProjectBuilder.assembleLineage(DefaultMavenProjectBuilder.java:1416)
     [exec] 	at org.apache.maven.project.DefaultMavenProjectBuilder.buildInternal(DefaultMavenProjectBuilder.java:823)
     [exec] 	at org.apache.maven.project.DefaultMavenProjectBuilder.buildFromRepository(DefaultMavenProjectBuilder.java:255)
     [exec] 	at org.apache.maven.plugin.DefaultPluginManager.checkRequiredMavenVersion(DefaultPluginManager.java:270)
     [exec] 	... 20 more
     [exec] Caused by: org.apache.maven.project.ProjectBuildingException: Error getting POM
for 'org.apache.maven.its:core-integration-testing' from the repository: Unable to read local
copy of metadata: Cannot read metadata from '/opt/repos/bootstrap-maven-2.1.x/org/apache/maven/its/core-integration-testing/2.1-SNAPSHOT/maven-metadata-central.xml':
input contained no data
     [exec]   org.apache.maven.its:core-integration-testing:pom:2.1-SNAPSHOT
     [exec]  for project org.apache.maven.its:core-integration-testing
     [exec] 	at org.apache.maven.project.DefaultMavenProjectBuilder.findModelFromRepository(DefaultMavenProjectBuilder.java:592)
     [exec] 	at org.apache.maven.project.DefaultMavenProjectBuilder.assembleLineage(DefaultMavenProjectBuilder.java:1401)
     [exec] 	... 24 more
     [exec] Caused by: org.apache.maven.artifact.resolver.ArtifactResolutionException: Unable
to read local copy of metadata: Cannot read metadata from '/opt/repos/bootstrap-maven-2.1.x/org/apache/maven/its/core-integration-testing/2.1-SNAPSHOT/maven-metadata-central.xml':
input contained no data
     [exec]   org.apache.maven.its:core-integration-testing:pom:2.1-SNAPSHOT
     [exec] 	at org.apache.maven.artifact.transform.SnapshotTransformation.transformForResolve(SnapshotTransformation.java:68)
     [exec] 	at org.apache.maven.artifact.transform.DefaultArtifactTransformationManager.transformForResolve(DefaultArtifactTransformationManager.java:55)
     [exec] 	at org.apache.maven.artifact.resolver.DefaultArtifactResolver.resolve(DefaultArtifactResolver.java:145)
     [exec] 	at org.apache.maven.artifact.resolver.DefaultArtifactResolver.resolve(DefaultArtifactResolver.java:90)
     [exec] 	at org.apache.maven.project.DefaultMavenProjectBuilder.findModelFromRepository(DefaultMavenProjectBuilder.java:558)
     [exec] 	... 25 more
     [exec] Caused by: org.apache.maven.artifact.repository.metadata.RepositoryMetadataResolutionException:
Unable to read local copy of metadata: Cannot read metadata from '/opt/repos/bootstrap-maven-2.1.x/org/apache/maven/its/core-integration-testing/2.1-SNAPSHOT/maven-metadata-central.xml':
input contained no data
     [exec] 	at org.apache.maven.artifact.repository.metadata.DefaultRepositoryMetadataManager.resolve(DefaultRepositoryMetadataManager.java:175)
     [exec] 	at org.apache.maven.artifact.transform.AbstractVersionTransformation.resolveVersion(AbstractVersionTransformation.java:65)
     [exec] 	at org.apache.maven.artifact.transform.SnapshotTransformation.transformForResolve(SnapshotTransformation.java:63)
     [exec] 	... 29 more
     [exec] Caused by: org.apache.maven.artifact.repository.metadata.RepositoryMetadataReadException:
Cannot read metadata from '/opt/repos/bootstrap-maven-2.1.x/org/apache/maven/its/core-integration-testing/2.1-SNAPSHOT/maven-metadata-central.xml':
input contained no data
     [exec] 	at org.apache.maven.artifact.repository.metadata.DefaultRepositoryMetadataManager.readMetadata(DefaultRepositoryMetadataManager.java:318)
     [exec] 	at org.apache.maven.artifact.repository.metadata.DefaultRepositoryMetadataManager.loadMetadata(DefaultRepositoryMetadataManager.java:275)
     [exec] 	at org.apache.maven.artifact.repository.metadata.DefaultRepositoryMetadataManager.mergeMetadata(DefaultRepositoryMetadataManager.java:198)
     [exec] 	at org.apache.maven.artifact.repository.metadata.DefaultRepositoryMetadataManager.resolve(DefaultRepositoryMetadataManager.java:166)
     [exec] 	... 31 more
     [exec] Caused by: java.io.EOFException: input contained no data
     [exec] 	at hidden.org.codehaus.plexus.util.xml.pull.MXParser.fillBuf(MXParser.java:2982)
     [exec] 	at hidden.org.codehaus.plexus.util.xml.pull.MXParser.more(MXParser.java:3025)
     [exec] 	at hidden.org.codehaus.plexus.util.xml.pull.MXParser.parseProlog(MXParser.java:1410)
     [exec] 	at hidden.org.codehaus.plexus.util.xml.pull.MXParser.nextImpl(MXParser.java:1395)
     [exec] 	at hidden.org.codehaus.plexus.util.xml.pull.MXParser.next(MXParser.java:1093)
     [exec] 	at org.apache.maven.artifact.repository.metadata.io.xpp3.MetadataXpp3Reader.read(MetadataXpp3Reader.java:949)
     [exec] 	at org.apache.maven.artifact.repository.metadata.DefaultRepositoryMetadataManager.readMetadata(DefaultRepositoryMetadataManager.java:310)
     [exec] 	... 34 more
     [exec] [INFO] ------------------------------------------------------------------------
     [exec] [INFO] Total time: 1 second
     [exec] [INFO] Finished at: Mon Jun 01 16:02:17 GMT-06:00 2009
     [exec] [INFO] Final Memory: 1M/14M
     [exec] [INFO] ------------------------------------------------------------------------
     [exec] 	at org.apache.maven.it.Verifier.executeGoals(Verifier.java:1275)
     [exec] 	at org.apache.maven.it.Verifier.executeGoal(Verifier.java:1128)
     [exec] 	at org.apache.maven.it.Verifier.executeGoal(Verifier.java:1122)
     [exec] 	at org.apache.maven.it.MavenITmng2591MergeInheritedPluginConfigTest.testit(MavenITmng2591MergeInheritedPluginConfigTest.java:70)
     [exec] 	at org.apache.maven.it.MavenITmng2591MergeInheritedPluginConfigTest.testitWithProfile(MavenITmng2591MergeInheritedPluginConfigTest.java:60)
     [exec] 	at sun.reflect.NativeMethodAccessorImpl.invoke0(Native Method)
     [exec] 	at sun.reflect.NativeMethodAccessorImpl.invoke(NativeMethodAccessorImpl.java:39)
     [exec] 	at sun.reflect.DelegatingMethodAccessorImpl.invoke(DelegatingMethodAccessorImpl.java:25)
     [exec] 	at java.lang.reflect.Method.invoke(Method.java:585)
     [exec] 	at junit.framework.TestCase.runTest(TestCase.java:164)
     [exec] 	at org.apache.maven.it.AbstractMavenIntegrationTestCase.runTest(AbstractMavenIntegrationTestCase.java:198)
     [exec] 	at junit.framework.TestCase.runBare(TestCase.java:130)
     [exec] 	at junit.framework.TestResult$1.protect(TestResult.java:106)
     [exec] 	at junit.framework.TestResult.runProtected(TestResult.java:124)
     [exec] 	at junit.framework.TestResult.run(TestResult.java:109)
     [exec] 	at junit.framework.TestCase.run(TestCase.java:120)
     [exec] 	at junit.framework.TestSuite.runTest(TestSuite.java:230)
     [exec] 	at junit.framework.TestSuite.run(TestSuite.java:225)
     [exec] 	at junit.framework.TestSuite.runTest(TestSuite.java:230)
     [exec] 	at junit.framework.TestSuite.run(TestSuite.java:225)
     [exec] 	at sun.reflect.NativeMethodAccessorImpl.invoke0(Native Method)
     [exec] 	at sun.reflect.NativeMethodAccessorImpl.invoke(NativeMethodAccessorImpl.java:39)
     [exec] 	at sun.reflect.DelegatingMethodAccessorImpl.invoke(DelegatingMethodAccessorImpl.java:25)
     [exec] 	at java.lang.reflect.Method.invoke(Method.java:585)
     [exec] 	at org.apache.maven.surefire.junit.JUnitTestSet.execute(JUnitTestSet.java:213)
     [exec] 	at org.apache.maven.surefire.suite.AbstractDirectoryTestSuite.executeTestSet(AbstractDirectoryTestSuite.java:140)
     [exec] 	at org.apache.maven.surefire.suite.AbstractDirectoryTestSuite.execute(AbstractDirectoryTestSuite.java:127)
     [exec] 	at org.apache.maven.surefire.Surefire.run(Surefire.java:177)
     [exec] 	at sun.reflect.NativeMethodAccessorImpl.invoke0(Native Method)
     [exec] 	at sun.reflect.NativeMethodAccessorImpl.invoke(NativeMethodAccessorImpl.java:39)
     [exec] 	at sun.reflect.DelegatingMethodAccessorImpl.invoke(DelegatingMethodAccessorImpl.java:25)
     [exec] 	at java.lang.reflect.Method.invoke(Method.java:585)
     [exec] 	at org.apache.maven.surefire.booter.SurefireBooter.runSuitesInProcess(SurefireBooter.java:345)
     [exec] 	at org.apache.maven.surefire.booter.SurefireBooter.run(SurefireBooter.java:241)
     [exec] 	at org.apache.maven.plugin.surefire.SurefirePlugin.execute(SurefirePlugin.java:537)
     [exec] 	at org.apache.maven.plugin.DefaultPluginManager.executeMojo(DefaultPluginManager.java:483)
     [exec] 	at org.apache.maven.lifecycle.DefaultLifecycleExecutor.executeGoals(DefaultLifecycleExecutor.java:678)
     [exec] 	at org.apache.maven.lifecycle.DefaultLifecycleExecutor.executeGoalWithLifecycle(DefaultLifecycleExecutor.java:540)
     [exec] 	at org.apache.maven.lifecycle.DefaultLifecycleExecutor.executeGoal(DefaultLifecycleExecutor.java:519)
     [exec] 	at org.apache.maven.lifecycle.DefaultLifecycleExecutor.executeGoalAndHandleFailures(DefaultLifecycleExecutor.java:371)
     [exec] 	at org.apache.maven.lifecycle.DefaultLifecycleExecutor.executeTaskSegments(DefaultLifecycleExecutor.java:332)
     [exec] 	at org.apache.maven.lifecycle.DefaultLifecycleExecutor.execute(DefaultLifecycleExecutor.java:181)
     [exec] 	at org.apache.maven.DefaultMaven.doExecute(DefaultMaven.java:356)
     [exec] 	at org.apache.maven.DefaultMaven.execute(DefaultMaven.java:137)
     [exec] 	at org.apache.maven.cli.MavenCli.main(MavenCli.java:356)
     [exec] 	at sun.reflect.NativeMethodAccessorImpl.invoke0(Native Method)
     [exec] 	at sun.reflect.NativeMethodAccessorImpl.invoke(NativeMethodAccessorImpl.java:39)
     [exec] 	at sun.reflect.DelegatingMethodAccessorImpl.invoke(DelegatingMethodAccessorImpl.java:25)
     [exec] 	at java.lang.reflect.Method.invoke(Method.java:585)
     [exec] 	at org.codehaus.classworlds.Launcher.launchEnhanced(Launcher.java:315)
     [exec] 	at org.codehaus.classworlds.Launcher.launch(Launcher.java:255)
     [exec] 	at org.codehaus.classworlds.Launcher.mainWithExitCode(Launcher.java:430)
     [exec] 	at org.codehaus.classworlds.Launcher.main(Launcher.java:375)
     [exec] 
     [exec] 
     [exec] Results :
     [exec] 
     [exec] Failed tests: 
     [exec]   testIt(org.apache.maven.it.MavenITmng4167PluginAndCoordXFormPOMTest)
     [exec] 
     [exec] Tests in error: 
     [exec]   testitWithProfile(org.apache.maven.it.MavenITmng2591MergeInheritedPluginConfigTest)
     [exec] 
     [exec] Tests run: 376, Failures: 1, Errors: 1, Skipped: 0
     [exec] 
     [exec] [INFO] ------------------------------------------------------------------------
     [exec] [ERROR] BUILD FAILURE
     [exec] [INFO] ------------------------------------------------------------------------
     [exec] [INFO] There are test failures.
     [exec] 
     [exec] Please refer to /tmp/maven-integration-tests-2.2.x/core-it-suite/target/surefire-reports
for the individual test results.
     [exec] [INFO] ------------------------------------------------------------------------
     [exec] [INFO] Trace
     [exec] org.apache.maven.BuildFailureException: There are test failures.
     [exec] 
     [exec] Please refer to /tmp/maven-integration-tests-2.2.x/core-it-suite/target/surefire-reports
for the individual test results.
     [exec] 	at org.apache.maven.lifecycle.DefaultLifecycleExecutor.executeGoals(DefaultLifecycleExecutor.java:699)
     [exec] 	at org.apache.maven.lifecycle.DefaultLifecycleExecutor.executeGoalWithLifecycle(DefaultLifecycleExecutor.java:540)
     [exec] 	at org.apache.maven.lifecycle.DefaultLifecycleExecutor.executeGoal(DefaultLifecycleExecutor.java:519)
     [exec] 	at org.apache.maven.lifecycle.DefaultLifecycleExecutor.executeGoalAndHandleFailures(DefaultLifecycleExecutor.java:371)
     [exec] 	at org.apache.maven.lifecycle.DefaultLifecycleExecutor.executeTaskSegments(DefaultLifecycleExecutor.java:332)
     [exec] 	at org.apache.maven.lifecycle.DefaultLifecycleExecutor.execute(DefaultLifecycleExecutor.java:181)
     [exec] 	at org.apache.maven.DefaultMaven.doExecute(DefaultMaven.java:356)
     [exec] 	at org.apache.maven.DefaultMaven.execute(DefaultMaven.java:137)
     [exec] 	at org.apache.maven.cli.MavenCli.main(MavenCli.java:356)
     [exec] 	at sun.reflect.NativeMethodAccessorImpl.invoke0(Native Method)
     [exec] 	at sun.reflect.NativeMethodAccessorImpl.invoke(NativeMethodAccessorImpl.java:39)
     [exec] 	at sun.reflect.DelegatingMethodAccessorImpl.invoke(DelegatingMethodAccessorImpl.java:25)
     [exec] 	at java.lang.reflect.Method.invoke(Method.java:585)
     [exec] 	at org.codehaus.classworlds.Launcher.launchEnhanced(Launcher.java:315)
     [exec] 	at org.codehaus.classworlds.Launcher.launch(Launcher.java:255)
     [exec] 	at org.codehaus.classworlds.Launcher.mainWithExitCode(Launcher.java:430)
     [exec] 	at org.codehaus.classworlds.Launcher.main(Launcher.java:375)
     [exec] Caused by: org.apache.maven.plugin.MojoFailureException: There are test failures.
     [exec] 
     [exec] Please refer to /tmp/maven-integration-tests-2.2.x/core-it-suite/target/surefire-reports
for the individual test results.
     [exec] 	at org.apache.maven.plugin.surefire.SurefirePlugin.execute(SurefirePlugin.java:575)
     [exec] 	at org.apache.maven.plugin.DefaultPluginManager.executeMojo(DefaultPluginManager.java:483)
     [exec] 	at org.apache.maven.lifecycle.DefaultLifecycleExecutor.executeGoals(DefaultLifecycleExecutor.java:678)
     [exec] 	... 16 more
     [exec] [INFO] ------------------------------------------------------------------------
     [exec] [INFO] Total time: 33 minutes 46 seconds
     [exec] [INFO] Finished at: Mon Jun 01 16:07:58 GMT-06:00 2009
     [exec] [INFO] Final Memory: 32M/83M
     [exec] [INFO] ------------------------------------------------------------------------

BUILD FAILED
/home/hudson/workspace/Maven-2.2.x-bootstrap/jdk/1.5/label/ubuntu/maven-2.2.x/build.xml:291:
exec returned: 1

Total time: 38 minutes 1 second
Archiving artifacts


Mime
View raw message