maven-notifications mailing list archives

Site index · List index
Message view « Date » · « Thread »
Top « Date » · « Thread »
From Hudson <Hud...@sonatype.org>
Subject Build failed in Hudson: maven-shared » 1.5,windows #87
Date Fri, 19 Jun 2009 18:03:20 GMT
See http://grid.sonatype.org/ci/job/maven-shared/./jdk=1.5,label=windows/87/

------------------------------------------
[...truncated 2806 lines...]
[INFO] Retrieving previous build number from apache.snapshots.https
[INFO] repository metadata for: 'snapshot org.apache.maven.shared:maven-web-ui-tests:1.0-SNAPSHOT'
could not be found on repository: apache.snapshots.https, so will be created
Uploading: file:/opt/repos/deploy-junk/org/apache/maven/shared/maven-web-ui-tests/1.0-SNAPSHOT/maven-web-ui-tests-1.0-20090619.175535-1.jar
15K uploaded
[INFO] Uploading project information for maven-web-ui-tests 1.0-20090619.175535-1
[INFO] Retrieving previous metadata from apache.snapshots.https
[INFO] repository metadata for: 'snapshot org.apache.maven.shared:maven-web-ui-tests:1.0-SNAPSHOT'
could not be found on repository: apache.snapshots.https, so will be created
[INFO] Uploading repository metadata for: 'snapshot org.apache.maven.shared:maven-web-ui-tests:1.0-SNAPSHOT'
[INFO] Retrieving previous metadata from apache.snapshots.https
[INFO] repository metadata for: 'artifact org.apache.maven.shared:maven-web-ui-tests' could
not be found on repository: apache.snapshots.https, so will be created
[INFO] Uploading repository metadata for: 'artifact org.apache.maven.shared:maven-web-ui-tests'
[INFO] 
[INFO] 
[INFO] ------------------------------------------------------------------------
[INFO] Reactor Summary:
[INFO] ------------------------------------------------------------------------
[INFO] Maven Shared Components ............................... SUCCESS [58.132s]
[INFO] Maven Shared I/O API .................................. SUCCESS [30.778s]
[INFO] Maven File Management API ............................. SUCCESS [27.789s]
[INFO] Maven Ant ............................................. SUCCESS [6.532s]
[INFO] Maven Applications Shared Configuration ............... SUCCESS [15.404s]
[INFO] Maven Shared Application Configuration Model .......... SUCCESS [14.841s]
[INFO] Maven Shared Application Configuration Web Components . SUCCESS [14.437s]
[INFO] Maven Archiver ........................................ SUCCESS [13.193s]
[INFO] Maven Common Artifact Filters ......................... SUCCESS [12.980s]
[INFO] Maven Dependency Analyzer ............................. SUCCESS [1:04.057s]
[INFO] Maven Dependency Tree ................................. SUCCESS [13.655s]
[INFO] Maven Downloader ...................................... SUCCESS [2.650s]
[INFO] Maven Doxia Integration Tools ......................... SUCCESS [12.136s]
[INFO] Maven Filtering ....................................... SUCCESS [13.081s]
[INFO] Maven Invoker ......................................... SUCCESS [1:08.262s]
[INFO] Maven Model Converter ................................. SUCCESS [14.609s]
[INFO] Maven OSGi integration ................................ SUCCESS [6.143s]
[INFO] Maven Reporting Implementation ........................ FAILED [7.807s]
[INFO] Maven Repository Builder .............................. SUCCESS [9.537s]
[INFO] Maven Runtime ......................................... SUCCESS [54.399s]
[INFO] Maven JAR Utilities ................................... SUCCESS [18.781s]
[INFO] Maven Shared Monitor API .............................. SUCCESS [6.218s]
[INFO] Maven Verifier Component .............................. SUCCESS [5.860s]
[INFO] Maven Shared Web UI tests ............................. SUCCESS [4.808s]
[INFO] ------------------------------------------------------------------------
[INFO] Error for project: Maven Reporting Implementation (during deploy)
[INFO] ------------------------------------------------------------------------
[INFO] Failed to resolve artifact.

Missing:
----------
1) org.apache.maven.doxia:doxia-core:jar:1.1.1

  Try downloading the file manually from the project website.

  Then, install it using the command: 
      mvn install:install-file -DgroupId=org.apache.maven.doxia -DartifactId=doxia-core -Dversion=1.1.1
-Dpackaging=jar -Dfile=/path/to/file

  Alternatively, if you host your own repository you can deploy the file there: 
      mvn deploy:deploy-file -DgroupId=org.apache.maven.doxia -DartifactId=doxia-core -Dversion=1.1.1
-Dpackaging=jar -Dfile=/path/to/file -Durl=[url] -DrepositoryId=[id]

  Path to dependency: 
  	1) org.apache.maven.reporting:maven-reporting-impl:jar:2.1-SNAPSHOT
  	2) org.apache.maven.doxia:doxia-site-renderer:jar:1.1.1-SNAPSHOT
  	3) org.apache.maven.doxia:doxia-core:jar:1.1.1

2) org.apache.maven.doxia:doxia-module-xhtml:jar:1.1.1

  Try downloading the file manually from the project website.

  Then, install it using the command: 
      mvn install:install-file -DgroupId=org.apache.maven.doxia -DartifactId=doxia-module-xhtml
-Dversion=1.1.1 -Dpackaging=jar -Dfile=/path/to/file

  Alternatively, if you host your own repository you can deploy the file there: 
      mvn deploy:deploy-file -DgroupId=org.apache.maven.doxia -DartifactId=doxia-module-xhtml
-Dversion=1.1.1 -Dpackaging=jar -Dfile=/path/to/file -Durl=[url] -DrepositoryId=[id]

  Path to dependency: 
  	1) org.apache.maven.reporting:maven-reporting-impl:jar:2.1-SNAPSHOT
  	2) org.apache.maven.doxia:doxia-site-renderer:jar:1.1.1-SNAPSHOT
  	3) org.apache.maven.doxia:doxia-module-xhtml:jar:1.1.1

3) org.apache.maven.doxia:doxia-module-fml:jar:1.1.1

  Try downloading the file manually from the project website.

  Then, install it using the command: 
      mvn install:install-file -DgroupId=org.apache.maven.doxia -DartifactId=doxia-module-fml
-Dversion=1.1.1 -Dpackaging=jar -Dfile=/path/to/file

  Alternatively, if you host your own repository you can deploy the file there: 
      mvn deploy:deploy-file -DgroupId=org.apache.maven.doxia -DartifactId=doxia-module-fml
-Dversion=1.1.1 -Dpackaging=jar -Dfile=/path/to/file -Durl=[url] -DrepositoryId=[id]

  Path to dependency: 
  	1) org.apache.maven.reporting:maven-reporting-impl:jar:2.1-SNAPSHOT
  	2) org.apache.maven.doxia:doxia-site-renderer:jar:1.1.1-SNAPSHOT
  	3) org.apache.maven.doxia:doxia-module-fml:jar:1.1.1

----------
3 required artifacts are missing.

for artifact: 
  org.apache.maven.reporting:maven-reporting-impl:jar:2.1-SNAPSHOT

from the specified remote repositories:
  Nexus (http://repository.sonatype.org:8081/content/groups/sonatype-grid)



[INFO] ------------------------------------------------------------------------
[INFO] Trace
org.apache.maven.lifecycle.LifecycleExecutionException: Missing:
----------
1) org.apache.maven.doxia:doxia-core:jar:1.1.1

  Try downloading the file manually from the project website.

  Then, install it using the command: 
      mvn install:install-file -DgroupId=org.apache.maven.doxia -DartifactId=doxia-core -Dversion=1.1.1
-Dpackaging=jar -Dfile=/path/to/file

  Alternatively, if you host your own repository you can deploy the file there: 
      mvn deploy:deploy-file -DgroupId=org.apache.maven.doxia -DartifactId=doxia-core -Dversion=1.1.1
-Dpackaging=jar -Dfile=/path/to/file -Durl=[url] -DrepositoryId=[id]

  Path to dependency: 
  	1) org.apache.maven.reporting:maven-reporting-impl:jar:2.1-SNAPSHOT
  	2) org.apache.maven.doxia:doxia-site-renderer:jar:1.1.1-SNAPSHOT
  	3) org.apache.maven.doxia:doxia-core:jar:1.1.1

2) org.apache.maven.doxia:doxia-module-xhtml:jar:1.1.1

  Try downloading the file manually from the project website.

  Then, install it using the command: 
      mvn install:install-file -DgroupId=org.apache.maven.doxia -DartifactId=doxia-module-xhtml
-Dversion=1.1.1 -Dpackaging=jar -Dfile=/path/to/file

  Alternatively, if you host your own repository you can deploy the file there: 
      mvn deploy:deploy-file -DgroupId=org.apache.maven.doxia -DartifactId=doxia-module-xhtml
-Dversion=1.1.1 -Dpackaging=jar -Dfile=/path/to/file -Durl=[url] -DrepositoryId=[id]

  Path to dependency: 
  	1) org.apache.maven.reporting:maven-reporting-impl:jar:2.1-SNAPSHOT
  	2) org.apache.maven.doxia:doxia-site-renderer:jar:1.1.1-SNAPSHOT
  	3) org.apache.maven.doxia:doxia-module-xhtml:jar:1.1.1

3) org.apache.maven.doxia:doxia-module-fml:jar:1.1.1

  Try downloading the file manually from the project website.

  Then, install it using the command: 
      mvn install:install-file -DgroupId=org.apache.maven.doxia -DartifactId=doxia-module-fml
-Dversion=1.1.1 -Dpackaging=jar -Dfile=/path/to/file

  Alternatively, if you host your own repository you can deploy the file there: 
      mvn deploy:deploy-file -DgroupId=org.apache.maven.doxia -DartifactId=doxia-module-fml
-Dversion=1.1.1 -Dpackaging=jar -Dfile=/path/to/file -Durl=[url] -DrepositoryId=[id]

  Path to dependency: 
  	1) org.apache.maven.reporting:maven-reporting-impl:jar:2.1-SNAPSHOT
  	2) org.apache.maven.doxia:doxia-site-renderer:jar:1.1.1-SNAPSHOT
  	3) org.apache.maven.doxia:doxia-module-fml:jar:1.1.1

----------
3 required artifacts are missing.

for artifact: 
  org.apache.maven.reporting:maven-reporting-impl:jar:2.1-SNAPSHOT

from the specified remote repositories:
  Nexus (http://repository.sonatype.org:8081/content/groups/sonatype-grid)


	at org.apache.maven.lifecycle.DefaultLifecycleExecutor.executeGoals(DefaultLifecycleExecutor.java:693)
	at org.apache.maven.lifecycle.DefaultLifecycleExecutor.executeGoalWithLifecycle(DefaultLifecycleExecutor.java:538)
	at org.apache.maven.lifecycle.DefaultLifecycleExecutor.executeGoal(DefaultLifecycleExecutor.java:517)
	at org.apache.maven.lifecycle.DefaultLifecycleExecutor.executeGoalAndHandleFailures(DefaultLifecycleExecutor.java:369)
	at org.apache.maven.lifecycle.DefaultLifecycleExecutor.executeTaskSegments(DefaultLifecycleExecutor.java:330)
	at org.apache.maven.lifecycle.DefaultLifecycleExecutor.execute(DefaultLifecycleExecutor.java:181)
	at org.apache.maven.DefaultMaven.doExecute(DefaultMaven.java:336)
	at org.apache.maven.DefaultMaven.execute(DefaultMaven.java:129)
	at org.apache.maven.cli.MavenCli.main(MavenCli.java:302)
	at sun.reflect.NativeMethodAccessorImpl.invoke0(Native Method)
	at sun.reflect.NativeMethodAccessorImpl.invoke(NativeMethodAccessorImpl.java:39)
	at sun.reflect.DelegatingMethodAccessorImpl.invoke(DelegatingMethodAccessorImpl.java:25)
	at java.lang.reflect.Method.invoke(Method.java:585)
	at org.codehaus.classworlds.Launcher.launchEnhanced(Launcher.java:315)
	at org.codehaus.classworlds.Launcher.launch(Launcher.java:255)
	at org.codehaus.classworlds.Launcher.mainWithExitCode(Launcher.java:430)
	at org.codehaus.classworlds.Launcher.main(Launcher.java:375)
Caused by: org.apache.maven.artifact.resolver.MultipleArtifactsNotFoundException: Missing:
----------
1) org.apache.maven.doxia:doxia-core:jar:1.1.1

  Try downloading the file manually from the project website.

  Then, install it using the command: 
      mvn install:install-file -DgroupId=org.apache.maven.doxia -DartifactId=doxia-core -Dversion=1.1.1
-Dpackaging=jar -Dfile=/path/to/file

  Alternatively, if you host your own repository you can deploy the file there: 
      mvn deploy:deploy-file -DgroupId=org.apache.maven.doxia -DartifactId=doxia-core -Dversion=1.1.1
-Dpackaging=jar -Dfile=/path/to/file -Durl=[url] -DrepositoryId=[id]

  Path to dependency: 
  	1) org.apache.maven.reporting:maven-reporting-impl:jar:2.1-SNAPSHOT
  	2) org.apache.maven.doxia:doxia-site-renderer:jar:1.1.1-SNAPSHOT
  	3) org.apache.maven.doxia:doxia-core:jar:1.1.1

2) org.apache.maven.doxia:doxia-module-xhtml:jar:1.1.1

  Try downloading the file manually from the project website.

  Then, install it using the command: 
      mvn install:install-file -DgroupId=org.apache.maven.doxia -DartifactId=doxia-module-xhtml
-Dversion=1.1.1 -Dpackaging=jar -Dfile=/path/to/file

  Alternatively, if you host your own repository you can deploy the file there: 
      mvn deploy:deploy-file -DgroupId=org.apache.maven.doxia -DartifactId=doxia-module-xhtml
-Dversion=1.1.1 -Dpackaging=jar -Dfile=/path/to/file -Durl=[url] -DrepositoryId=[id]

  Path to dependency: 
  	1) org.apache.maven.reporting:maven-reporting-impl:jar:2.1-SNAPSHOT
  	2) org.apache.maven.doxia:doxia-site-renderer:jar:1.1.1-SNAPSHOT
  	3) org.apache.maven.doxia:doxia-module-xhtml:jar:1.1.1

3) org.apache.maven.doxia:doxia-module-fml:jar:1.1.1

  Try downloading the file manually from the project website.

  Then, install it using the command: 
      mvn install:install-file -DgroupId=org.apache.maven.doxia -DartifactId=doxia-module-fml
-Dversion=1.1.1 -Dpackaging=jar -Dfile=/path/to/file

  Alternatively, if you host your own repository you can deploy the file there: 
      mvn deploy:deploy-file -DgroupId=org.apache.maven.doxia -DartifactId=doxia-module-fml
-Dversion=1.1.1 -Dpackaging=jar -Dfile=/path/to/file -Durl=[url] -DrepositoryId=[id]

  Path to dependency: 
  	1) org.apache.maven.reporting:maven-reporting-impl:jar:2.1-SNAPSHOT
  	2) org.apache.maven.doxia:doxia-site-renderer:jar:1.1.1-SNAPSHOT
  	3) org.apache.maven.doxia:doxia-module-fml:jar:1.1.1

----------
3 required artifacts are missing.

for artifact: 
  org.apache.maven.reporting:maven-reporting-impl:jar:2.1-SNAPSHOT

from the specified remote repositories:
  Nexus (http://repository.sonatype.org:8081/content/groups/sonatype-grid)


	at org.apache.maven.artifact.resolver.DefaultArtifactResolver.resolveTransitively(DefaultArtifactResolver.java:324)
	at org.apache.maven.artifact.resolver.DefaultArtifactResolver.resolveTransitively(DefaultArtifactResolver.java:288)
	at org.apache.maven.plugin.DefaultPluginManager.resolveTransitiveDependencies(DefaultPluginManager.java:1440)
	at org.apache.maven.plugin.DefaultPluginManager.executeMojo(DefaultPluginManager.java:410)
	at org.apache.maven.lifecycle.DefaultLifecycleExecutor.executeGoals(DefaultLifecycleExecutor.java:676)
	... 16 more
[INFO] ------------------------------------------------------------------------
[INFO] BUILD ERRORS
[INFO] ------------------------------------------------------------------------
[INFO] Total time: 8 minutes 21 seconds
[INFO] Finished at: Fri Jun 19 11:02:56 PDT 2009
[INFO] Final Memory: 48M/87M
[INFO] ------------------------------------------------------------------------


Mime
View raw message