maven-notifications mailing list archives

Site index · List index
Message view « Date » · « Thread »
Top « Date » · « Thread »
From Hudson <Hud...@sonatype.org>
Subject Build failed in Hudson: maven-core-integration-testing » 1.5,jeos1 #320
Date Wed, 17 Jun 2009 21:06:07 GMT
See http://grid.sonatype.org/ci/job/maven-core-integration-testing/./jdk=1.5,label=jeos1/320/changes

Changes:

[John Casey] [MNG-4207] Adding IT to the suite.

[John Casey] [MNG-4207] Adding IT plugin that depends on log4j, and integration test to verify
non-lightweight http wagon can shade commons-logging and log4j properly

[Benjamin Bentmann] [MNG-4208] [regression] CLI properties can't override project properties
during interpolation

o Added IT

[Benjamin Bentmann] o Decoupled IT from assumption that reporting config => build config

------------------------------------------
[...truncated 147 lines...]
[INFO] [surefire:test]
[INFO] Tests are skipped.
[INFO] [jar:jar]
[INFO] Building jar: /home/hudson/workspace/maven-core-integration-testing/jdk/1.5/label/jeos1/maven-its/core-it-support/core-it-plugins/maven-it-plugin-active-collection/target/maven-it-plugin-active-collection-2.1-SNAPSHOT.jar
[INFO] [plugin:addPluginArtifactMetadata]
[INFO] [install:install]
[INFO] Installing /home/hudson/workspace/maven-core-integration-testing/jdk/1.5/label/jeos1/maven-its/core-it-support/core-it-plugins/maven-it-plugin-active-collection/target/maven-it-plugin-active-collection-2.1-SNAPSHOT.jar
to /opt/repos/local-repository/org/apache/maven/its/plugins/maven-it-plugin-active-collection/2.1-SNAPSHOT/maven-it-plugin-active-collection-2.1-SNAPSHOT.jar
[INFO] [plugin:updateRegistry]
[INFO] [deploy:deploy]
[INFO] Retrieving previous build number from maven.it
Uploading: http://repository.sonatype.org:8081/content/repositories/maven.snapshots/org/apache/maven/its/plugins/maven-it-plugin-active-collection/2.1-SNAPSHOT/maven-it-plugin-active-collection-2.1-20090617.210553-134.jar
10K uploaded  (maven-it-plugin-active-collection-2.1-20090617.210553-134.jar)
[INFO] Retrieving previous metadata from maven.it
[INFO] Uploading repository metadata for: 'snapshot org.apache.maven.its.plugins:maven-it-plugin-active-collection:2.1-SNAPSHOT'
[INFO] Retrieving previous metadata from maven.it
[INFO] Uploading repository metadata for: 'artifact org.apache.maven.its.plugins:maven-it-plugin-active-collection'
[INFO] Uploading project information for maven-it-plugin-active-collection 2.1-20090617.210553-134
[INFO] Retrieving previous metadata from maven.it
[INFO] Uploading repository metadata for: 'org.apache.maven.its.plugins'
[INFO] ------------------------------------------------------------------------
[INFO] Building Maven Integration Test Plugin :: Artifact
[INFO]    task-segment: [clean, deploy]
[INFO] ------------------------------------------------------------------------
[INFO] [clean:clean]
[INFO] Deleting file set: /home/hudson/workspace/maven-core-integration-testing/jdk/1.5/label/jeos1/maven-its/core-it-support/core-it-plugins/maven-it-plugin-artifact/target
(included: [**], excluded: [])
[INFO] [plugin:descriptor]
[INFO] Using 2 extractors.
[INFO] Applying extractor for language: java
[INFO] Extractor for language: java found 6 mojo descriptors.
[INFO] Applying extractor for language: bsh
[INFO] Extractor for language: bsh found 0 mojo descriptors.
[INFO] [remote-resources:process {execution: default}]
[INFO] [resources:resources]
[INFO] Using 'UTF-8' encoding to copy filtered resources.
[INFO] skip non existing resourceDirectory /home/hudson/workspace/maven-core-integration-testing/jdk/1.5/label/jeos1/maven-its/core-it-support/core-it-plugins/maven-it-plugin-artifact/src/main/resources
[INFO] Copying 3 resources
[INFO] [compiler:compile]
[INFO] Compiling 7 source files to /home/hudson/workspace/maven-core-integration-testing/jdk/1.5/label/jeos1/maven-its/core-it-support/core-it-plugins/maven-it-plugin-artifact/target/classes
[INFO] [resources:testResources]
[INFO] Using 'UTF-8' encoding to copy filtered resources.
[INFO] skip non existing resourceDirectory /home/hudson/workspace/maven-core-integration-testing/jdk/1.5/label/jeos1/maven-its/core-it-support/core-it-plugins/maven-it-plugin-artifact/src/test/resources
[INFO] Copying 3 resources
[INFO] [compiler:testCompile]
[INFO] Not compiling test sources
[INFO] [surefire:test]
[INFO] Tests are skipped.
[INFO] [jar:jar]
[INFO] Building jar: /home/hudson/workspace/maven-core-integration-testing/jdk/1.5/label/jeos1/maven-its/core-it-support/core-it-plugins/maven-it-plugin-artifact/target/maven-it-plugin-artifact-2.1-SNAPSHOT.jar
[INFO] [plugin:addPluginArtifactMetadata]
[INFO] [install:install]
[INFO] Installing /home/hudson/workspace/maven-core-integration-testing/jdk/1.5/label/jeos1/maven-its/core-it-support/core-it-plugins/maven-it-plugin-artifact/target/maven-it-plugin-artifact-2.1-SNAPSHOT.jar
to /opt/repos/local-repository/org/apache/maven/its/plugins/maven-it-plugin-artifact/2.1-SNAPSHOT/maven-it-plugin-artifact-2.1-SNAPSHOT.jar
[INFO] [plugin:updateRegistry]
[INFO] [deploy:deploy]
[INFO] Retrieving previous build number from maven.it
Uploading: http://repository.sonatype.org:8081/content/repositories/maven.snapshots/org/apache/maven/its/plugins/maven-it-plugin-artifact/2.1-SNAPSHOT/maven-it-plugin-artifact-2.1-20090617.210553-325.jar
16K uploaded  (maven-it-plugin-artifact-2.1-20090617.210553-325.jar)
[INFO] Retrieving previous metadata from maven.it
[INFO] Uploading repository metadata for: 'snapshot org.apache.maven.its.plugins:maven-it-plugin-artifact:2.1-SNAPSHOT'
[INFO] Uploading project information for maven-it-plugin-artifact 2.1-20090617.210553-325
[INFO] Retrieving previous metadata from maven.it
[INFO] Uploading repository metadata for: 'artifact org.apache.maven.its.plugins:maven-it-plugin-artifact'
[INFO] Retrieving previous metadata from maven.it
[INFO] Uploading repository metadata for: 'org.apache.maven.its.plugins'
[INFO] ------------------------------------------------------------------------
[INFO] Building Maven Integration Test Plugin :: Class Loader :: Dependency A
[INFO]    task-segment: [clean, deploy]
[INFO] ------------------------------------------------------------------------
[INFO] [clean:clean]
[INFO] Deleting file set: /home/hudson/workspace/maven-core-integration-testing/jdk/1.5/label/jeos1/maven-its/core-it-support/core-it-plugins/maven-it-plugin-class-loader/dep-a/target
(included: [**], excluded: [])
[INFO] [remote-resources:process {execution: default}]
[INFO] [resources:resources]
[INFO] Using 'UTF-8' encoding to copy filtered resources.
[INFO] Copying 2 resources
[INFO] Copying 3 resources
[INFO] [compiler:compile]
[INFO] Compiling 2 source files to /home/hudson/workspace/maven-core-integration-testing/jdk/1.5/label/jeos1/maven-its/core-it-support/core-it-plugins/maven-it-plugin-class-loader/dep-a/target/classes
[INFO] [resources:testResources]
[INFO] Using 'UTF-8' encoding to copy filtered resources.
[INFO] skip non existing resourceDirectory /home/hudson/workspace/maven-core-integration-testing/jdk/1.5/label/jeos1/maven-its/core-it-support/core-it-plugins/maven-it-plugin-class-loader/dep-a/src/test/resources
[INFO] Copying 3 resources
[INFO] [compiler:testCompile]
[INFO] Not compiling test sources
[INFO] [surefire:test]
[INFO] Tests are skipped.
[INFO] [jar:jar]
[INFO] Building jar: /home/hudson/workspace/maven-core-integration-testing/jdk/1.5/label/jeos1/maven-its/core-it-support/core-it-plugins/maven-it-plugin-class-loader/dep-a/target/dep-a-2.1-SNAPSHOT.jar
[INFO] [install:install]
[INFO] Installing /home/hudson/workspace/maven-core-integration-testing/jdk/1.5/label/jeos1/maven-its/core-it-support/core-it-plugins/maven-it-plugin-class-loader/dep-a/target/dep-a-2.1-SNAPSHOT.jar
to /opt/repos/local-repository/org/apache/maven/its/plugins/class-loader/dep-a/2.1-SNAPSHOT/dep-a-2.1-SNAPSHOT.jar
[INFO] [deploy:deploy]
[INFO] Retrieving previous build number from maven.it
Uploading: http://repository.sonatype.org:8081/content/repositories/maven.snapshots/org/apache/maven/its/plugins/class-loader/dep-a/2.1-SNAPSHOT/dep-a-2.1-20090617.210553-320.jar
8K uploaded  (dep-a-2.1-20090617.210553-320.jar)
[INFO] Retrieving previous metadata from maven.it
[INFO] Uploading repository metadata for: 'artifact org.apache.maven.its.plugins.class-loader:dep-a'
[INFO] Uploading project information for dep-a 2.1-20090617.210553-320
[INFO] Retrieving previous metadata from maven.it
[INFO] Uploading repository metadata for: 'snapshot org.apache.maven.its.plugins.class-loader:dep-a:2.1-SNAPSHOT'
[INFO] ------------------------------------------------------------------------
[INFO] Building Maven Integration Test Plugin :: Class Loader :: Dependency B
[INFO]    task-segment: [clean, deploy]
[INFO] ------------------------------------------------------------------------
[INFO] [clean:clean]
[INFO] Deleting file set: /home/hudson/workspace/maven-core-integration-testing/jdk/1.5/label/jeos1/maven-its/core-it-support/core-it-plugins/maven-it-plugin-class-loader/dep-b/target
(included: [**], excluded: [])
[INFO] [remote-resources:process {execution: default}]
[INFO] [resources:resources]
[INFO] Using 'UTF-8' encoding to copy filtered resources.
[INFO] Copying 2 resources
[INFO] Copying 3 resources
[INFO] [compiler:compile]
[INFO] Compiling 2 source files to /home/hudson/workspace/maven-core-integration-testing/jdk/1.5/label/jeos1/maven-its/core-it-support/core-it-plugins/maven-it-plugin-class-loader/dep-b/target/classes
[INFO] [resources:testResources]
[INFO] Using 'UTF-8' encoding to copy filtered resources.
[INFO] skip non existing resourceDirectory /home/hudson/workspace/maven-core-integration-testing/jdk/1.5/label/jeos1/maven-its/core-it-support/core-it-plugins/maven-it-plugin-class-loader/dep-b/src/test/resources
[INFO] Copying 3 resources
[INFO] [compiler:testCompile]
[INFO] Not compiling test sources
[INFO] [surefire:test]
[INFO] Tests are skipped.
[INFO] [jar:jar]
[INFO] Building jar: /home/hudson/workspace/maven-core-integration-testing/jdk/1.5/label/jeos1/maven-its/core-it-support/core-it-plugins/maven-it-plugin-class-loader/dep-b/target/dep-b-2.1-SNAPSHOT.jar
[INFO] [install:install]
[INFO] Installing /home/hudson/workspace/maven-core-integration-testing/jdk/1.5/label/jeos1/maven-its/core-it-support/core-it-plugins/maven-it-plugin-class-loader/dep-b/target/dep-b-2.1-SNAPSHOT.jar
to /opt/repos/local-repository/org/apache/maven/its/plugins/class-loader/dep-b/2.1-SNAPSHOT/dep-b-2.1-SNAPSHOT.jar
[INFO] [deploy:deploy]
[INFO] Retrieving previous build number from maven.it
Uploading: http://repository.sonatype.org:8081/content/repositories/maven.snapshots/org/apache/maven/its/plugins/class-loader/dep-b/2.1-SNAPSHOT/dep-b-2.1-20090617.210553-320.jar
8K uploaded  (dep-b-2.1-20090617.210553-320.jar)
[INFO] Retrieving previous metadata from maven.it
[INFO] Uploading repository metadata for: 'snapshot org.apache.maven.its.plugins.class-loader:dep-b:2.1-SNAPSHOT'
[INFO] Retrieving previous metadata from maven.it
[INFO] Uploading repository metadata for: 'artifact org.apache.maven.its.plugins.class-loader:dep-b'
[INFO] Uploading project information for dep-b 2.1-20090617.210553-320
[INFO] ------------------------------------------------------------------------
[INFO] Building Maven Integration Test Plugin :: Class Loader
[INFO]    task-segment: [clean, deploy]
[INFO] ------------------------------------------------------------------------
[INFO] [clean:clean]
[INFO] Deleting file set: /home/hudson/workspace/maven-core-integration-testing/jdk/1.5/label/jeos1/maven-its/core-it-support/core-it-plugins/maven-it-plugin-class-loader/maven-it-plugin-class-loader/target
(included: [**], excluded: [])
[INFO] [plugin:descriptor]
[INFO] Using 2 extractors.
[INFO] Applying extractor for language: java
[INFO] Extractor for language: java found 2 mojo descriptors.
[INFO] Applying extractor for language: bsh
[INFO] Extractor for language: bsh found 0 mojo descriptors.
[INFO] [remote-resources:process {execution: default}]
[INFO] [resources:resources]
[INFO] Using 'UTF-8' encoding to copy filtered resources.
[INFO] skip non existing resourceDirectory /home/hudson/workspace/maven-core-integration-testing/jdk/1.5/label/jeos1/maven-its/core-it-support/core-it-plugins/maven-it-plugin-class-loader/maven-it-plugin-class-loader/src/main/resources
[INFO] Copying 3 resources
[INFO] [compiler:compile]
[INFO] Compiling 3 source files to /home/hudson/workspace/maven-core-integration-testing/jdk/1.5/label/jeos1/maven-its/core-it-support/core-it-plugins/maven-it-plugin-class-loader/maven-it-plugin-class-loader/target/classes
[INFO] [resources:testResources]
[INFO] Using 'UTF-8' encoding to copy filtered resources.
[INFO] skip non existing resourceDirectory /home/hudson/workspace/maven-core-integration-testing/jdk/1.5/label/jeos1/maven-its/core-it-support/core-it-plugins/maven-it-plugin-class-loader/maven-it-plugin-class-loader/src/test/resources
[INFO] Copying 3 resources
[INFO] [compiler:testCompile]
[INFO] Compiling 1 source file to /home/hudson/workspace/maven-core-integration-testing/jdk/1.5/label/jeos1/maven-its/core-it-support/core-it-plugins/maven-it-plugin-class-loader/maven-it-plugin-class-loader/target/test-classes
[INFO] [surefire:test]
[INFO] Surefire report directory: /home/hudson/workspace/maven-core-integration-testing/jdk/1.5/label/jeos1/maven-its/core-it-support/core-it-plugins/maven-it-plugin-class-loader/maven-it-plugin-class-loader/target/surefire-reports

-------------------------------------------------------
 T E S T S
-------------------------------------------------------
Running org.apache.maven.plugin.coreit.ExpressionUtilTest
Tests run: 2, Failures: 0, Errors: 0, Skipped: 0, Time elapsed: 0.038 sec

Results :

Tests run: 2, Failures: 0, Errors: 0, Skipped: 0

[INFO] [jar:jar]
[INFO] Building jar: /home/hudson/workspace/maven-core-integration-testing/jdk/1.5/label/jeos1/maven-its/core-it-support/core-it-plugins/maven-it-plugin-class-loader/maven-it-plugin-class-loader/target/maven-it-plugin-class-loader-2.1-SNAPSHOT.jar
[INFO] [plugin:addPluginArtifactMetadata]
[INFO] [install:install]
[INFO] Installing /home/hudson/workspace/maven-core-integration-testing/jdk/1.5/label/jeos1/maven-its/core-it-support/core-it-plugins/maven-it-plugin-class-loader/maven-it-plugin-class-loader/target/maven-it-plugin-class-loader-2.1-SNAPSHOT.jar
to /opt/repos/local-repository/org/apache/maven/its/plugins/maven-it-plugin-class-loader/2.1-SNAPSHOT/maven-it-plugin-class-loader-2.1-SNAPSHOT.jar
[INFO] [plugin:updateRegistry]
[INFO] [deploy:deploy]
[INFO] Retrieving previous build number from maven.it
[INFO] ------------------------------------------------------------------------
[ERROR] BUILD ERROR
[INFO] ------------------------------------------------------------------------
[INFO] Error retrieving previous build number for artifact 'org.apache.maven.its.plugins:maven-it-plugin-class-loader:maven-plugin':
repository metadata for: 'snapshot org.apache.maven.its.plugins:maven-it-plugin-class-loader:2.1-SNAPSHOT'
could not be retrieved from repository: maven.it due to an error: Error transferring file:
Connection refused

[INFO] ------------------------------------------------------------------------
[INFO] Trace
org.apache.maven.lifecycle.LifecycleExecutionException: Error retrieving previous build number
for artifact 'org.apache.maven.its.plugins:maven-it-plugin-class-loader:maven-plugin': repository
metadata for: 'snapshot org.apache.maven.its.plugins:maven-it-plugin-class-loader:2.1-SNAPSHOT'
could not be retrieved from repository: maven.it due to an error: Error transferring file:
Connection refused
	at org.apache.maven.lifecycle.DefaultLifecycleExecutor.executeGoals(DefaultLifecycleExecutor.java:703)
	at org.apache.maven.lifecycle.DefaultLifecycleExecutor.executeGoalWithLifecycle(DefaultLifecycleExecutor.java:540)
	at org.apache.maven.lifecycle.DefaultLifecycleExecutor.executeGoal(DefaultLifecycleExecutor.java:519)
	at org.apache.maven.lifecycle.DefaultLifecycleExecutor.executeGoalAndHandleFailures(DefaultLifecycleExecutor.java:371)
	at org.apache.maven.lifecycle.DefaultLifecycleExecutor.executeTaskSegments(DefaultLifecycleExecutor.java:332)
	at org.apache.maven.lifecycle.DefaultLifecycleExecutor.execute(DefaultLifecycleExecutor.java:181)
	at org.apache.maven.DefaultMaven.doExecute(DefaultMaven.java:356)
	at org.apache.maven.DefaultMaven.execute(DefaultMaven.java:137)
	at org.apache.maven.cli.MavenCli.main(MavenCli.java:356)
	at sun.reflect.NativeMethodAccessorImpl.invoke0(Native Method)
	at sun.reflect.NativeMethodAccessorImpl.invoke(NativeMethodAccessorImpl.java:39)
	at sun.reflect.DelegatingMethodAccessorImpl.invoke(DelegatingMethodAccessorImpl.java:25)
	at java.lang.reflect.Method.invoke(Method.java:585)
	at org.codehaus.classworlds.Launcher.launchEnhanced(Launcher.java:315)
	at org.codehaus.classworlds.Launcher.launch(Launcher.java:255)
	at org.codehaus.classworlds.Launcher.mainWithExitCode(Launcher.java:430)
	at org.codehaus.classworlds.Launcher.main(Launcher.java:375)
Caused by: org.apache.maven.plugin.MojoExecutionException: Error retrieving previous build
number for artifact 'org.apache.maven.its.plugins:maven-it-plugin-class-loader:maven-plugin':
repository metadata for: 'snapshot org.apache.maven.its.plugins:maven-it-plugin-class-loader:2.1-SNAPSHOT'
could not be retrieved from repository: maven.it due to an error: Error transferring file:
Connection refused
	at org.apache.maven.plugin.deploy.DeployMojo.execute(DeployMojo.java:195)
	at org.apache.maven.plugin.DefaultPluginManager.executeMojo(DefaultPluginManager.java:483)
	at org.apache.maven.lifecycle.DefaultLifecycleExecutor.executeGoals(DefaultLifecycleExecutor.java:678)
	... 16 more
Caused by: org.apache.maven.artifact.deployer.ArtifactDeploymentException: Error retrieving
previous build number for artifact 'org.apache.maven.its.plugins:maven-it-plugin-class-loader:maven-plugin':
repository metadata for: 'snapshot org.apache.maven.its.plugins:maven-it-plugin-class-loader:2.1-SNAPSHOT'
could not be retrieved from repository: maven.it due to an error: Error transferring file:
Connection refused
	at org.apache.maven.artifact.transform.SnapshotTransformation.transformForDeployment(SnapshotTransformation.java:106)
	at org.apache.maven.artifact.transform.DefaultArtifactTransformationManager.transformForDeployment(DefaultArtifactTransformationManager.java:78)
	at org.apache.maven.artifact.deployer.DefaultArtifactDeployer.deploy(DefaultArtifactDeployer.java:86)
	at org.apache.maven.plugin.deploy.DeployMojo.execute(DeployMojo.java:173)
	... 18 more
Caused by: org.apache.maven.artifact.repository.metadata.RepositoryMetadataResolutionException:
repository metadata for: 'snapshot org.apache.maven.its.plugins:maven-it-plugin-class-loader:2.1-SNAPSHOT'
could not be retrieved from repository: maven.it due to an error: Error transferring file:
Connection refused
	at org.apache.maven.artifact.repository.metadata.DefaultRepositoryMetadataManager.resolveAlways(DefaultRepositoryMetadataManager.java:351)
	at org.apache.maven.artifact.transform.SnapshotTransformation.resolveLatestSnapshotBuildNumber(SnapshotTransformation.java:161)
	at org.apache.maven.artifact.transform.SnapshotTransformation.transformForDeployment(SnapshotTransformation.java:100)
	... 21 more
Caused by: org.apache.maven.wagon.TransferFailedException: Error transferring file: Connection
refused
	at org.apache.maven.wagon.providers.http.LightweightHttpWagon.fillInputData(LightweightHttpWagon.java:143)
	at org.apache.maven.wagon.StreamWagon.getInputStream(StreamWagon.java:116)
	at org.apache.maven.wagon.StreamWagon.getIfNewer(StreamWagon.java:88)
	at org.apache.maven.wagon.StreamWagon.get(StreamWagon.java:61)
	at org.apache.maven.artifact.manager.DefaultWagonManager.getRemoteFile(DefaultWagonManager.java:491)
	at org.apache.maven.artifact.manager.DefaultWagonManager.getArtifactMetadataFromDeploymentRepository(DefaultWagonManager.java:397)
	at org.apache.maven.artifact.repository.metadata.DefaultRepositoryMetadataManager.getArtifactMetadataFromDeploymentRepository(DefaultRepositoryMetadataManager.java:379)
	at org.apache.maven.artifact.repository.metadata.DefaultRepositoryMetadataManager.resolveAlways(DefaultRepositoryMetadataManager.java:347)
	... 23 more
Caused by: java.net.ConnectException: Connection refused
	at java.net.PlainSocketImpl.socketConnect(Native Method)
	at java.net.PlainSocketImpl.doConnect(PlainSocketImpl.java:333)
	at java.net.PlainSocketImpl.connectToAddress(PlainSocketImpl.java:195)
	at java.net.PlainSocketImpl.connect(PlainSocketImpl.java:182)
	at java.net.Socket.connect(Socket.java:519)
	at java.net.Socket.connect(Socket.java:469)
	at sun.net.NetworkClient.doConnect(NetworkClient.java:157)
	at sun.net.www.http.HttpClient.openServer(HttpClient.java:382)
	at sun.net.www.http.HttpClient.openServer(HttpClient.java:509)
	at sun.net.www.http.HttpClient.parseHTTPHeader(HttpClient.java:732)
	at sun.net.www.http.HttpClient.parseHTTP(HttpClient.java:604)
	at sun.net.www.protocol.http.HttpURLConnection.getInputStream(HttpURLConnection.java:961)
	at java.net.HttpURLConnection.getResponseCode(HttpURLConnection.java:367)
	at org.apache.maven.wagon.providers.http.LightweightHttpWagon.fillInputData(LightweightHttpWagon.java:115)
	... 30 more
[INFO] ------------------------------------------------------------------------
[INFO] Total time: 22 seconds
[INFO] Finished at: Wed Jun 17 15:06:07 GMT-06:00 2009
[INFO] Final Memory: 27M/82M
[INFO] ------------------------------------------------------------------------


Mime
View raw message