maven-notifications mailing list archives

Site index · List index
Message view « Date » · « Thread »
Top « Date » · « Thread »
From Hudson <Hud...@sonatype.org>
Subject Build failed in Hudson: Maven-2.1.x-bootstrap » 1.5,ubuntu #171
Date Sun, 14 Jun 2009 17:57:06 GMT
See http://grid.sonatype.org/ci/job/Maven-2.1.x-bootstrap/./jdk=1.5,label=ubuntu/171/changes

Changes:

[Benjamin Bentmann] [MNG-4200] Build fails on system without svn client

------------------------------------------
[...truncated 5828 lines...]
     [exec] 	at org.apache.maven.artifact.resolver.DefaultArtifactResolver$ResolveArtifactTask.run(DefaultArtifactResolver.java:433)
     [exec] 	at hidden.edu.emory.mathcs.backport.java.util.concurrent.ThreadPoolExecutor.runWorker(ThreadPoolExecutor.java:1061)
     [exec] 	at hidden.edu.emory.mathcs.backport.java.util.concurrent.ThreadPoolExecutor$Worker.run(ThreadPoolExecutor.java:575)
     [exec] 	at java.lang.Thread.run(Thread.java:595)
     [exec] Caused by: java.net.ConnectException: Connection refused
     [exec] 	at java.net.PlainSocketImpl.socketConnect(Native Method)
     [exec] 	at java.net.PlainSocketImpl.doConnect(PlainSocketImpl.java:333)
     [exec] 	at java.net.PlainSocketImpl.connectToAddress(PlainSocketImpl.java:195)
     [exec] 	at java.net.PlainSocketImpl.connect(PlainSocketImpl.java:182)
     [exec] 	at java.net.Socket.connect(Socket.java:519)
     [exec] 	at java.net.Socket.connect(Socket.java:469)
     [exec] 	at sun.net.NetworkClient.doConnect(NetworkClient.java:157)
     [exec] 	at sun.net.www.http.HttpClient.openServer(HttpClient.java:382)
     [exec] 	at sun.net.www.http.HttpClient.openServer(HttpClient.java:509)
     [exec] 	at sun.net.www.http.HttpClient.<init>(HttpClient.java:231)
     [exec] 	at sun.net.www.http.HttpClient.New(HttpClient.java:304)
     [exec] 	at sun.net.www.http.HttpClient.New(HttpClient.java:316)
     [exec] 	at sun.net.www.protocol.http.HttpURLConnection.getNewHttpClient(HttpURLConnection.java:817)
     [exec] 	at sun.net.www.protocol.http.HttpURLConnection.plainConnect(HttpURLConnection.java:769)
     [exec] 	at sun.net.www.protocol.http.HttpURLConnection.connect(HttpURLConnection.java:694)
     [exec] 	at sun.net.www.protocol.http.HttpURLConnection.getInputStream(HttpURLConnection.java:938)
     [exec] 	at java.net.HttpURLConnection.getResponseCode(HttpURLConnection.java:367)
     [exec] 	at org.apache.maven.wagon.providers.http.LightweightHttpWagon.fillInputData(LightweightHttpWagon.java:115)
     [exec] 	... 13 more
     [exec] [WARNING] Unable to get resource 'org.apache.maven.wagon:wagon-webdav-jackrabbit:jar:1.0-beta-3'
from repository central (http://Nexus): Error transferring file: Connection refused
     [exec] [DEBUG] Using mirror: http://repository.sonatype.org:8081/content/groups/sonatype-grid
(id: Nexus)
     [exec] [DEBUG] Unable to download the artifact from any repository
     [exec] Try downloading the file manually from the project website.
     [exec] Then, install it using the command: 
     [exec]     mvn install:install-file -DgroupId=org.apache.maven.wagon -DartifactId=wagon-webdav-jackrabbit
-Dversion=1.0-beta-3 -Dpackaging=jar -Dfile=/path/to/file
     [exec] Alternatively, if you host your own repository you can deploy the file there:

     [exec]     mvn deploy:deploy-file -DgroupId=org.apache.maven.wagon -DartifactId=wagon-webdav-jackrabbit
-Dversion=1.0-beta-3 -Dpackaging=jar -Dfile=/path/to/file -Durl=[url] -DrepositoryId=[id]
     [exec] Path to dependency: 
     [exec] 	1) org.apache.maven.its.mng3652:test-project:jar:1.0-SNAPSHOT
     [exec] 	2) org.apache.maven.wagon:wagon-webdav-jackrabbit:jar:1.0-beta-3
     [exec]   org.apache.maven.wagon:wagon-webdav-jackrabbit:jar:1.0-beta-3
     [exec] from the specified remote repositories:
     [exec]   Nexus (http://repository.sonatype.org:8081/content/groups/sonatype-grid)
     [exec] org.apache.maven.artifact.resolver.ArtifactNotFoundException: Unable to download
the artifact from any repository
     [exec] Try downloading the file manually from the project website.
     [exec] Then, install it using the command: 
     [exec]     mvn install:install-file -DgroupId=org.apache.maven.wagon -DartifactId=wagon-webdav-jackrabbit
-Dversion=1.0-beta-3 -Dpackaging=jar -Dfile=/path/to/file
     [exec] Alternatively, if you host your own repository you can deploy the file there:

     [exec]     mvn deploy:deploy-file -DgroupId=org.apache.maven.wagon -DartifactId=wagon-webdav-jackrabbit
-Dversion=1.0-beta-3 -Dpackaging=jar -Dfile=/path/to/file -Durl=[url] -DrepositoryId=[id]
     [exec] Path to dependency: 
     [exec] 	1) org.apache.maven.its.mng3652:test-project:jar:1.0-SNAPSHOT
     [exec] 	2) org.apache.maven.wagon:wagon-webdav-jackrabbit:jar:1.0-beta-3
     [exec]   org.apache.maven.wagon:wagon-webdav-jackrabbit:jar:1.0-beta-3
     [exec] from the specified remote repositories:
     [exec]   Nexus (http://repository.sonatype.org:8081/content/groups/sonatype-grid)
     [exec] 	at org.apache.maven.artifact.resolver.DefaultArtifactResolver.resolve(DefaultArtifactResolver.java:228)
     [exec] 	at org.apache.maven.artifact.resolver.DefaultArtifactResolver.resolve(DefaultArtifactResolver.java:90)
     [exec] 	at org.apache.maven.artifact.resolver.DefaultArtifactResolver$ResolveArtifactTask.resolveArtifact(DefaultArtifactResolver.java:456)
     [exec] 	at org.apache.maven.artifact.resolver.DefaultArtifactResolver$ResolveArtifactTask.run(DefaultArtifactResolver.java:433)
     [exec] 	at hidden.edu.emory.mathcs.backport.java.util.concurrent.ThreadPoolExecutor.runWorker(ThreadPoolExecutor.java:1061)
     [exec] 	at hidden.edu.emory.mathcs.backport.java.util.concurrent.ThreadPoolExecutor$Worker.run(ThreadPoolExecutor.java:575)
     [exec] 	at java.lang.Thread.run(Thread.java:595)
     [exec] Caused by: org.apache.maven.wagon.ResourceDoesNotExistException: Unable to download
the artifact from any repository
     [exec] 	at org.apache.maven.artifact.manager.DefaultWagonManager.getArtifact(DefaultWagonManager.java:349)
     [exec] 	at org.apache.maven.artifact.resolver.DefaultArtifactResolver.resolve(DefaultArtifactResolver.java:216)
     [exec] 	... 6 more
     [exec] [DEBUG] Using mirror: http://repository.sonatype.org:8081/content/groups/sonatype-grid
(id: Nexus)
     [exec] [INFO] ------------------------------------------------------------------------
     [exec] [ERROR] BUILD ERROR
     [exec] [INFO] ------------------------------------------------------------------------
     [exec] [INFO] Failed to resolve artifact.
     [exec] Missing:
     [exec] ----------
     [exec] 1) org.apache.maven.wagon:wagon-webdav-jackrabbit:jar:1.0-beta-3
     [exec]   Try downloading the file manually from the project website.
     [exec]   Then, install it using the command: 
     [exec]       mvn install:install-file -DgroupId=org.apache.maven.wagon -DartifactId=wagon-webdav-jackrabbit
-Dversion=1.0-beta-3 -Dpackaging=jar -Dfile=/path/to/file
     [exec]   Alternatively, if you host your own repository you can deploy the file there:

     [exec]       mvn deploy:deploy-file -DgroupId=org.apache.maven.wagon -DartifactId=wagon-webdav-jackrabbit
-Dversion=1.0-beta-3 -Dpackaging=jar -Dfile=/path/to/file -Durl=[url] -DrepositoryId=[id]
     [exec]   Path to dependency: 
     [exec]   	1) org.apache.maven.its.mng3652:test-project:jar:1.0-SNAPSHOT
     [exec]   	2) org.apache.maven.wagon:wagon-webdav-jackrabbit:jar:1.0-beta-3
     [exec] ----------
     [exec] 1 required artifact is missing.
     [exec] for artifact: 
     [exec]   org.apache.maven.its.mng3652:test-project:jar:1.0-SNAPSHOT
     [exec] from the specified remote repositories:
     [exec]   Nexus (http://repository.sonatype.org:8081/content/groups/sonatype-grid)
     [exec] [INFO] ------------------------------------------------------------------------
     [exec] [DEBUG] Trace
     [exec] org.apache.maven.lifecycle.LifecycleExecutionException: Missing:
     [exec] ----------
     [exec] 1) org.apache.maven.wagon:wagon-webdav-jackrabbit:jar:1.0-beta-3
     [exec]   Try downloading the file manually from the project website.
     [exec]   Then, install it using the command: 
     [exec]       mvn install:install-file -DgroupId=org.apache.maven.wagon -DartifactId=wagon-webdav-jackrabbit
-Dversion=1.0-beta-3 -Dpackaging=jar -Dfile=/path/to/file
     [exec]   Alternatively, if you host your own repository you can deploy the file there:

     [exec]       mvn deploy:deploy-file -DgroupId=org.apache.maven.wagon -DartifactId=wagon-webdav-jackrabbit
-Dversion=1.0-beta-3 -Dpackaging=jar -Dfile=/path/to/file -Durl=[url] -DrepositoryId=[id]
     [exec]   Path to dependency: 
     [exec]   	1) org.apache.maven.its.mng3652:test-project:jar:1.0-SNAPSHOT
     [exec]   	2) org.apache.maven.wagon:wagon-webdav-jackrabbit:jar:1.0-beta-3
     [exec] ----------
     [exec] 1 required artifact is missing.
     [exec] for artifact: 
     [exec]   org.apache.maven.its.mng3652:test-project:jar:1.0-SNAPSHOT
     [exec] from the specified remote repositories:
     [exec]   Nexus (http://repository.sonatype.org:8081/content/groups/sonatype-grid)
     [exec] 	at org.apache.maven.lifecycle.DefaultLifecycleExecutor.findExtensions(DefaultLifecycleExecutor.java:206)
     [exec] 	at org.apache.maven.lifecycle.DefaultLifecycleExecutor.execute(DefaultLifecycleExecutor.java:179)
     [exec] 	at org.apache.maven.DefaultMaven.doExecute(DefaultMaven.java:356)
     [exec] 	at org.apache.maven.DefaultMaven.execute(DefaultMaven.java:137)
     [exec] 	at org.apache.maven.cli.MavenCli.main(MavenCli.java:356)
     [exec] 	at sun.reflect.NativeMethodAccessorImpl.invoke0(Native Method)
     [exec] 	at sun.reflect.NativeMethodAccessorImpl.invoke(NativeMethodAccessorImpl.java:39)
     [exec] 	at sun.reflect.DelegatingMethodAccessorImpl.invoke(DelegatingMethodAccessorImpl.java:25)
     [exec] 	at java.lang.reflect.Method.invoke(Method.java:585)
     [exec] 	at org.codehaus.classworlds.Launcher.launchEnhanced(Launcher.java:315)
     [exec] 	at org.codehaus.classworlds.Launcher.launch(Launcher.java:255)
     [exec] 	at org.codehaus.classworlds.Launcher.mainWithExitCode(Launcher.java:430)
     [exec] 	at org.codehaus.classworlds.Launcher.main(Launcher.java:375)
     [exec] Caused by: org.apache.maven.artifact.resolver.MultipleArtifactsNotFoundException:
Missing:
     [exec] ----------
     [exec] 1) org.apache.maven.wagon:wagon-webdav-jackrabbit:jar:1.0-beta-3
     [exec]   Try downloading the file manually from the project website.
     [exec]   Then, install it using the command: 
     [exec]       mvn install:install-file -DgroupId=org.apache.maven.wagon -DartifactId=wagon-webdav-jackrabbit
-Dversion=1.0-beta-3 -Dpackaging=jar -Dfile=/path/to/file
     [exec]   Alternatively, if you host your own repository you can deploy the file there:

     [exec]       mvn deploy:deploy-file -DgroupId=org.apache.maven.wagon -DartifactId=wagon-webdav-jackrabbit
-Dversion=1.0-beta-3 -Dpackaging=jar -Dfile=/path/to/file -Durl=[url] -DrepositoryId=[id]
     [exec]   Path to dependency: 
     [exec]   	1) org.apache.maven.its.mng3652:test-project:jar:1.0-SNAPSHOT
     [exec]   	2) org.apache.maven.wagon:wagon-webdav-jackrabbit:jar:1.0-beta-3
     [exec] ----------
     [exec] 1 required artifact is missing.
     [exec] for artifact: 
     [exec]   org.apache.maven.its.mng3652:test-project:jar:1.0-SNAPSHOT
     [exec] from the specified remote repositories:
     [exec]   Nexus (http://repository.sonatype.org:8081/content/groups/sonatype-grid)
     [exec] 	at org.apache.maven.artifact.resolver.DefaultArtifactResolver.resolveTransitively(DefaultArtifactResolver.java:360)
     [exec] 	at org.apache.maven.artifact.resolver.DefaultArtifactResolver.resolveTransitively(DefaultArtifactResolver.java:304)
     [exec] 	at org.apache.maven.extension.DefaultExtensionManager.addExtension(DefaultExtensionManager.java:132)
     [exec] 	at org.apache.maven.lifecycle.DefaultLifecycleExecutor.findExtensions(DefaultLifecycleExecutor.java:198)
     [exec] 	... 12 more
     [exec] [INFO] ------------------------------------------------------------------------
     [exec] [INFO] Total time: < 1 second
     [exec] [INFO] Finished at: Sun Jun 14 11:40:37 GMT-06:00 2009
     [exec] [INFO] Final Memory: 2M/19M
     [exec] [INFO] ------------------------------------------------------------------------
     [exec] 	at org.apache.maven.it.Verifier.executeGoals(Verifier.java:1283)
     [exec] 	at org.apache.maven.it.Verifier.executeGoal(Verifier.java:1131)
     [exec] 	at org.apache.maven.it.Verifier.executeGoal(Verifier.java:1125)
     [exec] 	at org.apache.maven.it.MavenITmng3652UserAgentHeaderTest.testmng3652_UnConfiguredHttp(MavenITmng3652UserAgentHeaderTest.java:118)
     [exec] 	at sun.reflect.NativeMethodAccessorImpl.invoke0(Native Method)
     [exec] 	at sun.reflect.NativeMethodAccessorImpl.invoke(NativeMethodAccessorImpl.java:39)
     [exec] 	at sun.reflect.DelegatingMethodAccessorImpl.invoke(DelegatingMethodAccessorImpl.java:25)
     [exec] 	at java.lang.reflect.Method.invoke(Method.java:585)
     [exec] 	at junit.framework.TestCase.runTest(TestCase.java:164)
     [exec] 	at org.apache.maven.it.AbstractMavenIntegrationTestCase.runTest(AbstractMavenIntegrationTestCase.java:198)
     [exec] 	at junit.framework.TestCase.runBare(TestCase.java:130)
     [exec] 	at junit.framework.TestResult$1.protect(TestResult.java:106)
     [exec] 	at junit.framework.TestResult.runProtected(TestResult.java:124)
     [exec] 	at junit.framework.TestResult.run(TestResult.java:109)
     [exec] 	at junit.framework.TestCase.run(TestCase.java:120)
     [exec] 	at junit.framework.TestSuite.runTest(TestSuite.java:230)
     [exec] 	at junit.framework.TestSuite.run(TestSuite.java:225)
     [exec] 	at junit.framework.TestSuite.runTest(TestSuite.java:230)
     [exec] 	at junit.framework.TestSuite.run(TestSuite.java:225)
     [exec] 	at sun.reflect.NativeMethodAccessorImpl.invoke0(Native Method)
     [exec] 	at sun.reflect.NativeMethodAccessorImpl.invoke(NativeMethodAccessorImpl.java:39)
     [exec] 	at sun.reflect.DelegatingMethodAccessorImpl.invoke(DelegatingMethodAccessorImpl.java:25)
     [exec] 	at java.lang.reflect.Method.invoke(Method.java:585)
     [exec] 	at org.apache.maven.surefire.junit.JUnitTestSet.execute(JUnitTestSet.java:213)
     [exec] 	at org.apache.maven.surefire.suite.AbstractDirectoryTestSuite.executeTestSet(AbstractDirectoryTestSuite.java:140)
     [exec] 	at org.apache.maven.surefire.suite.AbstractDirectoryTestSuite.execute(AbstractDirectoryTestSuite.java:127)
     [exec] 	at org.apache.maven.surefire.Surefire.run(Surefire.java:177)
     [exec] 	at sun.reflect.NativeMethodAccessorImpl.invoke0(Native Method)
     [exec] 	at sun.reflect.NativeMethodAccessorImpl.invoke(NativeMethodAccessorImpl.java:39)
     [exec] 	at sun.reflect.DelegatingMethodAccessorImpl.invoke(DelegatingMethodAccessorImpl.java:25)
     [exec] 	at java.lang.reflect.Method.invoke(Method.java:585)
     [exec] 	at org.apache.maven.surefire.booter.SurefireBooter.runSuitesInProcess(SurefireBooter.java:345)
     [exec] 	at org.apache.maven.surefire.booter.SurefireBooter.run(SurefireBooter.java:241)
     [exec] 	at org.apache.maven.plugin.surefire.SurefirePlugin.execute(SurefirePlugin.java:537)
     [exec] 	at org.apache.maven.plugin.DefaultPluginManager.executeMojo(DefaultPluginManager.java:483)
     [exec] 	at org.apache.maven.lifecycle.DefaultLifecycleExecutor.executeGoals(DefaultLifecycleExecutor.java:678)
     [exec] 	at org.apache.maven.lifecycle.DefaultLifecycleExecutor.executeGoalWithLifecycle(DefaultLifecycleExecutor.java:540)
     [exec] 	at org.apache.maven.lifecycle.DefaultLifecycleExecutor.executeGoal(DefaultLifecycleExecutor.java:519)
     [exec] 	at org.apache.maven.lifecycle.DefaultLifecycleExecutor.executeGoalAndHandleFailures(DefaultLifecycleExecutor.java:371)
     [exec] 	at org.apache.maven.lifecycle.DefaultLifecycleExecutor.executeTaskSegments(DefaultLifecycleExecutor.java:332)
     [exec] 	at org.apache.maven.lifecycle.DefaultLifecycleExecutor.execute(DefaultLifecycleExecutor.java:181)
     [exec] 	at org.apache.maven.DefaultMaven.doExecute(DefaultMaven.java:356)
     [exec] 	at org.apache.maven.DefaultMaven.execute(DefaultMaven.java:137)
     [exec] 	at org.apache.maven.cli.MavenCli.main(MavenCli.java:356)
     [exec] 	at sun.reflect.NativeMethodAccessorImpl.invoke0(Native Method)
     [exec] 	at sun.reflect.NativeMethodAccessorImpl.invoke(NativeMethodAccessorImpl.java:39)
     [exec] 	at sun.reflect.DelegatingMethodAccessorImpl.invoke(DelegatingMethodAccessorImpl.java:25)
     [exec] 	at java.lang.reflect.Method.invoke(Method.java:585)
     [exec] 	at org.codehaus.classworlds.Launcher.launchEnhanced(Launcher.java:315)
     [exec] 	at org.codehaus.classworlds.Launcher.launch(Launcher.java:255)
     [exec] 	at org.codehaus.classworlds.Launcher.mainWithExitCode(Launcher.java:430)
     [exec] 	at org.codehaus.classworlds.Launcher.main(Launcher.java:375)
     [exec] 
     [exec] 
     [exec] Results :
     [exec] 
     [exec] Tests in error: 
     [exec]   testmng3652_UnConfiguredHttp(org.apache.maven.it.MavenITmng3652UserAgentHeaderTest)
     [exec] 
     [exec] Tests run: 386, Failures: 0, Errors: 1, Skipped: 0
     [exec] 
     [exec] [INFO] ------------------------------------------------------------------------
     [exec] [ERROR] BUILD FAILURE
     [exec] [INFO] ------------------------------------------------------------------------
     [exec] [INFO] There are test failures.
     [exec] 
     [exec] Please refer to /tmp/maven-integration-tests-2.1.x/core-it-suite/target/surefire-reports
for the individual test results.
     [exec] [INFO] ------------------------------------------------------------------------
     [exec] [INFO] Trace
     [exec] org.apache.maven.BuildFailureException: There are test failures.
     [exec] 
     [exec] Please refer to /tmp/maven-integration-tests-2.1.x/core-it-suite/target/surefire-reports
for the individual test results.
     [exec] 	at org.apache.maven.lifecycle.DefaultLifecycleExecutor.executeGoals(DefaultLifecycleExecutor.java:699)
     [exec] 	at org.apache.maven.lifecycle.DefaultLifecycleExecutor.executeGoalWithLifecycle(DefaultLifecycleExecutor.java:540)
     [exec] 	at org.apache.maven.lifecycle.DefaultLifecycleExecutor.executeGoal(DefaultLifecycleExecutor.java:519)
     [exec] 	at org.apache.maven.lifecycle.DefaultLifecycleExecutor.executeGoalAndHandleFailures(DefaultLifecycleExecutor.java:371)
     [exec] 	at org.apache.maven.lifecycle.DefaultLifecycleExecutor.executeTaskSegments(DefaultLifecycleExecutor.java:332)
     [exec] 	at org.apache.maven.lifecycle.DefaultLifecycleExecutor.execute(DefaultLifecycleExecutor.java:181)
     [exec] 	at org.apache.maven.DefaultMaven.doExecute(DefaultMaven.java:356)
     [exec] 	at org.apache.maven.DefaultMaven.execute(DefaultMaven.java:137)
     [exec] 	at org.apache.maven.cli.MavenCli.main(MavenCli.java:356)
     [exec] 	at sun.reflect.NativeMethodAccessorImpl.invoke0(Native Method)
     [exec] 	at sun.reflect.NativeMethodAccessorImpl.invoke(NativeMethodAccessorImpl.java:39)
     [exec] 	at sun.reflect.DelegatingMethodAccessorImpl.invoke(DelegatingMethodAccessorImpl.java:25)
     [exec] 	at java.lang.reflect.Method.invoke(Method.java:585)
     [exec] 	at org.codehaus.classworlds.Launcher.launchEnhanced(Launcher.java:315)
     [exec] 	at org.codehaus.classworlds.Launcher.launch(Launcher.java:255)
     [exec] 	at org.codehaus.classworlds.Launcher.mainWithExitCode(Launcher.java:430)
     [exec] 	at org.codehaus.classworlds.Launcher.main(Launcher.java:375)
     [exec] Caused by: org.apache.maven.plugin.MojoFailureException: There are test failures.
     [exec] 
     [exec] Please refer to /tmp/maven-integration-tests-2.1.x/core-it-suite/target/surefire-reports
for the individual test results.
     [exec] 	at org.apache.maven.plugin.surefire.SurefirePlugin.execute(SurefirePlugin.java:575)
     [exec] 	at org.apache.maven.plugin.DefaultPluginManager.executeMojo(DefaultPluginManager.java:483)
     [exec] 	at org.apache.maven.lifecycle.DefaultLifecycleExecutor.executeGoals(DefaultLifecycleExecutor.java:678)
     [exec] 	... 16 more
     [exec] [INFO] ------------------------------------------------------------------------
     [exec] [INFO] Total time: 27 minutes 13 seconds
     [exec] [INFO] Finished at: Sun Jun 14 11:57:01 GMT-06:00 2009
     [exec] [INFO] Final Memory: 33M/90M
     [exec] [INFO] ------------------------------------------------------------------------

BUILD FAILED
/home/hudson/workspace/Maven-2.1.x-bootstrap/jdk/1.5/label/ubuntu/maven-2.1.x/build.xml:291:
exec returned: 1

Total time: 32 minutes 56 seconds
Archiving artifacts


Mime
View raw message