maven-notifications mailing list archives

Site index · List index
Message view « Date » · « Thread »
Top « Date » · « Thread »
From Hudson <Hud...@sonatype.org>
Subject Build failed in Hudson: Maven-2.2.x-bootstrap » 1.5,windows #15
Date Mon, 15 Jun 2009 21:35:16 GMT
See http://grid.sonatype.org/ci/job/Maven-2.2.x-bootstrap/./jdk=1.5,label=windows/15/changes

Changes:

[John Casey] [maven-release-plugin] prepare for next development iteration

[John Casey] [maven-release-plugin] prepare release maven-2.2.0

------------------------------------------
[...truncated 1013 lines...]
     [java] 843b downloaded  (modello-plugin-xdoc-1.0.1.pom)
     [java] Downloading: http://repository.sonatype.org:8081/content/groups/sonatype-grid/org/codehaus/modello/modello-plugin-xpp3/1.0.1/modello-plugin-xpp3-1.0.1.pom
     [java] 1K downloaded  (modello-plugin-xpp3-1.0.1.pom)
     [java] Downloading: http://repository.sonatype.org:8081/content/groups/sonatype-grid/org/codehaus/modello/modello-plugin-xsd/1.0.1/modello-plugin-xsd-1.0.1.pom
     [java] 1K downloaded  (modello-plugin-xsd-1.0.1.pom)
     [java] Downloading: http://repository.sonatype.org:8081/content/groups/sonatype-grid/org/codehaus/modello/modello-core/1.0.1/modello-core-1.0.1.jar
     [java] Downloading: http://repository.sonatype.org:8081/content/groups/sonatype-grid/org/sonatype/plexus/plexus-build-api/0.0.3/plexus-build-api-0.0.3.jar
     [java] Downloading: http://repository.sonatype.org:8081/content/groups/sonatype-grid/org/codehaus/plexus/plexus-utils/1.5.8/plexus-utils-1.5.8.jar
     [java] 57K downloaded  (modello-core-1.0.1.jar)
     [java] 5K downloaded  (plexus-build-api-0.0.3.jar)
     [java] 261K downloaded  (plexus-utils-1.5.8.jar)
     [java] Downloading: http://repository.sonatype.org:8081/content/groups/sonatype-grid/org/codehaus/modello/modello-plugin-converters/1.0.1/modello-plugin-converters-1.0.1.jar
     [java] 8K downloaded  (modello-plugin-converters-1.0.1.jar)
     [java] Downloading: http://repository.sonatype.org:8081/content/groups/sonatype-grid/org/codehaus/modello/modello-plugin-java/1.0.1/modello-plugin-java-1.0.1.jar
     [java] 71K downloaded  (modello-plugin-java-1.0.1.jar)
     [java] Downloading: http://repository.sonatype.org:8081/content/groups/sonatype-grid/org/codehaus/modello/modello-plugin-dom4j/1.0.1/modello-plugin-dom4j-1.0.1.jar
     [java] 17K downloaded  (modello-plugin-dom4j-1.0.1.jar)
     [java] Downloading: http://repository.sonatype.org:8081/content/groups/sonatype-grid/org/codehaus/modello/modello-plugin-xml/1.0.1/modello-plugin-xml-1.0.1.jar
     [java] 13K downloaded  (modello-plugin-xml-1.0.1.jar)
     [java] Downloading: http://repository.sonatype.org:8081/content/groups/sonatype-grid/org/codehaus/modello/modello-plugin-jdom/1.0.1/modello-plugin-jdom-1.0.1.jar
     [java] 13K downloaded  (modello-plugin-jdom-1.0.1.jar)
     [java] Downloading: http://repository.sonatype.org:8081/content/groups/sonatype-grid/org/codehaus/modello/modello-plugin-stax/1.0.1/modello-plugin-stax-1.0.1.jar
     [java] 28K downloaded  (modello-plugin-stax-1.0.1.jar)
     [java] Downloading: http://repository.sonatype.org:8081/content/groups/sonatype-grid/org/codehaus/modello/modello-plugin-xdoc/1.0.1/modello-plugin-xdoc-1.0.1.jar
     [java] 13K downloaded  (modello-plugin-xdoc-1.0.1.jar)
     [java] Downloading: http://repository.sonatype.org:8081/content/groups/sonatype-grid/org/codehaus/modello/modello-plugin-xpp3/1.0.1/modello-plugin-xpp3-1.0.1.jar
     [java] 22K downloaded  (modello-plugin-xpp3-1.0.1.jar)
     [java] Downloading: http://repository.sonatype.org:8081/content/groups/sonatype-grid/org/codehaus/modello/modello-plugin-xsd/1.0.1/modello-plugin-xsd-1.0.1.jar
     [java] 13K downloaded  (modello-plugin-xsd-1.0.1.jar)
     [java] [INFO] [modello:java {execution: standard}]
     [java] [INFO] outputDirectory: C:\home\hudson\workspace\Maven-2.2.x-bootstrap\jdk\1.5\label\windows\maven-2.2.0-RC\maven-repository-metadata\target\generated-sources\modello
     [java] [INFO] Working on model: src/main/mdo/metadata.mdo
     [java] [INFO] Generating current version: 1.0.0
     [java] [INFO] [modello:xpp3-reader {execution: standard}]
     [java] [INFO] outputDirectory: C:\home\hudson\workspace\Maven-2.2.x-bootstrap\jdk\1.5\label\windows\maven-2.2.0-RC\maven-repository-metadata\target\generated-sources\modello
     [java] [INFO] Working on model: src/main/mdo/metadata.mdo
     [java] [INFO] Generating current version: 1.0.0
     [java] [INFO] [modello:xpp3-writer {execution: standard}]
     [java] [INFO] outputDirectory: C:\home\hudson\workspace\Maven-2.2.x-bootstrap\jdk\1.5\label\windows\maven-2.2.0-RC\maven-repository-metadata\target\generated-sources\modello
     [java] [INFO] Working on model: src/main/mdo/metadata.mdo
     [java] [INFO] Generating current version: 1.0.0
     [java] [INFO] [remote-resources:process {execution: default}]
     [java] [INFO] [resources:resources {execution: default-resources}]
     [java] [INFO] Using encoding: 'UTF-8' to copy filtered resources.
     [java] [INFO] [compiler:compile {execution: default-compile}]
     [java] [INFO] Compiling 6 source files to C:\home\hudson\workspace\Maven-2.2.x-bootstrap\jdk\1.5\label\windows\maven-2.2.0-RC\maven-repository-metadata\target\classes
     [java] [INFO] [resources:testResources {execution: default-testResources}]
     [java] [INFO] Using encoding: 'UTF-8' to copy filtered resources.
     [java] [INFO] [compiler:testCompile {execution: default-testCompile}]
     [java] [INFO] No sources to compile
     [java] [INFO] [surefire:test {execution: default-test}]
     [java] [INFO] Surefire report directory: C:\home\hudson\workspace\Maven-2.2.x-bootstrap\jdk\1.5\label\windows\maven-2.2.0-RC\maven-repository-metadata\target\surefire-reports
     [java] 
     [java] -------------------------------------------------------
     [java]  T E S T S
     [java] -------------------------------------------------------
     [java] There are no tests to run.
     [java] 
     [java] Results :
     [java] 
     [java] Tests run: 0, Failures: 0, Errors: 0, Skipped: 0
     [java] 
     [java] [INFO] [jar:jar {execution: default-jar}]
     [java] [INFO] Building jar: C:\home\hudson\workspace\Maven-2.2.x-bootstrap\jdk\1.5\label\windows\maven-2.2.0-RC\maven-repository-metadata\target\maven-repository-metadata-2.2.0-RC5-SNAPSHOT.jar
     [java] [INFO] [install:install {execution: default-install}]
     [java] [INFO] Installing C:\home\hudson\workspace\Maven-2.2.x-bootstrap\jdk\1.5\label\windows\maven-2.2.0-RC\maven-repository-metadata\target\maven-repository-metadata-2.2.0-RC5-SNAPSHOT.jar
to C:\opt\repos\bootstrap-maven-2.1.x\org\apache\maven\maven-repository-metadata\2.2.0-RC5-SNAPSHOT\maven-repository-metadata-2.2.0-RC5-SNAPSHOT.jar
     [java] [INFO] ------------------------------------------------------------------------
     [java] [INFO] Building Maven Artifact Manager
     [java] [INFO]    task-segment: [clean, install]
     [java] [INFO] ------------------------------------------------------------------------
     [java] [INFO] [clean:clean {execution: default-clean}]
     [java] [INFO] Deleting directory C:\home\hudson\workspace\Maven-2.2.x-bootstrap\jdk\1.5\label\windows\maven-2.2.0-RC\maven-artifact-manager\target
     [java] [INFO] Deleting directory C:\home\hudson\workspace\Maven-2.2.x-bootstrap\jdk\1.5\label\windows\maven-2.2.0-RC\maven-artifact-manager\target\classes
     [java] [INFO] Deleting directory C:\home\hudson\workspace\Maven-2.2.x-bootstrap\jdk\1.5\label\windows\maven-2.2.0-RC\maven-artifact-manager\target\test-classes
     [java] [INFO] Deleting directory C:\home\hudson\workspace\Maven-2.2.x-bootstrap\jdk\1.5\label\windows\maven-2.2.0-RC\maven-artifact-manager\target\site
     [java] Downloading: http://repository.sonatype.org:8081/content/groups/sonatype-grid/org/apache/maven/maven-repository-metadata/2.2.0/maven-repository-metadata-2.2.0.pom
     [java] [INFO] Unable to find resource 'org.apache.maven:maven-repository-metadata:pom:2.2.0'
in repository central (http://Nexus)
     [java] Downloading: http://repository.sonatype.org:8081/content/groups/sonatype-grid/org/apache/maven/maven-artifact/2.2.0/maven-artifact-2.2.0.pom
     [java] [INFO] Unable to find resource 'org.apache.maven:maven-artifact:pom:2.2.0' in
repository central (http://Nexus)
     [java] Downloading: http://repository.sonatype.org:8081/content/groups/sonatype-grid/edu/umd/cs/mtc/multithreadedtc-jdk14/1.01/multithreadedtc-jdk14-1.01.pom
     [java] 1K downloaded  (multithreadedtc-jdk14-1.01.pom)
     [java] Downloading: http://repository.sonatype.org:8081/content/groups/sonatype-grid/net/sf/retrotranslator/retrotranslator-runtime/1.2.7/retrotranslator-runtime-1.2.7.pom
     [java] 1K downloaded  (retrotranslator-runtime-1.2.7.pom)
     [java] Downloading: http://repository.sonatype.org:8081/content/groups/sonatype-grid/org/apache/maven/maven-repository-metadata/2.2.0/maven-repository-metadata-2.2.0.jar
     [java] Downloading: http://repository.sonatype.org:8081/content/groups/sonatype-grid/easymock/easymock/1.2_Java1.3/easymock-1.2_Java1.3.jar
     [java] Downloading: http://repository.sonatype.org:8081/content/groups/sonatype-grid/edu/umd/cs/mtc/multithreadedtc-jdk14/1.01/multithreadedtc-jdk14-1.01.jar
     [java] Downloading: http://repository.sonatype.org:8081/content/groups/sonatype-grid/net/sf/retrotranslator/retrotranslator-runtime/1.2.7/retrotranslator-runtime-1.2.7.jar
     [java] [INFO] Unable to find resource 'org.apache.maven:maven-repository-metadata:jar:2.2.0'
in repository central (http://Nexus)
     [java] Downloading: http://repository.sonatype.org:8081/content/groups/sonatype-grid/org/apache/maven/maven-artifact/2.2.0/maven-artifact-2.2.0.jar
     [java] 35K downloaded  (easymock-1.2_Java1.3.jar)
     [java] 19K downloaded  (multithreadedtc-jdk14-1.01.jar)
     [java] [INFO] Unable to find resource 'org.apache.maven:maven-artifact:jar:2.2.0' in
repository central (http://Nexus)
     [java] 299K downloaded  (retrotranslator-runtime-1.2.7.jar)
     [java] [INFO] ------------------------------------------------------------------------
     [java] [ERROR] BUILD ERROR
     [java] [INFO] ------------------------------------------------------------------------
     [java] [INFO] Failed to resolve artifact.
     [java] 
     [java] Missing:
     [java] ----------
     [java] 1) org.apache.maven:maven-repository-metadata:jar:2.2.0
     [java] 
     [java]   Try downloading the file manually from the project website.
     [java] 
     [java]   Then, install it using the command: 
     [java]       mvn install:install-file -DgroupId=org.apache.maven -DartifactId=maven-repository-metadata
-Dversion=2.2.0 -Dpackaging=jar -Dfile=/path/to/file
     [java] 
     [java]   Alternatively, if you host your own repository you can deploy the file there:

     [java]       mvn deploy:deploy-file -DgroupId=org.apache.maven -DartifactId=maven-repository-metadata
-Dversion=2.2.0 -Dpackaging=jar -Dfile=/path/to/file -Durl=[url] -DrepositoryId=[id]
     [java] 
     [java]   Path to dependency: 
     [java]   	1) org.apache.maven:maven-artifact-manager:jar:2.2.0-RC5-SNAPSHOT
     [java]   	2) org.apache.maven:maven-repository-metadata:jar:2.2.0
     [java] 
     [java] 2) org.apache.maven:maven-artifact:jar:2.2.0
     [java] 
     [java]   Try downloading the file manually from the project website.
     [java] 
     [java]   Then, install it using the command: 
     [java]       mvn install:install-file -DgroupId=org.apache.maven -DartifactId=maven-artifact
-Dversion=2.2.0 -Dpackaging=jar -Dfile=/path/to/file
     [java] 
     [java]   Alternatively, if you host your own repository you can deploy the file there:

     [java]       mvn deploy:deploy-file -DgroupId=org.apache.maven -DartifactId=maven-artifact
-Dversion=2.2.0 -Dpackaging=jar -Dfile=/path/to/file -Durl=[url] -DrepositoryId=[id]
     [java] 
     [java]   Path to dependency: 
     [java]   	1) org.apache.maven:maven-artifact-manager:jar:2.2.0-RC5-SNAPSHOT
     [java]   	2) org.apache.maven:maven-artifact:jar:2.2.0
     [java] 
     [java] ----------
     [java] 2 required artifacts are missing.
     [java] 
     [java] for artifact: 
     [java]   org.apache.maven:maven-artifact-manager:jar:2.2.0-RC5-SNAPSHOT
     [java] 
     [java] from the specified remote repositories:
     [java]   Nexus (http://repository.sonatype.org:8081/content/groups/sonatype-grid)
     [java] 
     [java] 
     [java] 
     [java] [INFO] ------------------------------------------------------------------------
     [java] [INFO] Trace
     [java] org.apache.maven.lifecycle.LifecycleExecutionException: Missing:
     [java] ----------
     [java] 1) org.apache.maven:maven-repository-metadata:jar:2.2.0
     [java] 
     [java]   Try downloading the file manually from the project website.
     [java] 
     [java]   Then, install it using the command: 
     [java]       mvn install:install-file -DgroupId=org.apache.maven -DartifactId=maven-repository-metadata
-Dversion=2.2.0 -Dpackaging=jar -Dfile=/path/to/file
     [java] 
     [java]   Alternatively, if you host your own repository you can deploy the file there:

     [java]       mvn deploy:deploy-file -DgroupId=org.apache.maven -DartifactId=maven-repository-metadata
-Dversion=2.2.0 -Dpackaging=jar -Dfile=/path/to/file -Durl=[url] -DrepositoryId=[id]
     [java] 
     [java]   Path to dependency: 
     [java]   	1) org.apache.maven:maven-artifact-manager:jar:2.2.0-RC5-SNAPSHOT
     [java]   	2) org.apache.maven:maven-repository-metadata:jar:2.2.0
     [java] 
     [java] 2) org.apache.maven:maven-artifact:jar:2.2.0
     [java] 
     [java]   Try downloading the file manually from the project website.
     [java] 
     [java]   Then, install it using the command: 
     [java]       mvn install:install-file -DgroupId=org.apache.maven -DartifactId=maven-artifact
-Dversion=2.2.0 -Dpackaging=jar -Dfile=/path/to/file
     [java] 
     [java]   Alternatively, if you host your own repository you can deploy the file there:

     [java]       mvn deploy:deploy-file -DgroupId=org.apache.maven -DartifactId=maven-artifact
-Dversion=2.2.0 -Dpackaging=jar -Dfile=/path/to/file -Durl=[url] -DrepositoryId=[id]
     [java] 
     [java]   Path to dependency: 
     [java]   	1) org.apache.maven:maven-artifact-manager:jar:2.2.0-RC5-SNAPSHOT
     [java]   	2) org.apache.maven:maven-artifact:jar:2.2.0
     [java] 
     [java] ----------
     [java] 2 required artifacts are missing.
     [java] 
     [java] for artifact: 
     [java]   org.apache.maven:maven-artifact-manager:jar:2.2.0-RC5-SNAPSHOT
     [java] 
     [java] from the specified remote repositories:
     [java]   Nexus (http://repository.sonatype.org:8081/content/groups/sonatype-grid)
     [java] 
     [java] 
     [java] 	at org.apache.maven.lifecycle.DefaultLifecycleExecutor.executeGoals(DefaultLifecycleExecutor.java:695)
     [java] 	at org.apache.maven.lifecycle.DefaultLifecycleExecutor.executeGoalWithLifecycle(DefaultLifecycleExecutor.java:540)
     [java] 	at org.apache.maven.lifecycle.DefaultLifecycleExecutor.executeGoal(DefaultLifecycleExecutor.java:519)
     [java] 	at org.apache.maven.lifecycle.DefaultLifecycleExecutor.executeGoalAndHandleFailures(DefaultLifecycleExecutor.java:371)
     [java] 	at org.apache.maven.lifecycle.DefaultLifecycleExecutor.executeTaskSegments(DefaultLifecycleExecutor.java:332)
     [java] 	at org.apache.maven.lifecycle.DefaultLifecycleExecutor.execute(DefaultLifecycleExecutor.java:181)
     [java] 	at org.apache.maven.DefaultMaven.doExecute(DefaultMaven.java:356)
     [java] 	at org.apache.maven.DefaultMaven.execute(DefaultMaven.java:137)
     [java] 	at org.apache.maven.cli.MavenCli.main(MavenCli.java:362)
     [java] 	at org.apache.maven.cli.compat.CompatibleMain.main(CompatibleMain.java:41)
     [java] 	at org.apache.maven.cli.compat.CompatibleMain.main(CompatibleMain.java:18)
     [java] Caused by: org.apache.maven.artifact.resolver.MultipleArtifactsNotFoundException:
Missing:
     [java] ----------
     [java] 1) org.apache.maven:maven-repository-metadata:jar:2.2.0
     [java] 
     [java]   Try downloading the file manually from the project website.
     [java] 
     [java]   Then, install it using the command: 
     [java]       mvn install:install-file -DgroupId=org.apache.maven -DartifactId=maven-repository-metadata
-Dversion=2.2.0 -Dpackaging=jar -Dfile=/path/to/file
     [java] 
     [java]   Alternatively, if you host your own repository you can deploy the file there:

     [java]       mvn deploy:deploy-file -DgroupId=org.apache.maven -DartifactId=maven-repository-metadata
-Dversion=2.2.0 -Dpackaging=jar -Dfile=/path/to/file -Durl=[url] -DrepositoryId=[id]
     [java] 
     [java]   Path to dependency: 
     [java]   	1) org.apache.maven:maven-artifact-manager:jar:2.2.0-RC5-SNAPSHOT
     [java]   	2) org.apache.maven:maven-repository-metadata:jar:2.2.0
     [java] 
     [java] 2) org.apache.maven:maven-artifact:jar:2.2.0
     [java] 
     [java]   Try downloading the file manually from the project website.
     [java] 
     [java]   Then, install it using the command: 
     [java]       mvn install:install-file -DgroupId=org.apache.maven -DartifactId=maven-artifact
-Dversion=2.2.0 -Dpackaging=jar -Dfile=/path/to/file
     [java] 
     [java]   Alternatively, if you host your own repository you can deploy the file there:

     [java]       mvn deploy:deploy-file -DgroupId=org.apache.maven -DartifactId=maven-artifact
-Dversion=2.2.0 -Dpackaging=jar -Dfile=/path/to/file -Durl=[url] -DrepositoryId=[id]
     [java] 
     [java]   Path to dependency: 
     [java]   	1) org.apache.maven:maven-artifact-manager:jar:2.2.0-RC5-SNAPSHOT
     [java]   	2) org.apache.maven:maven-artifact:jar:2.2.0
     [java] 
     [java] ----------
     [java] 2 required artifacts are missing.
     [java] 
     [java] for artifact: 
     [java]   org.apache.maven:maven-artifact-manager:jar:2.2.0-RC5-SNAPSHOT
     [java] 
     [java] from the specified remote repositories:
     [java]   Nexus (http://repository.sonatype.org:8081/content/groups/sonatype-grid)
     [java] 
     [java] 
     [java] 	at org.apache.maven.artifact.resolver.DefaultArtifactResolver.resolveTransitively(DefaultArtifactResolver.java:360)
     [java] 	at org.apache.maven.artifact.resolver.DefaultArtifactResolver.resolveTransitively(DefaultArtifactResolver.java:304)
     [java] 	at org.apache.maven.plugin.DefaultPluginManager.resolveTransitiveDependencies(DefaultPluginManager.java:1492)
     [java] 	at org.apache.maven.plugin.DefaultPluginManager.executeMojo(DefaultPluginManager.java:435)
     [java] 	at org.apache.maven.lifecycle.DefaultLifecycleExecutor.executeGoals(DefaultLifecycleExecutor.java:678)
     [java] 	... 10 more
     [java] [INFO] ------------------------------------------------------------------------
     [java] [INFO] Total time: 1 minute 13 seconds
     [java] [INFO] Finished at: Mon Jun 15 14:32:21 PDT 2009
     [java] [INFO] Final Memory: 26M/47M
     [java] [INFO] ------------------------------------------------------------------------

BUILD FAILED
C:\home\hudson\workspace\Maven-2.2.x-bootstrap\jdk\1.5\label\windows\maven-2.2.0-RC\build.xml:187:
Java returned: 1

Total time: 2 minutes 26 seconds
Archiving artifacts


Mime
View raw message