maven-notifications mailing list archives

Site index · List index
Message view « Date » · « Thread »
Top « Date » · « Thread »
From Hudson <Hud...@sonatype.org>
Subject Build failed in Hudson: Maven-2.1.x-bootstrap » 1.5,osx #168
Date Tue, 02 Jun 2009 02:30:13 GMT
See http://grid.sonatype.org/ci/job/Maven-2.1.x-bootstrap/./jdk=1.5,label=osx/168/changes

Changes:

[Benjamin Bentmann] o Added license header

------------------------------------------
[...truncated 5285 lines...]
     [exec] mng3271DefaultReportsSuppression(itMNG3271).................OK (22.5 s)
     [exec] mng3221InfiniteForking(itMNG3221a)..........................OK (218.1 s)
     [exec] mng3221InfiniteForking(itMNG3221b)..........................OK (140.8 s)
     [exec] mng3268MultipleDashPCommandLine(MultipleProfileParams)......OK (55.6 s)
     [exec] mng3259DepsDroppedInMultiModuleBuild(itMNG3259).............OK (182.6 s)
     [exec] mng3220ImportScope(itMNG3220a)..............................OK (17.5 s)
     [exec] mng3220ImportScope(itMNG3220b)..............................OK (17.6 s)
     [exec] mng3217InterPluginDependency(itMNG3217).....................OK (24.8 s)
     [exec] mng3139UseCachedMetadataOfBlacklistedRepo(itMNG3139)........OK (44.9 s)
     [exec] mng3118TestClassPathOrder(it)...............................OK (25.2 s)
     [exec] mng3106ProfileMultipleActivators(ProfilesWithMultipleActivators)..OK (27.7 s)
     [exec] mng3099SettingsProfilesWithNoPom(itMNG3099).................OK (109.6 s)
     [exec] mng3057VersionExprTransformations(itMNG3057)................OK (30.7 s)
     [exec] mng3052DepRepoAggregation(itMNG3052)........................OK (24.6 s)
     [exec] mng3023ReactorDependencyResolution(itMNG3023A)..............OK (23.7 s)
     [exec] mng3023ReactorDependencyResolution(itMNG3023B)..............OK (26.9 s)
     [exec] mng3023ReactorDependencyResolution(itMNG3023C)..............OK (52.8 s)
     [exec] mng3012CoreClassImport(itMNG3012)...........................OK (23.8 s)
     [exec] mng2972OverridePluginDependency(itLifecycleInvocation)......OK (19.6 s)
     [exec] mng2972OverridePluginDependency(itCommandLineInvocation)....OK (19.9 s)
     [exec] mng2926PluginPrefixOrder(itMNG2926).........................OK (39.3 s)
     [exec] mng2921ActiveAttachedArtifacts(itMNG2921)...................OK (26.8 s)
     [exec] mng2892HideCorePlexusUtils(itMNG2892).......................OK (20.4 s)
     [exec] mng2883LegacyRepoOffline(ParentUnresolvable)................OK (46.3 s)
     [exec] mng2883LegacyRepoOffline(DependencyUnresolvable)............OK (61.8 s)
     [exec] mng2883LegacyRepoOffline(PluginUnresolvable)................OK (53.3 s)
     [exec] mng2878DefaultReportXmlImport(itMNG2878)....................OK (446.4 s)
     [exec] mng2871PrePackageSubartifactResolution(itMNG2871)...........SKIPPED - version
2.1.1-SNAPSHOT not in range [3.0-alpha-1,)
     [exec] mng2865MirrorWildcard(itFileRepo)...........................OK (22.8 s)
     [exec] mng2865MirrorWildcard(itLocalhostRepo)......................OK (24.2 s)
     [exec] mng2865MirrorWildcard(itExternalRepo).......................OK (21.3 s)
     [exec] mng2865MirrorWildcard(itCentralRepo)........................OK (21.1 s)
     [exec] mng2861RelocationsAndRanges(itMNG2861)......................OK (31.9 s)
     [exec] mng2843PluginConfigPropertiesInjection(itMNG2843)...........OK (25.9 s)
     [exec] mng2831CustomArtifactHandlerAndCustomLifecycle(itMNG2831)...OK (24.0 s)
     [exec] mng2820PomComments(it)......................................OK (33.2 s)
     [exec] mng2790LastUpdatedMetadata(itMNG2790).......................OK (61.3 s)
     [exec] mng2749ExtensionAvailableToPlugin(itMNG2749)................OK (21.6 s)
     [exec] mng2744checksumVerification(itMNG2744)......................OK (21.8 s)
     [exec] mng2739RequiredRepositoryElements(itMNG2739_RepositoryId)...OK (16.1 s)
     [exec] mng2739RequiredRepositoryElements(itMNG2739_RepositoryUrl)..OK (16.7 s)
     [exec] mng2720SiblingClasspathArtifacts(IT)........................OK (28.5 s)
     [exec] mng2695OfflinePluginSnapshots(itMNG2695)....................OK (42.1 s)
     [exec] mng2690MojoLoadingErrors(NoClassDefFromMojoLoad)............OK (20.3 s)
     [exec] mng2690MojoLoadingErrors(NoClassDefFromMojoConfiguration)...OK (23.8 s)
     [exec] mng2690MojoLoadingErrors(MojoComponentLookupException)......OK (23.2 s)
     [exec] mng2690MojoLoadingErrors(MojoRequirementComponentLookupException)..OK (23.8 s)
     [exec] mng2668UsePluginDependenciesForSorting(itMNG2668)...........OK (23.7 s)
     [exec] mng2605BogusProfileActivation(itMNG2605)....................OK (20.4 s)
     [exec] mng2591MergeInheritedPluginConfig(itNoProfile)..............OK (23.4 s)
     [exec] mng2591MergeInheritedPluginConfig(itWithProfile)............OK (22.7 s)
     [exec] mng2562Timestamp(itMNG2562).................................OK (23.7 s)
     [exec] mng2539PluginDependenciesComeFromPluginRepos(itMNG2539).....OK (22.9 s)
     [exec] mng2432PluginPrefixOrder(itMNG2432).........................OK (21.6 s)
     [exec] mng2387InactiveProxy(it)....................................OK (24.5 s)
     [exec] mng2362DeployedPomEncoding(it)..............................OK (32.4 s)
     [exec] mng2339BadProjectInterpolation(itMNG2339a)..................OK (29.6 s)
     [exec] mng2339BadProjectInterpolation(itMNG2339b)..................OK (54.2 s)
     [exec] mng2318LocalParentResolution(itMNG2318).....................OK (15.7 s)
     [exec] mng2309ProfileInjectionOrder(itMNG2309).....................OK (20.1 s)
     [exec] mng2293CustomPluginParamImpl(itMNG2293).....................OK (22.7 s)
     [exec] mng2277AggregatorAndResolutionPlugins(itMNG2277)............OK (23.0 s)
     [exec] mng2254PomEncoding(itMNG2254)...............................OK (22.9 s)
     [exec] mng2234ActiveProfilesFromSettings(itMNG2234)................OK (22.4 s)
     [exec] mng2228ComponentInjection(itMNG2228)........................OK (25.7 s)
     [exec] mng2201PluginConfigInterpolation(itMNG2201).................OK (22.7 s)
     [exec] mng2196ParentResolution(itMNG2196)..........................OK (16.4 s)
     [exec] mng2174PluginDepsManagedByParentProfile(itMNG2174)..........OK (22.0 s)
     [exec] mng2136ActiveByDefaultProfile(itMNG2136)....................OK (19.7 s)
     [exec] mng2130ParentLookupFromReactorCache(itMNG2130)..............OK (16.5 s)
     [exec] mng2124PomInterpolationWithParentValues(itMNG2124)..........OK (21.9 s)
     [exec] mng2123VersionRangeDependency(itMNG2123)....................OK (22.2 s)
     [exec] mng2068ReactorRelativeParents(itInheritedIdFields)..........OK (15.3 s)
     [exec] mng2068ReactorRelativeParents(itExplicitIdFields)...........OK (15.9 s)
     [exec] mng2068ReactorRelativeParents(itComplex)....................OK (17.1 s)
     [exec] mng2054PluginExecutionInheritance(itMNG2054)................OK (22.4 s)
     [exec] mng2052InterpolateWithSettingsProfileProperties(itMNG2052)..OK (20.0 s)
     [exec] mng2045testJarDependenciesBrokenInReactor(itMNG2045)........OK (28.9 s)
     [exec] mng2006ChildPathAwareUrlInheritance(itMNG2006)..............OK (22.4 s)
     [exec] mng1999DefaultReportsInheritance(itInheritSuppression)......OK (22.9 s)
     [exec] mng1999DefaultReportsInheritance(itOverrideSuppression).....OK (91.9 s)
     [exec] mng1995InterpolateBooleanModelElements(itMNG1995)...........SKIPPED - version
2.1.1-SNAPSHOT not in range [3.0-alpha-1,)
     [exec] mng1992SystemPropOverridesPomProp(itMNG1992)................OK (22.6 s)
     [exec] mng1957JdkActivationWithVersionRange(itMNG1957).............OK (20.1 s)
     [exec] mng1908LegacySnapshotUpdate(itMNG1908)......................OK (21.9 s)
     [exec] mng1830ShowVersion(Version).................................OK (15.7 s)
     [exec] mng1703PluginMgmtDepInheritance(itMNG1703)..................OK (22.2 s)
     [exec] mng1493NonStandardModulePomNames(itMNG1493).................OK (16.3 s)
     [exec] mng1491ReactorArtifactIdCollision(itMNG1491)................OK (16.6 s)
     [exec] mng1415QuotedSystemProperties(itMNG1415)....................OK (24.4 s)
     [exec] mng1412DependenciesOrder(itMNG1412).........................OK (25.8 s)
     [exec] mng1349ChecksumFormats(itMNG1349)...........................OK (25.3 s)
     [exec] mng1323AntrunDependencies(itMNG1323)........................SKIPPED - version
2.1.1-SNAPSHOT not in range [3.0-alpha-1,)
     [exec] mng1233WarDepWithProvidedScope(itMNG1233)...................OK (23.8 s)
     [exec] mng1088ReactorPluginResolution(itMNG1088)...................OK (21.2 s)
     [exec] mng1052PluginMngtConfig(itMNG1052)..........................OK (26.4 s)
     [exec] mng1021EqualAttachmentBuildNumber(itMNG1021)................OK (27.9 s)
     [exec] mng0985NonExecutedPluginMngtGoals(itMNG0985)................OK (15.3 s)
     [exec] mng0956ComponentInjectionViaProjectLevelPluginDep(itMNG0956)..OK (22.5 s)
     [exec] mng0947OptionalDependency(it)...............................OK (22.9 s)
     [exec] mng0870ReactorAwarePluginDiscovery(itMNG0870)...............OK (26.3 s)
     [exec] mng0866EvaluateDefaultValue(itMNG866).......................OK (22.9 s)
     [exec] mng0848SystemPropOverridesDefaultValue(itMNG848)............OK (25.1 s)
     [exec] mng0836PluginParentResolution(itMNG836).....................OK (20.6 s)
     [exec] mng0823MojoContextPassing(itMNG0823)........................OK (23.2 s)
     [exec] mng0820ConflictResolution(itMNG0820)........................OK (23.2 s)
     [exec] mng0818WarDepsNotTransitive(itMNG0818)......................OK (20.6 s)
     [exec] mng0814ExplicitProfileActivation(itMNG814)..................OK (22.0 s)
     [exec] mng0786ProfileAwareReactor(itMNG0786).......................OK (25.7 s)
     [exec] mng0781PluginConfigVsExecConfig(itMNG0781)..................OK (25.9 s)
     [exec] mng0773SettingsProfileReactorPollution(itMNG773)............OK (17.5 s)
     [exec] mng0768OfflineMode(itMNG768)................................OK (61.4 s)
     [exec] mng0761MissingSnapshotDistRepo(itMNG761)....................OK (24.1 s)
     [exec] mng0731LegacyRepoLayout(itMNG731)...........................OK (26.5 s)
     [exec] mng0680ParentBasedir(itMNG680)..............................OK (22.7 s)
     [exec] mng0674PluginParameterAlias(itMNG674).......................OK (26.0 s)
     [exec] mng0666IgnoreLegacyPom(itMNG666)............................OK (21.1 s)
     [exec] mng0557UserSettingsCliOption(itMNG557)......................OK (22.0 s)
     [exec] mng0553SettingsAuthzEncryption(itBasic).....................OK (27.1 s)
     [exec] mng0553SettingsAuthzEncryption(itRelocation)................OK (26.7 s)
     [exec] mng0522PluginMgmtConfig(itMNG522)...........................OK (26.5 s)
     [exec] mng0507ArtifactRelocation(itMNG507).........................OK (22.6 s)
     [exec] mng0505VersionRange(itMNG505)...............................OK (21.5 s)
     [exec] mng0496IgnoreUnknownPluginParameters(itMNG496)..............OK (22.1 s)
     [exec] mng0479OverrideCentralRepo(itMNG479)........................OK (39.8 s)
     [exec] mng0471CustomLifecycle(itMNG471)............................OK (25.2 s)
     [exec] mng0469ReportConfig(itReportConfigOverridesBuildDefaults)...OK (23.3 s)
     [exec] mng0469ReportConfig(itBuildConfigDominantDuringBuild).......OK (27.7 s)
     [exec] mng0469ReportConfig(itBuildConfigIrrelevantForReports)......OK (28.7 s)
     [exec] mng0449PluginVersionResolution(itLifecycleInvocation).......OK (23.2 s)
     [exec] mng0449PluginVersionResolution(itCliInvocation).............OK (20.7 s)
     [exec] mng0377PluginLookupFromPrefix(itMNG377).....................OK (21.5 s)
     [exec] mng0294MergeGlobalAndUserSettings(itMNG294).................OK (27.5 s)
     [exec] mng0282NonReactorExecWhenProjectIndependent(itMNG282).......OK (24.7 s)
     [exec] mng0249ResolveDepsFromReactor(itMNG0249)....................OK (26.6 s)
     [exec] mng0095ReactorFailureBehavior(itFailFast)...................OK (24.9 s)
     [exec] mng0095ReactorFailureBehavior(itFailNever)..................OK (25.1 s)
     [exec] mng0095ReactorFailureBehavior(itFailAtEnd)..................OK (26.4 s)
     [exec] 0144LifecycleExecutionOrder(it0144).........................OK (42.4 s)
     [exec] 0143TransitiveDependencyScopes(itCompileScope)..............OK (22.3 s)
     [exec] 0143TransitiveDependencyScopes(itProvidedScope).............OK (23.0 s)
     [exec] 0143TransitiveDependencyScopes(itRuntimeScope)..............OK (22.6 s)
     [exec] 0143TransitiveDependencyScopes(itTestScope).................OK (22.8 s)
     [exec] 0142DirectDependencyScopes(it0142)..........................OK (22.5 s)
     [exec] 0140(it0140)................................................OK (22.5 s)
     [exec] 0139(it0139)................................................OK (21.6 s)
     [exec] 0138PluginLifecycle(it0138).................................OK (35.5 s)
     [exec] 0137EarLifecycle(it0137)....................................OK (32.5 s)
     [exec] 0136RarLifecycle(it0136)....................................OK (34.4 s)
     [exec] 0135EjbLifecycle(it0135)....................................OK (34.9 s)
     [exec] 0134WarLifecycle(it0134)....................................OK (34.6 s)
     [exec] 0133JarLifecycle(it0133)....................................OK (34.4 s)
     [exec] 0132PomLifecycle(it0132)....................................OK (26.8 s)
     [exec] 0131SiteLifecycle(it0131)...................................OK (22.2 s)
     [exec] 0130CleanLifecycle(it0130)..................................OK (25.3 s)
     [exec] 0113ServerAuthzAvailableToWagonMgrInPlugin(it0113)..........OK (21.8 s)
     [exec] 0090(it0090)................................................OK (23.4 s)
     [exec] 0087(it0087)................................................OK (23.2 s)
     [exec] 0086(it0086)................................................OK (24.3 s)
     [exec] 0085(it0085)................................................OK (20.4 s)
     [exec] 0072(it0072)................................................OK (20.7 s)
     [exec] 0071(it0071)................................................OK (25.0 s)
     [exec] 0064(it0064)................................................OK (23.0 s)
     [exec] 0063(it0063)................................................OK (23.3 s)
     [exec] 0056(it0056)................................................OK (23.7 s)
     [exec] 0052(it0052)................................................OK (31.6 s)
     [exec] 0051(it0051)................................................OK (36.4 s)
     [exec] 0041(it0041)................................................OK (26.9 s)
     [exec] 0040(it0040)................................................OK (22.6 s)
     [exec] 0039(it0039)................................................OK (20.5 s)
     [exec] 0038(it0038)................................................OK (22.6 s)
     [exec] 0037(it0037)................................................OK (21.2 s)
     [exec] 0036(it0036)................................................OK (20.7 s)
     [exec] 0032(it0032)................................................OK (16.8 s)
     [exec] 0030(it0030)................................................OK (86.5 s)
     [exec] 0025(it0025)................................................OK (25.0 s)
     [exec] 0024(it0024)................................................OK (21.0 s)
     [exec] 0023(it0023)................................................OK (21.7 s)
     [exec] 0021(it0021)................................................OK (22.4 s)
     [exec] 0019(it0019)................................................OK (28.9 s)
     [exec] 0018(it0018)................................................OK (21.7 s)
     [exec] 0012(it0012)................................................OK (24.0 s)
     [exec] 0011(it0011)................................................OK (21.7 s)
     [exec] 0010(it0010)................................................OK (20.9 s)
     [exec] 0009(it0009)................................................OK (24.7 s)
     [exec] 0008(it0008)................................................OK (23.8 s)
     [exec] Tests run: 376, Failures: 1, Errors: 0, Skipped: 0, Time elapsed: 15,024.621 sec
<<< FAILURE!
     [exec] testIt(org.apache.maven.it.MavenITmng4167PluginAndCoordXFormPOMTest)  Time elapsed:
61.702 sec  <<< FAILURE!
     [exec] junit.framework.AssertionFailedError
     [exec] 	at junit.framework.Assert.fail(Assert.java:47)
     [exec] 	at junit.framework.Assert.assertTrue(Assert.java:20)
     [exec] 	at junit.framework.Assert.assertFalse(Assert.java:34)
     [exec] 	at junit.framework.Assert.assertFalse(Assert.java:41)
     [exec] 	at org.apache.maven.it.MavenITmng4167PluginAndCoordXFormPOMTest.testIt(MavenITmng4167PluginAndCoordXFormPOMTest.java:70)
     [exec] 
     [exec] 
     [exec] Results :
     [exec] 
     [exec] Failed tests: 
     [exec]   testIt(org.apache.maven.it.MavenITmng4167PluginAndCoordXFormPOMTest)
     [exec] 
     [exec] Tests run: 376, Failures: 1, Errors: 0, Skipped: 0
     [exec] 
     [exec] [INFO] ------------------------------------------------------------------------
     [exec] [ERROR] BUILD FAILURE
     [exec] [INFO] ------------------------------------------------------------------------
     [exec] [INFO] There are test failures.
     [exec] 
     [exec] Please refer to /private/tmp/maven-integration-tests-2.1.x/core-it-suite/target/surefire-reports
for the individual test results.
     [exec] [INFO] ------------------------------------------------------------------------
     [exec] [INFO] Trace
     [exec] org.apache.maven.BuildFailureException: There are test failures.
     [exec] 
     [exec] Please refer to /private/tmp/maven-integration-tests-2.1.x/core-it-suite/target/surefire-reports
for the individual test results.
     [exec] 	at org.apache.maven.lifecycle.DefaultLifecycleExecutor.executeGoals(DefaultLifecycleExecutor.java:699)
     [exec] 	at org.apache.maven.lifecycle.DefaultLifecycleExecutor.executeGoalWithLifecycle(DefaultLifecycleExecutor.java:540)
     [exec] 	at org.apache.maven.lifecycle.DefaultLifecycleExecutor.executeGoal(DefaultLifecycleExecutor.java:519)
     [exec] 	at org.apache.maven.lifecycle.DefaultLifecycleExecutor.executeGoalAndHandleFailures(DefaultLifecycleExecutor.java:371)
     [exec] 	at org.apache.maven.lifecycle.DefaultLifecycleExecutor.executeTaskSegments(DefaultLifecycleExecutor.java:332)
     [exec] 	at org.apache.maven.lifecycle.DefaultLifecycleExecutor.execute(DefaultLifecycleExecutor.java:181)
     [exec] 	at org.apache.maven.DefaultMaven.doExecute(DefaultMaven.java:356)
     [exec] 	at org.apache.maven.DefaultMaven.execute(DefaultMaven.java:137)
     [exec] 	at org.apache.maven.cli.MavenCli.main(MavenCli.java:356)
     [exec] 	at sun.reflect.NativeMethodAccessorImpl.invoke0(Native Method)
     [exec] 	at sun.reflect.NativeMethodAccessorImpl.invoke(NativeMethodAccessorImpl.java:39)
     [exec] 	at sun.reflect.DelegatingMethodAccessorImpl.invoke(DelegatingMethodAccessorImpl.java:25)
     [exec] 	at java.lang.reflect.Method.invoke(Method.java:585)
     [exec] 	at org.codehaus.classworlds.Launcher.launchEnhanced(Launcher.java:315)
     [exec] 	at org.codehaus.classworlds.Launcher.launch(Launcher.java:255)
     [exec] 	at org.codehaus.classworlds.Launcher.mainWithExitCode(Launcher.java:430)
     [exec] 	at org.codehaus.classworlds.Launcher.main(Launcher.java:375)
     [exec] Caused by: org.apache.maven.plugin.MojoFailureException: There are test failures.
     [exec] 
     [exec] Please refer to /private/tmp/maven-integration-tests-2.1.x/core-it-suite/target/surefire-reports
for the individual test results.
     [exec] 	at org.apache.maven.plugin.surefire.SurefirePlugin.execute(SurefirePlugin.java:575)
     [exec] 	at org.apache.maven.plugin.DefaultPluginManager.executeMojo(DefaultPluginManager.java:483)
     [exec] 	at org.apache.maven.lifecycle.DefaultLifecycleExecutor.executeGoals(DefaultLifecycleExecutor.java:678)
     [exec] 	... 16 more
     [exec] [INFO] ------------------------------------------------------------------------
     [exec] [INFO] Total time: 262 minutes 9 seconds
     [exec] [INFO] Finished at: Mon Jun 01 21:28:58 CDT 2009
     [exec] [INFO] Final Memory: 32M/66M
     [exec] [INFO] ------------------------------------------------------------------------

BUILD FAILED
http://grid.sonatype.org/ci/job/Maven-2.1.x-bootstrap/./jdk=1.5,label=osx/ws/maven-2.1.x/build.xml
:291: exec returned: 1

Total time: 305 minutes 22 seconds
Archiving artifacts


Mime
View raw message