maven-notifications mailing list archives

Site index · List index
Message view « Date » · « Thread »
Top « Date » · « Thread »
From Hudson <Hud...@sonatype.org>
Subject Build failed in Hudson: Maven-2.2.x-bootstrap » 1.5,windows #12
Date Thu, 11 Jun 2009 01:28:55 GMT
See http://grid.sonatype.org/ci/job/Maven-2.2.x-bootstrap/./jdk=1.5,label=windows/12/changes

Changes:

[John Casey] [maven-release-plugin] prepare for next development iteration

[John Casey] [maven-release-plugin] prepare release maven-2.2.0-RC3

[John Casey] modify excludes for clirr, and add a workaround clirr config to compensate for
the fact that maven-compat doesn't exist in 2.1.0

------------------------------------------
[...truncated 156 lines...]
     [java] [INFO] [surefire:test {execution: default-test}]
     [java] [INFO] Surefire report directory: C:\home\hudson\workspace\Maven-2.2.x-bootstrap\jdk\1.5\label\windows\maven-2.2.0-RC\maven-artifact\target\surefire-reports
     [java] 
     [java] -------------------------------------------------------
     [java]  T E S T S
     [java] -------------------------------------------------------
     [java] Running org.apache.maven.artifact.factory.DefaultArtifactFactoryTest
     [java] Tests run: 1, Failures: 0, Errors: 0, Skipped: 0, Time elapsed: 0.399 sec
     [java] Running org.apache.maven.artifact.DefaultArtifactTest
     [java] Tests run: 9, Failures: 0, Errors: 0, Skipped: 0, Time elapsed: 0.015 sec
     [java] Running org.apache.maven.artifact.ArtifactUtilsTest
     [java] Tests run: 2, Failures: 0, Errors: 0, Skipped: 0, Time elapsed: 0.01 sec
     [java] Running org.apache.maven.artifact.resolver.ArtifactResolutionExceptionTest
     [java] Tests run: 1, Failures: 0, Errors: 0, Skipped: 0, Time elapsed: 0.008 sec
     [java] Running org.apache.maven.artifact.resolver.DefaultArtifactCollectorTest
     [java] Tests run: 33, Failures: 0, Errors: 0, Skipped: 0, Time elapsed: 0.666 sec
     [java] Running org.apache.maven.artifact.versioning.VersionRangeTest
     [java] Tests run: 3, Failures: 0, Errors: 0, Skipped: 0, Time elapsed: 0.008 sec
     [java] Running org.apache.maven.artifact.versioning.DefaultArtifactVersionTest
     [java] Tests run: 8, Failures: 0, Errors: 0, Skipped: 0, Time elapsed: 0.009 sec
     [java] 
     [java] Results :
     [java] 
     [java] Tests run: 57, Failures: 0, Errors: 0, Skipped: 0
     [java] 
     [java] [INFO] [jar:jar {execution: default-jar}]
     [java] [INFO] Building jar: C:\home\hudson\workspace\Maven-2.2.x-bootstrap\jdk\1.5\label\windows\maven-2.2.0-RC\maven-artifact\target\maven-artifact-2.2.0-RC4-SNAPSHOT.jar
     [java] [INFO] [install:install {execution: default-install}]
     [java] [INFO] Installing C:\home\hudson\workspace\Maven-2.2.x-bootstrap\jdk\1.5\label\windows\maven-2.2.0-RC\maven-artifact\target\maven-artifact-2.2.0-RC4-SNAPSHOT.jar
to C:\opt\repos\bootstrap-maven-2.1.x\org\apache\maven\maven-artifact\2.2.0-RC4-SNAPSHOT\maven-artifact-2.2.0-RC4-SNAPSHOT.jar
     [java] [INFO] ------------------------------------------------------------------------
     [java] [INFO] Building Maven Repository Metadata Model
     [java] [INFO]    task-segment: [clean, install]
     [java] [INFO] ------------------------------------------------------------------------
     [java] [INFO] [clean:clean {execution: default-clean}]
     [java] [INFO] Deleting directory C:\home\hudson\workspace\Maven-2.2.x-bootstrap\jdk\1.5\label\windows\maven-2.2.0-RC\maven-repository-metadata\target
     [java] [INFO] Deleting directory C:\home\hudson\workspace\Maven-2.2.x-bootstrap\jdk\1.5\label\windows\maven-2.2.0-RC\maven-repository-metadata\target\classes
     [java] [INFO] Deleting directory C:\home\hudson\workspace\Maven-2.2.x-bootstrap\jdk\1.5\label\windows\maven-2.2.0-RC\maven-repository-metadata\target\test-classes
     [java] [INFO] Deleting directory C:\home\hudson\workspace\Maven-2.2.x-bootstrap\jdk\1.5\label\windows\maven-2.2.0-RC\maven-repository-metadata\target\site
     [java] [INFO] [enforcer:enforce {execution: enforce-jdk}]
     [java] [INFO] [modello:java {execution: standard}]
     [java] [INFO] outputDirectory: C:\home\hudson\workspace\Maven-2.2.x-bootstrap\jdk\1.5\label\windows\maven-2.2.0-RC\maven-repository-metadata\target\generated-sources\modello
     [java] [INFO] Working on model: src/main/mdo/metadata.mdo
     [java] [INFO] Generating current version: 1.0.0
     [java] [INFO] [modello:xpp3-reader {execution: standard}]
     [java] [INFO] outputDirectory: C:\home\hudson\workspace\Maven-2.2.x-bootstrap\jdk\1.5\label\windows\maven-2.2.0-RC\maven-repository-metadata\target\generated-sources\modello
     [java] [INFO] Working on model: src/main/mdo/metadata.mdo
     [java] [INFO] Generating current version: 1.0.0
     [java] [INFO] [modello:xpp3-writer {execution: standard}]
     [java] [INFO] outputDirectory: C:\home\hudson\workspace\Maven-2.2.x-bootstrap\jdk\1.5\label\windows\maven-2.2.0-RC\maven-repository-metadata\target\generated-sources\modello
     [java] [INFO] Working on model: src/main/mdo/metadata.mdo
     [java] [INFO] Generating current version: 1.0.0
     [java] [INFO] [remote-resources:process {execution: default}]
     [java] [INFO] [resources:resources {execution: default-resources}]
     [java] [INFO] Using encoding: 'UTF-8' to copy filtered resources.
     [java] [INFO] [compiler:compile {execution: default-compile}]
     [java] [INFO] Compiling 6 source files to C:\home\hudson\workspace\Maven-2.2.x-bootstrap\jdk\1.5\label\windows\maven-2.2.0-RC\maven-repository-metadata\target\classes
     [java] [INFO] [resources:testResources {execution: default-testResources}]
     [java] [INFO] Using encoding: 'UTF-8' to copy filtered resources.
     [java] [INFO] [compiler:testCompile {execution: default-testCompile}]
     [java] [INFO] No sources to compile
     [java] [INFO] [surefire:test {execution: default-test}]
     [java] [INFO] Surefire report directory: C:\home\hudson\workspace\Maven-2.2.x-bootstrap\jdk\1.5\label\windows\maven-2.2.0-RC\maven-repository-metadata\target\surefire-reports
     [java] 
     [java] -------------------------------------------------------
     [java]  T E S T S
     [java] -------------------------------------------------------
     [java] There are no tests to run.
     [java] 
     [java] Results :
     [java] 
     [java] Tests run: 0, Failures: 0, Errors: 0, Skipped: 0
     [java] 
     [java] [INFO] [jar:jar {execution: default-jar}]
     [java] [INFO] Building jar: C:\home\hudson\workspace\Maven-2.2.x-bootstrap\jdk\1.5\label\windows\maven-2.2.0-RC\maven-repository-metadata\target\maven-repository-metadata-2.2.0-RC4-SNAPSHOT.jar
     [java] [INFO] [install:install {execution: default-install}]
     [java] [INFO] Installing C:\home\hudson\workspace\Maven-2.2.x-bootstrap\jdk\1.5\label\windows\maven-2.2.0-RC\maven-repository-metadata\target\maven-repository-metadata-2.2.0-RC4-SNAPSHOT.jar
to C:\opt\repos\bootstrap-maven-2.1.x\org\apache\maven\maven-repository-metadata\2.2.0-RC4-SNAPSHOT\maven-repository-metadata-2.2.0-RC4-SNAPSHOT.jar
     [java] [INFO] ------------------------------------------------------------------------
     [java] [INFO] Building Maven Artifact Manager
     [java] [INFO]    task-segment: [clean, install]
     [java] [INFO] ------------------------------------------------------------------------
     [java] [INFO] [clean:clean {execution: default-clean}]
     [java] [INFO] Deleting directory C:\home\hudson\workspace\Maven-2.2.x-bootstrap\jdk\1.5\label\windows\maven-2.2.0-RC\maven-artifact-manager\target
     [java] [INFO] Deleting directory C:\home\hudson\workspace\Maven-2.2.x-bootstrap\jdk\1.5\label\windows\maven-2.2.0-RC\maven-artifact-manager\target\classes
     [java] [INFO] Deleting directory C:\home\hudson\workspace\Maven-2.2.x-bootstrap\jdk\1.5\label\windows\maven-2.2.0-RC\maven-artifact-manager\target\test-classes
     [java] [INFO] Deleting directory C:\home\hudson\workspace\Maven-2.2.x-bootstrap\jdk\1.5\label\windows\maven-2.2.0-RC\maven-artifact-manager\target\site
     [java] Downloading: http://repository.sonatype.org:8081/content/groups/sonatype-grid/org/apache/maven/maven-repository-metadata/2.2.0-RC3/maven-repository-metadata-2.2.0-RC3.pom
     [java] [INFO] Unable to find resource 'org.apache.maven:maven-repository-metadata:pom:2.2.0-RC3'
in repository central (http://Nexus)
     [java] Downloading: http://repository.sonatype.org:8081/content/groups/sonatype-grid/org/apache/maven/maven-artifact/2.2.0-RC3/maven-artifact-2.2.0-RC3.pom
     [java] [INFO] Unable to find resource 'org.apache.maven:maven-artifact:pom:2.2.0-RC3'
in repository central (http://Nexus)
     [java] Downloading: http://repository.sonatype.org:8081/content/groups/sonatype-grid/org/apache/maven/maven-repository-metadata/2.2.0-RC3/maven-repository-metadata-2.2.0-RC3.jar
     [java] [INFO] Unable to find resource 'org.apache.maven:maven-repository-metadata:jar:2.2.0-RC3'
in repository central (http://Nexus)
     [java] Downloading: http://repository.sonatype.org:8081/content/groups/sonatype-grid/org/apache/maven/maven-artifact/2.2.0-RC3/maven-artifact-2.2.0-RC3.jar
     [java] [INFO] Unable to find resource 'org.apache.maven:maven-artifact:jar:2.2.0-RC3'
in repository central (http://Nexus)
     [java] [INFO] ------------------------------------------------------------------------
     [java] [ERROR] BUILD ERROR
     [java] [INFO] ------------------------------------------------------------------------
     [java] [INFO] Failed to resolve artifact.
     [java] 
     [java] Missing:
     [java] ----------
     [java] 1) org.apache.maven:maven-repository-metadata:jar:2.2.0-RC3
     [java] 
     [java]   Try downloading the file manually from the project website.
     [java] 
     [java]   Then, install it using the command: 
     [java]       mvn install:install-file -DgroupId=org.apache.maven -DartifactId=maven-repository-metadata
-Dversion=2.2.0-RC3 -Dpackaging=jar -Dfile=/path/to/file
     [java] 
     [java]   Alternatively, if you host your own repository you can deploy the file there:

     [java]       mvn deploy:deploy-file -DgroupId=org.apache.maven -DartifactId=maven-repository-metadata
-Dversion=2.2.0-RC3 -Dpackaging=jar -Dfile=/path/to/file -Durl=[url] -DrepositoryId=[id]
     [java] 
     [java]   Path to dependency: 
     [java]   	1) org.apache.maven:maven-artifact-manager:jar:2.2.0-RC4-SNAPSHOT
     [java]   	2) org.apache.maven:maven-repository-metadata:jar:2.2.0-RC3
     [java] 
     [java] 2) org.apache.maven:maven-artifact:jar:2.2.0-RC3
     [java] 
     [java]   Try downloading the file manually from the project website.
     [java] 
     [java]   Then, install it using the command: 
     [java]       mvn install:install-file -DgroupId=org.apache.maven -DartifactId=maven-artifact
-Dversion=2.2.0-RC3 -Dpackaging=jar -Dfile=/path/to/file
     [java] 
     [java]   Alternatively, if you host your own repository you can deploy the file there:

     [java]       mvn deploy:deploy-file -DgroupId=org.apache.maven -DartifactId=maven-artifact
-Dversion=2.2.0-RC3 -Dpackaging=jar -Dfile=/path/to/file -Durl=[url] -DrepositoryId=[id]
     [java] 
     [java]   Path to dependency: 
     [java]   	1) org.apache.maven:maven-artifact-manager:jar:2.2.0-RC4-SNAPSHOT
     [java]   	2) org.apache.maven:maven-artifact:jar:2.2.0-RC3
     [java] 
     [java] ----------
     [java] 2 required artifacts are missing.
     [java] 
     [java] for artifact: 
     [java]   org.apache.maven:maven-artifact-manager:jar:2.2.0-RC4-SNAPSHOT
     [java] 
     [java] from the specified remote repositories:
     [java]   Nexus (http://repository.sonatype.org:8081/content/groups/sonatype-grid)
     [java] 
     [java] 
     [java] 
     [java] [INFO] ------------------------------------------------------------------------
     [java] [INFO] Trace
     [java] org.apache.maven.lifecycle.LifecycleExecutionException: Missing:
     [java] ----------
     [java] 1) org.apache.maven:maven-repository-metadata:jar:2.2.0-RC3
     [java] 
     [java]   Try downloading the file manually from the project website.
     [java] 
     [java]   Then, install it using the command: 
     [java]       mvn install:install-file -DgroupId=org.apache.maven -DartifactId=maven-repository-metadata
-Dversion=2.2.0-RC3 -Dpackaging=jar -Dfile=/path/to/file
     [java] 
     [java]   Alternatively, if you host your own repository you can deploy the file there:

     [java]       mvn deploy:deploy-file -DgroupId=org.apache.maven -DartifactId=maven-repository-metadata
-Dversion=2.2.0-RC3 -Dpackaging=jar -Dfile=/path/to/file -Durl=[url] -DrepositoryId=[id]
     [java] 
     [java]   Path to dependency: 
     [java]   	1) org.apache.maven:maven-artifact-manager:jar:2.2.0-RC4-SNAPSHOT
     [java]   	2) org.apache.maven:maven-repository-metadata:jar:2.2.0-RC3
     [java] 
     [java] 2) org.apache.maven:maven-artifact:jar:2.2.0-RC3
     [java] 
     [java]   Try downloading the file manually from the project website.
     [java] 
     [java]   Then, install it using the command: 
     [java]       mvn install:install-file -DgroupId=org.apache.maven -DartifactId=maven-artifact
-Dversion=2.2.0-RC3 -Dpackaging=jar -Dfile=/path/to/file
     [java] 
     [java]   Alternatively, if you host your own repository you can deploy the file there:

     [java]       mvn deploy:deploy-file -DgroupId=org.apache.maven -DartifactId=maven-artifact
-Dversion=2.2.0-RC3 -Dpackaging=jar -Dfile=/path/to/file -Durl=[url] -DrepositoryId=[id]
     [java] 
     [java]   Path to dependency: 
     [java]   	1) org.apache.maven:maven-artifact-manager:jar:2.2.0-RC4-SNAPSHOT
     [java]   	2) org.apache.maven:maven-artifact:jar:2.2.0-RC3
     [java] 
     [java] ----------
     [java] 2 required artifacts are missing.
     [java] 
     [java] for artifact: 
     [java]   org.apache.maven:maven-artifact-manager:jar:2.2.0-RC4-SNAPSHOT
     [java] 
     [java] from the specified remote repositories:
     [java]   Nexus (http://repository.sonatype.org:8081/content/groups/sonatype-grid)
     [java] 
     [java] 
     [java] 	at org.apache.maven.lifecycle.DefaultLifecycleExecutor.executeGoals(DefaultLifecycleExecutor.java:695)
     [java] 	at org.apache.maven.lifecycle.DefaultLifecycleExecutor.executeGoalWithLifecycle(DefaultLifecycleExecutor.java:540)
     [java] 	at org.apache.maven.lifecycle.DefaultLifecycleExecutor.executeGoal(DefaultLifecycleExecutor.java:519)
     [java] 	at org.apache.maven.lifecycle.DefaultLifecycleExecutor.executeGoalAndHandleFailures(DefaultLifecycleExecutor.java:371)
     [java] 	at org.apache.maven.lifecycle.DefaultLifecycleExecutor.executeTaskSegments(DefaultLifecycleExecutor.java:332)
     [java] 	at org.apache.maven.lifecycle.DefaultLifecycleExecutor.execute(DefaultLifecycleExecutor.java:181)
     [java] 	at org.apache.maven.DefaultMaven.doExecute(DefaultMaven.java:356)
     [java] 	at org.apache.maven.DefaultMaven.execute(DefaultMaven.java:137)
     [java] 	at org.apache.maven.cli.MavenCli.main(MavenCli.java:362)
     [java] 	at org.apache.maven.cli.compat.CompatibleMain.main(CompatibleMain.java:41)
     [java] 	at org.apache.maven.cli.compat.CompatibleMain.main(CompatibleMain.java:18)
     [java] Caused by: org.apache.maven.artifact.resolver.MultipleArtifactsNotFoundException:
Missing:
     [java] ----------
     [java] 1) org.apache.maven:maven-repository-metadata:jar:2.2.0-RC3
     [java] 
     [java]   Try downloading the file manually from the project website.
     [java] 
     [java]   Then, install it using the command: 
     [java]       mvn install:install-file -DgroupId=org.apache.maven -DartifactId=maven-repository-metadata
-Dversion=2.2.0-RC3 -Dpackaging=jar -Dfile=/path/to/file
     [java] 
     [java]   Alternatively, if you host your own repository you can deploy the file there:

     [java]       mvn deploy:deploy-file -DgroupId=org.apache.maven -DartifactId=maven-repository-metadata
-Dversion=2.2.0-RC3 -Dpackaging=jar -Dfile=/path/to/file -Durl=[url] -DrepositoryId=[id]
     [java] 
     [java]   Path to dependency: 
     [java]   	1) org.apache.maven:maven-artifact-manager:jar:2.2.0-RC4-SNAPSHOT
     [java]   	2) org.apache.maven:maven-repository-metadata:jar:2.2.0-RC3
     [java] 
     [java] 2) org.apache.maven:maven-artifact:jar:2.2.0-RC3
     [java] 
     [java]   Try downloading the file manually from the project website.
     [java] 
     [java]   Then, install it using the command: 
     [java]       mvn install:install-file -DgroupId=org.apache.maven -DartifactId=maven-artifact
-Dversion=2.2.0-RC3 -Dpackaging=jar -Dfile=/path/to/file
     [java] 
     [java]   Alternatively, if you host your own repository you can deploy the file there:

     [java]       mvn deploy:deploy-file -DgroupId=org.apache.maven -DartifactId=maven-artifact
-Dversion=2.2.0-RC3 -Dpackaging=jar -Dfile=/path/to/file -Durl=[url] -DrepositoryId=[id]
     [java] 
     [java]   Path to dependency: 
     [java]   	1) org.apache.maven:maven-artifact-manager:jar:2.2.0-RC4-SNAPSHOT
     [java]   	2) org.apache.maven:maven-artifact:jar:2.2.0-RC3
     [java] 
     [java] ----------
     [java] 2 required artifacts are missing.
     [java] 
     [java] for artifact: 
     [java]   org.apache.maven:maven-artifact-manager:jar:2.2.0-RC4-SNAPSHOT
     [java] 
     [java] from the specified remote repositories:
     [java]   Nexus (http://repository.sonatype.org:8081/content/groups/sonatype-grid)
     [java] 
     [java] 
     [java] 	at org.apache.maven.artifact.resolver.DefaultArtifactResolver.resolveTransitively(DefaultArtifactResolver.java:360)
     [java] 	at org.apache.maven.artifact.resolver.DefaultArtifactResolver.resolveTransitively(DefaultArtifactResolver.java:304)
     [java] 	at org.apache.maven.plugin.DefaultPluginManager.resolveTransitiveDependencies(DefaultPluginManager.java:1492)
     [java] 	at org.apache.maven.plugin.DefaultPluginManager.executeMojo(DefaultPluginManager.java:435)
     [java] 	at org.apache.maven.lifecycle.DefaultLifecycleExecutor.executeGoals(DefaultLifecycleExecutor.java:678)
     [java] 	... 10 more
     [java] [INFO] ------------------------------------------------------------------------
     [java] [INFO] Total time: 22 seconds
     [java] [INFO] Finished at: Wed Jun 10 18:28:26 PDT 2009
     [java] [INFO] Final Memory: 27M/49M
     [java] [INFO] ------------------------------------------------------------------------

BUILD FAILED
C:\home\hudson\workspace\Maven-2.2.x-bootstrap\jdk\1.5\label\windows\maven-2.2.0-RC\build.xml:187:
Java returned: 1

Total time: 47 seconds
Archiving artifacts


Mime
View raw message