maven-notifications mailing list archives

Site index · List index
Message view « Date » · « Thread »
Top « Date » · « Thread »
From Hudson <Hud...@sonatype.org>
Subject Build failed in Hudson: maven-core-integration-testing » 1.5,jeos1 #303
Date Sat, 06 Jun 2009 01:09:35 GMT
See http://grid.sonatype.org/ci/job/maven-core-integration-testing/./jdk=1.5,label=jeos1/303/changes

Changes:

[John Casey] [MNG-4167] Removing until we decide how to implement this (probably in Maven
3). Also, limit mng-3057 to 2.1.0 only, since it was withdrawn for 2.2.0 release.

------------------------------------------
[...truncated 2288 lines...]
[INFO] [compiler:testCompile]
[INFO] No sources to compile
[INFO] [surefire:test]
[INFO] Surefire report directory: /home/hudson/workspace/maven-core-integration-testing/jdk/1.5/label/jeos1/maven-its/core-it-support/core-it-plugins/maven-it-plugin-plexus-component-api/target/surefire-reports

-------------------------------------------------------
 T E S T S
-------------------------------------------------------
There are no tests to run.

Results :

Tests run: 0, Failures: 0, Errors: 0, Skipped: 0

[INFO] [jar:jar]
[INFO] Building jar: /home/hudson/workspace/maven-core-integration-testing/jdk/1.5/label/jeos1/maven-its/core-it-support/core-it-plugins/maven-it-plugin-plexus-component-api/target/maven-it-plugin-plexus-component-api-2.1-SNAPSHOT.jar
[INFO] [plugin:addPluginArtifactMetadata]
[INFO] [install:install]
[INFO] Installing /home/hudson/workspace/maven-core-integration-testing/jdk/1.5/label/jeos1/maven-its/core-it-support/core-it-plugins/maven-it-plugin-plexus-component-api/target/maven-it-plugin-plexus-component-api-2.1-SNAPSHOT.jar
to /opt/repos/local-repository/org/apache/maven/its/plugins/maven-it-plugin-plexus-component-api/2.1-SNAPSHOT/maven-it-plugin-plexus-component-api-2.1-SNAPSHOT.jar
[INFO] [plugin:updateRegistry]
[INFO] [deploy:deploy]
[INFO] Retrieving previous build number from maven.it
Uploading: http://repository.sonatype.org:8081/content/repositories/maven.snapshots/org/apache/maven/its/plugins/maven-it-plugin-plexus-component-api/2.1-SNAPSHOT/maven-it-plugin-plexus-component-api-2.1-20090606.010602-138.jar
9K uploaded  (maven-it-plugin-plexus-component-api-2.1-20090606.010602-138.jar)
[INFO] Retrieving previous metadata from maven.it
[INFO] Uploading repository metadata for: 'snapshot org.apache.maven.its.plugins:maven-it-plugin-plexus-component-api:2.1-SNAPSHOT'
[INFO] Retrieving previous metadata from maven.it
[INFO] Uploading repository metadata for: 'artifact org.apache.maven.its.plugins:maven-it-plugin-plexus-component-api'
[INFO] Retrieving previous metadata from maven.it
[INFO] Uploading repository metadata for: 'org.apache.maven.its.plugins'
[INFO] Uploading project information for maven-it-plugin-plexus-component-api 2.1-20090606.010602-138
[INFO] ------------------------------------------------------------------------
[INFO] Building Maven Integration Test Wagon
[INFO]    task-segment: [clean, deploy]
[INFO] ------------------------------------------------------------------------
Downloading: http://repository.sonatype.org:8081/content/groups/sonatype-grid/org/codehaus/plexus/plexus-maven-plugin/1.3.5/plexus-maven-plugin-1.3.5.pom
2K downloaded  (plexus-maven-plugin-1.3.5.pom)
Downloading: http://repository.sonatype.org:8081/content/groups/sonatype-grid/org/codehaus/plexus/plexus-maven-plugin/1.3.5/plexus-maven-plugin-1.3.5.jar
22K downloaded  (plexus-maven-plugin-1.3.5.jar)
[INFO] [clean:clean]
[INFO] Deleting file set: /home/hudson/workspace/maven-core-integration-testing/jdk/1.5/label/jeos1/maven-its/core-it-support/core-it-wagon/target
(included: [**], excluded: [])
Downloading: http://repository.sonatype.org:8081/content/groups/sonatype-grid/org/codehaus/plexus/plexus-cdc/1.0-alpha-10/plexus-cdc-1.0-alpha-10.pom
1K downloaded  (plexus-cdc-1.0-alpha-10.pom)
Downloading: http://repository.sonatype.org:8081/content/groups/sonatype-grid/org/codehaus/plexus/plexus-tools/1.0.8/plexus-tools-1.0.8.pom
953b downloaded  (plexus-tools-1.0.8.pom)
Downloading: http://repository.sonatype.org:8081/content/groups/sonatype-grid/qdox/qdox/1.6.1/qdox-1.6.1.pom
4K downloaded  (qdox-1.6.1.pom)
Downloading: http://repository.sonatype.org:8081/content/groups/sonatype-grid/org/codehaus/plexus/plexus-container-default/1.0-alpha-14/plexus-container-default-1.0-alpha-14.pom
1K downloaded  (plexus-container-default-1.0-alpha-14.pom)
Downloading: http://repository.sonatype.org:8081/content/groups/sonatype-grid/org/codehaus/plexus/plexus-containers/1.0-alpha-14/plexus-containers-1.0-alpha-14.pom
1K downloaded  (plexus-containers-1.0-alpha-14.pom)
Downloading: http://repository.sonatype.org:8081/content/groups/sonatype-grid/org/codehaus/plexus/plexus-component-api/1.0-alpha-13/plexus-component-api-1.0-alpha-13.pom
949b downloaded  (plexus-component-api-1.0-alpha-13.pom)
Downloading: http://repository.sonatype.org:8081/content/groups/sonatype-grid/org/codehaus/plexus/plexus-containers/1.0.7-alpha-3/plexus-containers-1.0.7-alpha-3.pom
1K downloaded  (plexus-containers-1.0.7-alpha-3.pom)
Downloading: http://repository.sonatype.org:8081/content/groups/sonatype-grid/org/codehaus/plexus/plexus-classworlds/1.2-alpha-5/plexus-classworlds-1.2-alpha-5.pom
1K downloaded  (plexus-classworlds-1.2-alpha-5.pom)
Downloading: http://repository.sonatype.org:8081/content/groups/sonatype-grid/qdox/qdox/1.6.1/qdox-1.6.1.jar
Downloading: http://repository.sonatype.org:8081/content/groups/sonatype-grid/org/codehaus/plexus/plexus-cdc/1.0-alpha-10/plexus-cdc-1.0-alpha-10.jar
45K downloaded  (plexus-cdc-1.0-alpha-10.jar)
92K downloaded  (qdox-1.6.1.jar)
[INFO] [plexus:descriptor {execution: default}]
[INFO] [remote-resources:process {execution: default}]
[INFO] [resources:resources]
[INFO] Using 'UTF-8' encoding to copy filtered resources.
[INFO] skip non existing resourceDirectory /home/hudson/workspace/maven-core-integration-testing/jdk/1.5/label/jeos1/maven-its/core-it-support/core-it-wagon/src/main/resources
[INFO] Copying 1 resource
[INFO] Copying 3 resources
[INFO] [compiler:compile]
[INFO] Compiling 1 source file to /home/hudson/workspace/maven-core-integration-testing/jdk/1.5/label/jeos1/maven-its/core-it-support/core-it-wagon/target/classes
[INFO] [resources:testResources]
[INFO] Using 'UTF-8' encoding to copy filtered resources.
[INFO] skip non existing resourceDirectory /home/hudson/workspace/maven-core-integration-testing/jdk/1.5/label/jeos1/maven-its/core-it-support/core-it-wagon/src/test/resources
[INFO] Copying 3 resources
[INFO] [compiler:testCompile]
[INFO] No sources to compile
[INFO] [surefire:test]
[INFO] Surefire report directory: /home/hudson/workspace/maven-core-integration-testing/jdk/1.5/label/jeos1/maven-its/core-it-support/core-it-wagon/target/surefire-reports

-------------------------------------------------------
 T E S T S
-------------------------------------------------------
There are no tests to run.

Results :

Tests run: 0, Failures: 0, Errors: 0, Skipped: 0

[INFO] [jar:jar]
[INFO] Building jar: /home/hudson/workspace/maven-core-integration-testing/jdk/1.5/label/jeos1/maven-its/core-it-support/core-it-wagon/target/core-it-wagon-2.1-SNAPSHOT.jar
[INFO] [install:install]
[INFO] Installing /home/hudson/workspace/maven-core-integration-testing/jdk/1.5/label/jeos1/maven-its/core-it-support/core-it-wagon/target/core-it-wagon-2.1-SNAPSHOT.jar
to /opt/repos/local-repository/org/apache/maven/its/core-it-wagon/2.1-SNAPSHOT/core-it-wagon-2.1-SNAPSHOT.jar
[INFO] [deploy:deploy]
[INFO] Retrieving previous build number from apache.snapshots.https
Uploading: http://repository.sonatype.org:8081/content/repositories/maven.snapshots/org/apache/maven/its/core-it-wagon/2.1-SNAPSHOT/core-it-wagon-2.1-20090606.010602-314.jar
10K uploaded  (core-it-wagon-2.1-20090606.010602-314.jar)
[INFO] Retrieving previous metadata from apache.snapshots.https
[INFO] Uploading repository metadata for: 'snapshot org.apache.maven.its:core-it-wagon:2.1-SNAPSHOT'
[INFO] Uploading project information for core-it-wagon 2.1-20090606.010602-314
[INFO] Retrieving previous metadata from apache.snapshots.https
[INFO] Uploading repository metadata for: 'artifact org.apache.maven.its:core-it-wagon'
[INFO] ------------------------------------------------------------------------
[INFO] Building Maven Integration Test Support Artifacts
[INFO]    task-segment: [clean, deploy]
[INFO] ------------------------------------------------------------------------
Downloading: http://repository.sonatype.org:8081/content/groups/sonatype-grid/org/apache/maven/plugins/maven-assembly-plugin/2.1/maven-assembly-plugin-2.1.pom
3K downloaded  (maven-assembly-plugin-2.1.pom)
Downloading: http://repository.sonatype.org:8081/content/groups/sonatype-grid/org/apache/maven/plugins/maven-plugins/1/maven-plugins-1.pom
3K downloaded  (maven-plugins-1.pom)
Downloading: http://repository.sonatype.org:8081/content/groups/sonatype-grid/org/apache/maven/plugins/maven-assembly-plugin/2.1/maven-assembly-plugin-2.1.jar
90K downloaded  (maven-assembly-plugin-2.1.jar)
[INFO] [clean:clean]
[INFO] Deleting file set: /home/hudson/workspace/maven-core-integration-testing/jdk/1.5/label/jeos1/maven-its/core-it-support/core-it-support-artifacts/target
(included: [**], excluded: [])
[INFO] [remote-resources:process {execution: default}]
[INFO] [site:attach-descriptor]
Downloading: http://repository.sonatype.org:8081/content/groups/sonatype-grid/org/apache/maven/wagon/wagon-file/1.0-alpha-7/wagon-file-1.0-alpha-7.pom
441b downloaded  (wagon-file-1.0-alpha-7.pom)
Downloading: http://repository.sonatype.org:8081/content/groups/sonatype-grid/org/apache/maven/wagon/wagon-providers/1.0-alpha-6/wagon-providers-1.0-alpha-6.pom
1K downloaded  (wagon-providers-1.0-alpha-6.pom)
Downloading: http://repository.sonatype.org:8081/content/groups/sonatype-grid/org/apache/maven/maven-plugin-parameter-documenter/2.0.4/maven-plugin-parameter-documenter-2.0.4.pom
1K downloaded  (maven-plugin-parameter-documenter-2.0.4.pom)
Downloading: http://repository.sonatype.org:8081/content/groups/sonatype-grid/org/apache/maven/wagon/wagon-http-lightweight/1.0-alpha-6/wagon-http-lightweight-1.0-alpha-6.pom
855b downloaded  (wagon-http-lightweight-1.0-alpha-6.pom)
Downloading: http://repository.sonatype.org:8081/content/groups/sonatype-grid/org/apache/maven/maven-error-diagnostics/2.0.4/maven-error-diagnostics-2.0.4.pom
854b downloaded  (maven-error-diagnostics-2.0.4.pom)
Downloading: http://repository.sonatype.org:8081/content/groups/sonatype-grid/org/apache/maven/maven-plugin-registry/2.0.4/maven-plugin-registry-2.0.4.pom
1K downloaded  (maven-plugin-registry-2.0.4.pom)
Downloading: http://repository.sonatype.org:8081/content/groups/sonatype-grid/org/apache/maven/wagon/wagon-ssh-external/1.0-alpha-6/wagon-ssh-external-1.0-alpha-6.pom
961b downloaded  (wagon-ssh-external-1.0-alpha-6.pom)
Downloading: http://repository.sonatype.org:8081/content/groups/sonatype-grid/org/apache/maven/maven-plugin-descriptor/2.0.4/maven-plugin-descriptor-2.0.4.pom
1K downloaded  (maven-plugin-descriptor-2.0.4.pom)
Downloading: http://repository.sonatype.org:8081/content/groups/sonatype-grid/org/apache/maven/maven-monitor/2.0.4/maven-monitor-2.0.4.pom
442b downloaded  (maven-monitor-2.0.4.pom)
Downloading: http://repository.sonatype.org:8081/content/groups/sonatype-grid/org/apache/maven/wagon/wagon-ssh/1.0-alpha-7/wagon-ssh-1.0-alpha-7.pom
1K downloaded  (wagon-ssh-1.0-alpha-7.pom)
Downloading: http://repository.sonatype.org:8081/content/groups/sonatype-grid/com/jcraft/jsch/0.1.24/jsch-0.1.24.pom
485b downloaded  (jsch-0.1.24.pom)
Downloading: http://repository.sonatype.org:8081/content/groups/sonatype-grid/org/apache/maven/maven-archiver/2.0.4/maven-archiver-2.0.4.pom
912b downloaded  (maven-archiver-2.0.4.pom)
Downloading: http://repository.sonatype.org:8081/content/groups/sonatype-grid/org/codehaus/plexus/plexus-archiver/1.0-alpha-4/plexus-archiver-1.0-alpha-4.pom
439b downloaded  (plexus-archiver-1.0-alpha-4.pom)
Downloading: http://repository.sonatype.org:8081/content/groups/sonatype-grid/org/codehaus/plexus/plexus-archiver/1.0-alpha-6/plexus-archiver-1.0-alpha-6.pom
804b downloaded  (plexus-archiver-1.0-alpha-6.pom)
Downloading: http://repository.sonatype.org:8081/content/groups/sonatype-grid/org/apache/maven/maven-archiver/2.0.4/maven-archiver-2.0.4.jar
Downloading: http://repository.sonatype.org:8081/content/groups/sonatype-grid/org/codehaus/plexus/plexus-archiver/1.0-alpha-6/plexus-archiver-1.0-alpha-6.jar
131K downloaded  (plexus-archiver-1.0-alpha-6.jar)
9K downloaded  (maven-archiver-2.0.4.jar)
[WARNING] DEPRECATED [descriptor]: Please use descriptors instead
[INFO] [assembly:single {execution: default}]
[INFO] Building zip: /home/hudson/workspace/maven-core-integration-testing/jdk/1.5/label/jeos1/maven-its/core-it-support/core-it-support-artifacts/target/core-it-support-artifacts-2.1-SNAPSHOT-repo.zip
[INFO] [install:install]
[INFO] Installing /home/hudson/workspace/maven-core-integration-testing/jdk/1.5/label/jeos1/maven-its/core-it-support/core-it-support-artifacts/target/pom-transformed.xml
to /opt/repos/local-repository/org/apache/maven/its/core-it-support-artifacts/2.1-SNAPSHOT/core-it-support-artifacts-2.1-SNAPSHOT.pom
[INFO] Installing /home/hudson/workspace/maven-core-integration-testing/jdk/1.5/label/jeos1/maven-its/core-it-support/core-it-support-artifacts/target/core-it-support-artifacts-2.1-SNAPSHOT-repo.zip
to /opt/repos/local-repository/org/apache/maven/its/core-it-support-artifacts/2.1-SNAPSHOT/core-it-support-artifacts-2.1-SNAPSHOT-repo.zip
[INFO] [deploy:deploy]
[INFO] Retrieving previous build number from apache.snapshots.https
Uploading: http://repository.sonatype.org:8081/content/repositories/maven.snapshots/org/apache/maven/its/core-it-support-artifacts/2.1-SNAPSHOT/core-it-support-artifacts-2.1-20090606.010602-313.pom
1K uploaded  (core-it-support-artifacts-2.1-20090606.010602-313.pom)
[INFO] Retrieving previous metadata from apache.snapshots.https
[INFO] Uploading repository metadata for: 'artifact org.apache.maven.its:core-it-support-artifacts'
[INFO] Retrieving previous metadata from apache.snapshots.https
[INFO] Uploading repository metadata for: 'snapshot org.apache.maven.its:core-it-support-artifacts:2.1-SNAPSHOT'
[INFO] Retrieving previous build number from apache.snapshots.https
Uploading: http://repository.sonatype.org:8081/content/repositories/maven.snapshots/org/apache/maven/its/core-it-support-artifacts/2.1-SNAPSHOT/core-it-support-artifacts-2.1-20090606.010602-313-repo.zip
15K uploaded  (core-it-support-artifacts-2.1-20090606.010602-313-repo.zip)
[INFO] ------------------------------------------------------------------------
[INFO] Building Maven Integration Tests
[INFO]    task-segment: [clean, deploy]
[INFO] ------------------------------------------------------------------------
[INFO] [clean:clean]
[INFO] Deleting file set: /home/hudson/workspace/maven-core-integration-testing/jdk/1.5/label/jeos1/maven-its/core-it-suite/target
(included: [**], excluded: [])
Downloading: http://repository.sonatype.org:8081/content/groups/sonatype-grid/org/mortbay/jetty/jetty/6.1.14/jetty-6.1.14.pom
4K downloaded  (jetty-6.1.14.pom)
Downloading: http://repository.sonatype.org:8081/content/groups/sonatype-grid/org/mortbay/jetty/project/6.1.14/project-6.1.14.pom
8K downloaded  (project-6.1.14.pom)
Downloading: http://repository.sonatype.org:8081/content/groups/sonatype-grid/org/mortbay/jetty/jetty-parent/7/jetty-parent-7.pom
12K downloaded  (jetty-parent-7.pom)
Downloading: http://repository.sonatype.org:8081/content/groups/sonatype-grid/org/mortbay/jetty/jetty-util/6.1.14/jetty-util-6.1.14.pom
3K downloaded  (jetty-util-6.1.14.pom)
Downloading: http://repository.sonatype.org:8081/content/groups/sonatype-grid/org/mortbay/jetty/servlet-api-2.5/6.1.14/servlet-api-2.5-6.1.14.pom
3K downloaded  (servlet-api-2.5-6.1.14.pom)
Downloading: http://repository.sonatype.org:8081/content/groups/sonatype-grid/org/mortbay/jetty/jetty/6.1.14/jetty-6.1.14.jar
504K downloaded  (jetty-6.1.14.jar)
Downloading: http://repository.sonatype.org:8081/content/groups/sonatype-grid/org/mortbay/jetty/jetty-util/6.1.14/jetty-util-6.1.14.jar
159K downloaded  (jetty-util-6.1.14.jar)
Downloading: http://repository.sonatype.org:8081/content/groups/sonatype-grid/org/mortbay/jetty/servlet-api-2.5/6.1.14/servlet-api-2.5-6.1.14.jar
129K downloaded  (servlet-api-2.5-6.1.14.jar)
[INFO] [remote-resources:process {execution: default}]
[INFO] [resources:resources]
[INFO] Using 'UTF-8' encoding to copy filtered resources.
[INFO] skip non existing resourceDirectory /home/hudson/workspace/maven-core-integration-testing/jdk/1.5/label/jeos1/maven-its/core-it-suite/src/main/resources
[INFO] Copying 3 resources
[INFO] [compiler:compile]
[INFO] No sources to compile
[INFO] [resources:testResources]
[INFO] Using 'UTF-8' encoding to copy filtered resources.
[INFO] Copying 1591 resources
[INFO] Copying 3 resources
[INFO] [compiler:testCompile]
[INFO] Compiling 311 source files to /home/hudson/workspace/maven-core-integration-testing/jdk/1.5/label/jeos1/maven-its/core-it-suite/target/test-classes
[INFO] ------------------------------------------------------------------------
[ERROR] BUILD FAILURE
[INFO] ------------------------------------------------------------------------
[INFO] Compilation failure
/home/hudson/workspace/maven-core-integration-testing/jdk/1.5/label/jeos1/maven-its/core-it-suite/src/test/java/org/apache/maven/it/IntegrationTestSuite.java:[96,28]
cannot find symbol
symbol  : class MavenITmng4167PluginAndCoordXFormPOMTest
location: class org.apache.maven.it.IntegrationTestSuite


[INFO] ------------------------------------------------------------------------
[INFO] Trace
org.apache.maven.BuildFailureException: Compilation failure
/home/hudson/workspace/maven-core-integration-testing/jdk/1.5/label/jeos1/maven-its/core-it-suite/src/test/java/org/apache/maven/it/IntegrationTestSuite.java:[96,28]
cannot find symbol
symbol  : class MavenITmng4167PluginAndCoordXFormPOMTest
location: class org.apache.maven.it.IntegrationTestSuite


	at org.apache.maven.lifecycle.DefaultLifecycleExecutor.executeGoals(DefaultLifecycleExecutor.java:699)
	at org.apache.maven.lifecycle.DefaultLifecycleExecutor.executeGoalWithLifecycle(DefaultLifecycleExecutor.java:540)
	at org.apache.maven.lifecycle.DefaultLifecycleExecutor.executeGoal(DefaultLifecycleExecutor.java:519)
	at org.apache.maven.lifecycle.DefaultLifecycleExecutor.executeGoalAndHandleFailures(DefaultLifecycleExecutor.java:371)
	at org.apache.maven.lifecycle.DefaultLifecycleExecutor.executeTaskSegments(DefaultLifecycleExecutor.java:332)
	at org.apache.maven.lifecycle.DefaultLifecycleExecutor.execute(DefaultLifecycleExecutor.java:181)
	at org.apache.maven.DefaultMaven.doExecute(DefaultMaven.java:356)
	at org.apache.maven.DefaultMaven.execute(DefaultMaven.java:137)
	at org.apache.maven.cli.MavenCli.main(MavenCli.java:356)
	at sun.reflect.NativeMethodAccessorImpl.invoke0(Native Method)
	at sun.reflect.NativeMethodAccessorImpl.invoke(NativeMethodAccessorImpl.java:39)
	at sun.reflect.DelegatingMethodAccessorImpl.invoke(DelegatingMethodAccessorImpl.java:25)
	at java.lang.reflect.Method.invoke(Method.java:585)
	at org.codehaus.classworlds.Launcher.launchEnhanced(Launcher.java:315)
	at org.codehaus.classworlds.Launcher.launch(Launcher.java:255)
	at org.codehaus.classworlds.Launcher.mainWithExitCode(Launcher.java:430)
	at org.codehaus.classworlds.Launcher.main(Launcher.java:375)
Caused by: org.apache.maven.plugin.CompilationFailureException: Compilation failure
/home/hudson/workspace/maven-core-integration-testing/jdk/1.5/label/jeos1/maven-its/core-it-suite/src/test/java/org/apache/maven/it/IntegrationTestSuite.java:[96,28]
cannot find symbol
symbol  : class MavenITmng4167PluginAndCoordXFormPOMTest
location: class org.apache.maven.it.IntegrationTestSuite


	at org.apache.maven.plugin.AbstractCompilerMojo.execute(AbstractCompilerMojo.java:516)
	at org.apache.maven.plugin.TestCompilerMojo.execute(TestCompilerMojo.java:102)
	at org.apache.maven.plugin.DefaultPluginManager.executeMojo(DefaultPluginManager.java:483)
	at org.apache.maven.lifecycle.DefaultLifecycleExecutor.executeGoals(DefaultLifecycleExecutor.java:678)
	... 16 more
[INFO] ------------------------------------------------------------------------
[INFO] Total time: 3 minutes 37 seconds
[INFO] Finished at: Fri Jun 05 19:09:35 GMT-06:00 2009
[INFO] Final Memory: 50M/97M
[INFO] ------------------------------------------------------------------------


Mime
View raw message