maven-notifications mailing list archives

Site index · List index
Message view « Date » · « Thread »
Top « Date » · « Thread »
From Hudson <Hud...@sonatype.org>
Subject Build failed in Hudson: maven-shared » 1.5,ubuntu #165
Date Sun, 08 Nov 2009 15:44:47 GMT
See <http://grid.sonatype.org/ci/job/maven-shared/./jdk=1.5,label=ubuntu/165/changes>

Changes:

[Benjamin Bentmann] o Locked down versions

------------------------------------------
[...truncated 2732 lines...]
1K downloaded  (doxia-sink-api-1.0-alpha-10.pom)
Downloading: http://repository.sonatype.org:8081/content/groups/sonatype-public-grid/org/apache/maven/maven-plugin-api/2.0.4/maven-plugin-api-2.0.4.pom
643b downloaded  (maven-plugin-api-2.0.4.pom)
Downloading: http://repository.sonatype.org:8081/content/groups/sonatype-public-grid/org/apache/maven/doxia/doxia-site-renderer/1.0-alpha-10/doxia-site-renderer-1.0-alpha-10.pom
4K downloaded  (doxia-site-renderer-1.0-alpha-10.pom)
Downloading: http://repository.sonatype.org:8081/content/groups/sonatype-public-grid/org/apache/maven/doxia/doxia-sitetools/1.0-alpha-10/doxia-sitetools-1.0-alpha-10.pom
7K downloaded  (doxia-sitetools-1.0-alpha-10.pom)
Downloading: http://repository.sonatype.org:8081/content/groups/sonatype-public-grid/org/apache/maven/doxia/doxia-decoration-model/1.0-alpha-10/doxia-decoration-model-1.0-alpha-10.pom
2K downloaded  (doxia-decoration-model-1.0-alpha-10.pom)
Downloading: http://repository.sonatype.org:8081/content/groups/sonatype-public-grid/org/apache/maven/doxia/doxia-module-apt/1.0-alpha-10/doxia-module-apt-1.0-alpha-10.pom
2K downloaded  (doxia-module-apt-1.0-alpha-10.pom)
Downloading: http://repository.sonatype.org:8081/content/groups/sonatype-public-grid/org/apache/maven/doxia/doxia-modules/1.0-alpha-10/doxia-modules-1.0-alpha-10.pom
2K downloaded  (doxia-modules-1.0-alpha-10.pom)
Downloading: http://repository.sonatype.org:8081/content/groups/sonatype-public-grid/org/apache/maven/doxia/doxia-module-fml/1.0-alpha-10/doxia-module-fml-1.0-alpha-10.pom
2K downloaded  (doxia-module-fml-1.0-alpha-10.pom)
Downloading: http://repository.sonatype.org:8081/content/groups/sonatype-public-grid/org/apache/maven/doxia/doxia-module-xdoc/1.0-alpha-10/doxia-module-xdoc-1.0-alpha-10.pom
2K downloaded  (doxia-module-xdoc-1.0-alpha-10.pom)
Downloading: http://repository.sonatype.org:8081/content/groups/sonatype-public-grid/org/apache/maven/doxia/doxia-module-xhtml/1.0-alpha-10/doxia-module-xhtml-1.0-alpha-10.pom
1K downloaded  (doxia-module-xhtml-1.0-alpha-10.pom)
Downloading: http://repository.sonatype.org:8081/content/groups/sonatype-public-grid/org/beanshell/bsh/2.0b4/bsh-2.0b4.pom
1K downloaded  (bsh-2.0b4.pom)
Downloading: http://repository.sonatype.org:8081/content/groups/sonatype-public-grid/org/beanshell/beanshell/2.0b4/beanshell-2.0b4.pom
1K downloaded  (beanshell-2.0b4.pom)
Downloading: http://repository.sonatype.org:8081/content/groups/sonatype-public-grid/org/codehaus/groovy/groovy/1.5.6/groovy-1.5.6.pom
24K downloaded  (groovy-1.5.6.pom)
Downloading: http://repository.sonatype.org:8081/content/groups/sonatype-public-grid/antlr/antlr/2.7.6/antlr-2.7.6.pom
230b downloaded  (antlr-2.7.6.pom)
Downloading: http://repository.sonatype.org:8081/content/groups/sonatype-public-grid/asm/asm/2.2/asm-2.2.pom
807b downloaded  (asm-2.2.pom)
Downloading: http://repository.sonatype.org:8081/content/groups/sonatype-public-grid/org/apache/ant/ant/1.7.0/ant-1.7.0.pom
9K downloaded  (ant-1.7.0.pom)
Downloading: http://repository.sonatype.org:8081/content/groups/sonatype-public-grid/org/apache/ant/ant-parent/1.7.0/ant-parent-1.7.0.pom
4K downloaded  (ant-parent-1.7.0.pom)
Downloading: http://repository.sonatype.org:8081/content/groups/sonatype-public-grid/org/apache/ant/ant-launcher/1.7.0/ant-launcher-1.7.0.pom
2K downloaded  (ant-launcher-1.7.0.pom)
Downloading: http://repository.sonatype.org:8081/content/groups/sonatype-public-grid/asm/asm-util/2.2/asm-util-2.2.pom
817b downloaded  (asm-util-2.2.pom)
Downloading: http://repository.sonatype.org:8081/content/groups/sonatype-public-grid/asm/asm-analysis/2.2/asm-analysis-2.2.pom
825b downloaded  (asm-analysis-2.2.pom)
Downloading: http://repository.sonatype.org:8081/content/groups/sonatype-public-grid/asm/asm-tree/2.2/asm-tree-2.2.pom
817b downloaded  (asm-tree-2.2.pom)
Downloading: http://repository.sonatype.org:8081/content/groups/sonatype-public-grid/jline/jline/0.9.94/jline-0.9.94.pom
6K downloaded  (jline-0.9.94.pom)
Downloading: http://repository.sonatype.org:8081/content/groups/sonatype-public-grid/org/apache/ant/ant/1.7.1/ant-1.7.1.pom
9K downloaded  (ant-1.7.1.pom)
Downloading: http://repository.sonatype.org:8081/content/groups/sonatype-public-grid/org/apache/ant/ant-parent/1.7.1/ant-parent-1.7.1.pom
4K downloaded  (ant-parent-1.7.1.pom)
Downloading: http://repository.sonatype.org:8081/content/groups/sonatype-public-grid/org/codehaus/plexus/plexus-interpolation/1.2/plexus-interpolation-1.2.pom
2K downloaded  (plexus-interpolation-1.2.pom)
Downloading: http://repository.sonatype.org:8081/content/groups/sonatype-public-grid/org/codehaus/groovy/groovy/1.5.6/groovy-1.5.6.jar
Downloading: http://repository.sonatype.org:8081/content/groups/sonatype-public-grid/org/apache/ant/ant/1.7.1/ant-1.7.1.jar
Downloading: http://repository.sonatype.org:8081/content/groups/sonatype-public-grid/org/apache/maven/doxia/doxia-core/1.0-alpha-10/doxia-core-1.0-alpha-10.jar
Downloading: http://repository.sonatype.org:8081/content/groups/sonatype-public-grid/org/beanshell/bsh/2.0b4/bsh-2.0b4.jar
Downloading: http://repository.sonatype.org:8081/content/groups/sonatype-public-grid/asm/asm/2.2/asm-2.2.jar
275K downloaded  (bsh-2.0b4.jar)
Downloading: http://repository.sonatype.org:8081/content/groups/sonatype-public-grid/org/apache/maven/shared/maven-invoker/2.0.11/maven-invoker-2.0.11.jar
28K downloaded  (maven-invoker-2.0.11.jar)
Downloading: http://repository.sonatype.org:8081/content/groups/sonatype-public-grid/org/apache/maven/reporting/maven-reporting-impl/2.0.4.1/maven-reporting-impl-2.0.4.1.jar
1291K downloaded  (ant-1.7.1.jar)
Downloading: http://repository.sonatype.org:8081/content/groups/sonatype-public-grid/jline/jline/0.9.94/jline-0.9.94.jar
85K downloaded  (jline-0.9.94.jar)
Downloading: http://repository.sonatype.org:8081/content/groups/sonatype-public-grid/antlr/antlr/2.7.6/antlr-2.7.6.jar
433K downloaded  (antlr-2.7.6.jar)
Downloading: http://repository.sonatype.org:8081/content/groups/sonatype-public-grid/org/apache/ant/ant-launcher/1.7.0/ant-launcher-1.7.0.jar
11K downloaded  (ant-launcher-1.7.0.jar)
Downloading: http://repository.sonatype.org:8081/content/groups/sonatype-public-grid/org/codehaus/plexus/plexus-interpolation/1.2/plexus-interpolation-1.2.jar
35K downloaded  (plexus-interpolation-1.2.jar)
2251K downloaded  (groovy-1.5.6.jar)
53K downloaded  (doxia-core-1.0-alpha-10.jar)
18K downloaded  (maven-reporting-impl-2.0.4.1.jar)
33K downloaded  (asm-2.2.jar)
Downloading: http://repository.sonatype.org:8081/content/groups/sonatype-public-grid/asm/asm-util/2.2/asm-util-2.2.jar
32K downloaded  (asm-util-2.2.jar)
Downloading: http://repository.sonatype.org:8081/content/groups/sonatype-public-grid/asm/asm-analysis/2.2/asm-analysis-2.2.jar
17K downloaded  (asm-analysis-2.2.jar)
Downloading: http://repository.sonatype.org:8081/content/groups/sonatype-public-grid/asm/asm-tree/2.2/asm-tree-2.2.jar
15K downloaded  (asm-tree-2.2.jar)
[INFO] [invoker:install {execution: integration-test}]
[INFO] Installing /home/hudson/workspace/maven-shared/jdk/1.5/label/ubuntu/trunk/maven-artifact-resolver/pom.xml
to /home/hudson/workspace/maven-shared/jdk/1.5/label/ubuntu/trunk/maven-artifact-resolver/target/local-repo/org/apache/maven/shared/maven-artifact-resolver/1.1-SNAPSHOT/maven-artifact-resolver-1.1-SNAPSHOT.pom
[INFO] Installing /home/hudson/workspace/maven-shared/jdk/1.5/label/ubuntu/trunk/maven-artifact-resolver/target/maven-artifact-resolver-1.1-SNAPSHOT.jar
to /home/hudson/workspace/maven-shared/jdk/1.5/label/ubuntu/trunk/maven-artifact-resolver/target/local-repo/org/apache/maven/shared/maven-artifact-resolver/1.1-SNAPSHOT/maven-artifact-resolver-1.1-SNAPSHOT.jar
[INFO] [invoker:run {execution: integration-test}]
[INFO] Building: minimal-dependencies/pom.xml
[INFO] ..SUCCESS (37.7 s)
[INFO] ---------------------------------------
[INFO] Execution Summary:
[INFO]   Builds Passing: 1
[INFO]   Builds Failing: 0
[INFO]   Builds Skipped: 0
[INFO] ---------------------------------------
[INFO] [install:install {execution: default-install}]
[INFO] Installing /home/hudson/workspace/maven-shared/jdk/1.5/label/ubuntu/trunk/maven-artifact-resolver/target/maven-artifact-resolver-1.1-SNAPSHOT.jar
to /opt/repos/maven-shared/org/apache/maven/shared/maven-artifact-resolver/1.1-SNAPSHOT/maven-artifact-resolver-1.1-SNAPSHOT.jar
[INFO] [deploy:deploy {execution: default-deploy}]
[INFO] Retrieving previous build number from apache.snapshots.https
Uploading: http://repository.sonatype.org:8081/content/repositories/maven.snapshots/org/apache/maven/shared/maven-artifact-resolver/1.1-SNAPSHOT/maven-artifact-resolver-1.1-20091108.153928-15.jar
13K uploaded  (maven-artifact-resolver-1.1-20091108.153928-15.jar)
[INFO] Uploading project information for maven-artifact-resolver 1.1-20091108.153928-15
[INFO] Retrieving previous metadata from apache.snapshots.https
[INFO] Uploading repository metadata for: 'artifact org.apache.maven.shared:maven-artifact-resolver'
[INFO] Retrieving previous metadata from apache.snapshots.https
[INFO] Uploading repository metadata for: 'snapshot org.apache.maven.shared:maven-artifact-resolver:1.1-SNAPSHOT'
[INFO] 
[INFO] 
[INFO] ------------------------------------------------------------------------
[INFO] Reactor Summary:
[INFO] ------------------------------------------------------------------------
[INFO] Maven Shared Components ............................... SUCCESS [20.149s]
[INFO] Maven Shared I/O API .................................. SUCCESS [14.883s]
[INFO] Maven File Management API ............................. SUCCESS [9.343s]
[INFO] Maven Ant ............................................. SUCCESS [6.431s]
[INFO] Maven Archiver ........................................ SUCCESS [6.920s]
[INFO] Maven Common Artifact Filters ......................... SUCCESS [10.087s]
[INFO] Maven Dependency Analyzer ............................. SUCCESS [32.440s]
[INFO] Maven Dependency Tree ................................. SUCCESS [7.675s]
[INFO] Maven Downloader ...................................... SUCCESS [3.260s]
[INFO] Maven Doxia Integration Tools ......................... SUCCESS [12.793s]
[INFO] Maven Filtering ....................................... SUCCESS [12.329s]
[INFO] Maven Invoker ......................................... SUCCESS [18.695s]
[INFO] Maven Model Converter ................................. SUCCESS [7.406s]
[INFO] Maven OSGi integration ................................ SUCCESS [4.423s]
[INFO] Maven Reporting Implementation ........................ FAILED [4.852s]
[INFO] Maven Repository Builder .............................. SUCCESS [7.285s]
[INFO] Maven Runtime ......................................... SUCCESS [29.679s]
[INFO] Maven JAR Utilities ................................... SUCCESS [11.313s]
[INFO] Maven Shared Monitor API .............................. SUCCESS [3.706s]
[INFO] Maven Verifier Component .............................. SUCCESS [4.463s]
[INFO] Maven Artifact Resolution API ......................... SUCCESS [1:48.356s]
[INFO] ------------------------------------------------------------------------
[INFO] Error for project: Maven Reporting Implementation (during deploy)
[INFO] ------------------------------------------------------------------------
[INFO] Failed to resolve artifact.

Missing:
----------
1) xerces:xercesImpl:jar:2.6.2

  Try downloading the file manually from the project website.

  Then, install it using the command: 
      mvn install:install-file -DgroupId=xerces -DartifactId=xercesImpl -Dversion=2.6.2 -Dpackaging=jar
-Dfile=/path/to/file

  Alternatively, if you host your own repository you can deploy the file there: 
      mvn deploy:deploy-file -DgroupId=xerces -DartifactId=xercesImpl -Dversion=2.6.2 -Dpackaging=jar
-Dfile=/path/to/file -Durl=[url] -DrepositoryId=[id]

  Path to dependency: 
  	1) org.apache.maven.reporting:maven-reporting-impl:jar:2.1-SNAPSHOT
  	2) org.apache.maven.doxia:doxia-site-renderer:jar:1.1.1
  	3) org.apache.maven.doxia:doxia-core:jar:1.1.1
  	4) xerces:xercesImpl:jar:2.6.2

----------
1 required artifact is missing.

for artifact: 
  org.apache.maven.reporting:maven-reporting-impl:jar:2.1-SNAPSHOT

from the specified remote repositories:
  Nexus (http://repository.sonatype.org:8081/content/groups/sonatype-public-grid)



[INFO] ------------------------------------------------------------------------
[INFO] Trace
org.apache.maven.lifecycle.LifecycleExecutionException: Missing:
----------
1) xerces:xercesImpl:jar:2.6.2

  Try downloading the file manually from the project website.

  Then, install it using the command: 
      mvn install:install-file -DgroupId=xerces -DartifactId=xercesImpl -Dversion=2.6.2 -Dpackaging=jar
-Dfile=/path/to/file

  Alternatively, if you host your own repository you can deploy the file there: 
      mvn deploy:deploy-file -DgroupId=xerces -DartifactId=xercesImpl -Dversion=2.6.2 -Dpackaging=jar
-Dfile=/path/to/file -Durl=[url] -DrepositoryId=[id]

  Path to dependency: 
  	1) org.apache.maven.reporting:maven-reporting-impl:jar:2.1-SNAPSHOT
  	2) org.apache.maven.doxia:doxia-site-renderer:jar:1.1.1
  	3) org.apache.maven.doxia:doxia-core:jar:1.1.1
  	4) xerces:xercesImpl:jar:2.6.2

----------
1 required artifact is missing.

for artifact: 
  org.apache.maven.reporting:maven-reporting-impl:jar:2.1-SNAPSHOT

from the specified remote repositories:
  Nexus (http://repository.sonatype.org:8081/content/groups/sonatype-public-grid)


	at org.apache.maven.lifecycle.DefaultLifecycleExecutor.executeGoals(DefaultLifecycleExecutor.java:711)
	at org.apache.maven.lifecycle.DefaultLifecycleExecutor.executeGoalWithLifecycle(DefaultLifecycleExecutor.java:556)
	at org.apache.maven.lifecycle.DefaultLifecycleExecutor.executeGoal(DefaultLifecycleExecutor.java:535)
	at org.apache.maven.lifecycle.DefaultLifecycleExecutor.executeGoalAndHandleFailures(DefaultLifecycleExecutor.java:387)
	at org.apache.maven.lifecycle.DefaultLifecycleExecutor.executeTaskSegments(DefaultLifecycleExecutor.java:348)
	at org.apache.maven.lifecycle.DefaultLifecycleExecutor.execute(DefaultLifecycleExecutor.java:180)
	at org.apache.maven.DefaultMaven.doExecute(DefaultMaven.java:328)
	at org.apache.maven.DefaultMaven.execute(DefaultMaven.java:138)
	at org.apache.maven.cli.MavenCli.main(MavenCli.java:362)
	at org.apache.maven.cli.compat.CompatibleMain.main(CompatibleMain.java:60)
	at sun.reflect.NativeMethodAccessorImpl.invoke0(Native Method)
	at sun.reflect.NativeMethodAccessorImpl.invoke(NativeMethodAccessorImpl.java:39)
	at sun.reflect.DelegatingMethodAccessorImpl.invoke(DelegatingMethodAccessorImpl.java:25)
	at java.lang.reflect.Method.invoke(Method.java:585)
	at org.codehaus.classworlds.Launcher.launchEnhanced(Launcher.java:315)
	at org.codehaus.classworlds.Launcher.launch(Launcher.java:255)
	at org.codehaus.classworlds.Launcher.mainWithExitCode(Launcher.java:430)
	at org.codehaus.classworlds.Launcher.main(Launcher.java:375)
Caused by: org.apache.maven.artifact.resolver.MultipleArtifactsNotFoundException: Missing:
----------
1) xerces:xercesImpl:jar:2.6.2

  Try downloading the file manually from the project website.

  Then, install it using the command: 
      mvn install:install-file -DgroupId=xerces -DartifactId=xercesImpl -Dversion=2.6.2 -Dpackaging=jar
-Dfile=/path/to/file

  Alternatively, if you host your own repository you can deploy the file there: 
      mvn deploy:deploy-file -DgroupId=xerces -DartifactId=xercesImpl -Dversion=2.6.2 -Dpackaging=jar
-Dfile=/path/to/file -Durl=[url] -DrepositoryId=[id]

  Path to dependency: 
  	1) org.apache.maven.reporting:maven-reporting-impl:jar:2.1-SNAPSHOT
  	2) org.apache.maven.doxia:doxia-site-renderer:jar:1.1.1
  	3) org.apache.maven.doxia:doxia-core:jar:1.1.1
  	4) xerces:xercesImpl:jar:2.6.2

----------
1 required artifact is missing.

for artifact: 
  org.apache.maven.reporting:maven-reporting-impl:jar:2.1-SNAPSHOT

from the specified remote repositories:
  Nexus (http://repository.sonatype.org:8081/content/groups/sonatype-public-grid)


	at org.apache.maven.artifact.resolver.DefaultArtifactResolver.resolveTransitively(DefaultArtifactResolver.java:360)
	at org.apache.maven.artifact.resolver.DefaultArtifactResolver.resolveTransitively(DefaultArtifactResolver.java:304)
	at org.apache.maven.plugin.DefaultPluginManager.resolveTransitiveDependencies(DefaultPluginManager.java:1499)
	at org.apache.maven.plugin.DefaultPluginManager.executeMojo(DefaultPluginManager.java:442)
	at org.apache.maven.lifecycle.DefaultLifecycleExecutor.executeGoals(DefaultLifecycleExecutor.java:694)
	... 17 more
[INFO] ------------------------------------------------------------------------
[INFO] BUILD ERRORS
[INFO] ------------------------------------------------------------------------
[INFO] Total time: 5 minutes 39 seconds
[INFO] Finished at: Sun Nov 08 09:44:47 GMT-06:00 2009
[INFO] Final Memory: 64M/114M
[INFO] ------------------------------------------------------------------------


Mime
View raw message