maven-notifications mailing list archives

Site index · List index
Message view « Date » · « Thread »
Top « Date » · « Thread »
From Hudson <Hud...@sonatype.org>
Subject Build failed in Hudson: ant-tasks » 1.5,ubuntu #60
Date Tue, 24 Nov 2009 22:53:04 GMT
See <http://grid.sonatype.org/ci/job/ant-tasks/./jdk=1.5,label=ubuntu/60/changes>

Changes:

[Paul] Minor error handling improvement.

------------------------------------------
[...truncated 135 lines...]
[INFO] Deleting file set: /home/hudson/workspace/ant-tasks/jdk/1.5/label/ubuntu/trunk/target
(included: [**], excluded: [])
Downloading: http://repository.sonatype.org:8081/content/groups/sonatype-public-grid/org/apache/maven/plugins/maven-resources-plugin/2.3/maven-resources-plugin-2.3.pom
4K downloaded  (maven-resources-plugin-2.3.pom)
Downloading: http://repository.sonatype.org:8081/content/groups/sonatype-public-grid/org/apache/maven/plugins/maven-resources-plugin/2.3/maven-resources-plugin-2.3.jar
20K downloaded  (maven-resources-plugin-2.3.jar)
Downloading: http://repository.sonatype.org:8081/content/groups/sonatype-public-grid/org/apache/maven/plugins/maven-compiler-plugin/2.0.2/maven-compiler-plugin-2.0.2.pom
2K downloaded  (maven-compiler-plugin-2.0.2.pom)
Downloading: http://repository.sonatype.org:8081/content/groups/sonatype-public-grid/org/apache/maven/plugins/maven-plugins/8/maven-plugins-8.pom
5K downloaded  (maven-plugins-8.pom)
Downloading: http://repository.sonatype.org:8081/content/groups/sonatype-public-grid/org/apache/maven/plugins/maven-compiler-plugin/2.0.2/maven-compiler-plugin-2.0.2.jar
17K downloaded  (maven-compiler-plugin-2.0.2.jar)
Downloading: http://repository.sonatype.org:8081/content/groups/sonatype-public-grid/org/apache/maven/plugins/maven-surefire-plugin/2.4.3/maven-surefire-plugin-2.4.3.pom
6K downloaded  (maven-surefire-plugin-2.4.3.pom)
Downloading: http://repository.sonatype.org:8081/content/groups/sonatype-public-grid/org/apache/maven/surefire/surefire/2.4.3/surefire-2.4.3.pom
7K downloaded  (surefire-2.4.3.pom)
Downloading: http://repository.sonatype.org:8081/content/groups/sonatype-public-grid/org/apache/maven/plugins/maven-surefire-plugin/2.4.3/maven-surefire-plugin-2.4.3.jar
22K downloaded  (maven-surefire-plugin-2.4.3.jar)
Downloading: http://repository.sonatype.org:8081/content/groups/sonatype-public-grid/org/apache/maven/plugins/maven-jar-plugin/2.2/maven-jar-plugin-2.2.pom
8K downloaded  (maven-jar-plugin-2.2.pom)
Downloading: http://repository.sonatype.org:8081/content/groups/sonatype-public-grid/org/apache/maven/plugins/maven-jar-plugin/2.2/maven-jar-plugin-2.2.jar
26K downloaded  (maven-jar-plugin-2.2.jar)
Downloading: http://repository.sonatype.org:8081/content/groups/sonatype-public-grid/org/apache/maven/plugins/maven-install-plugin/2.2/maven-install-plugin-2.2.pom
2K downloaded  (maven-install-plugin-2.2.pom)
Downloading: http://repository.sonatype.org:8081/content/groups/sonatype-public-grid/org/apache/maven/plugins/maven-install-plugin/2.2/maven-install-plugin-2.2.jar
15K downloaded  (maven-install-plugin-2.2.jar)
Downloading: http://repository.sonatype.org:8081/content/groups/sonatype-public-grid/org/apache/maven/plugins/maven-deploy-plugin/2.4/maven-deploy-plugin-2.4.pom
6K downloaded  (maven-deploy-plugin-2.4.pom)
Downloading: http://repository.sonatype.org:8081/content/groups/sonatype-public-grid/org/apache/maven/plugins/maven-plugins/11/maven-plugins-11.pom
10K downloaded  (maven-plugins-11.pom)
Downloading: http://repository.sonatype.org:8081/content/groups/sonatype-public-grid/org/apache/maven/maven-parent/8/maven-parent-8.pom
23K downloaded  (maven-parent-8.pom)
Downloading: http://repository.sonatype.org:8081/content/groups/sonatype-public-grid/org/apache/maven/plugins/maven-deploy-plugin/2.4/maven-deploy-plugin-2.4.jar
33K downloaded  (maven-deploy-plugin-2.4.jar)
Downloading: http://repository.sonatype.org:8081/content/groups/sonatype-public-grid/ant/ant/1.6.2/ant-1.6.2.pom
521b downloaded  (ant-1.6.2.pom)
Downloading: http://repository.sonatype.org:8081/content/groups/sonatype-public-grid/org/codehaus/plexus/plexus-utils/1.5.5/plexus-utils-1.5.5.pom
5K downloaded  (plexus-utils-1.5.5.pom)
Downloading: http://repository.sonatype.org:8081/content/groups/sonatype-public-grid/org/codehaus/plexus/plexus-interpolation/1.9/plexus-interpolation-1.9.pom
832b downloaded  (plexus-interpolation-1.9.pom)
Downloading: http://repository.sonatype.org:8081/content/groups/sonatype-public-grid/org/codehaus/plexus/plexus/1.0.13/plexus-1.0.13.pom
10K downloaded  (plexus-1.0.13.pom)
Downloading: http://repository.sonatype.org:8081/content/groups/sonatype-public-grid/org/apache/maven/maven-artifact/2.2.1/maven-artifact-2.2.1.pom
1K downloaded  (maven-artifact-2.2.1.pom)
Downloading: http://repository.sonatype.org:8081/content/groups/sonatype-public-grid/org/apache/maven/maven/2.2.1/maven-2.2.1.pom
21K downloaded  (maven-2.2.1.pom)
Downloading: http://repository.sonatype.org:8081/content/groups/sonatype-public-grid/org/codehaus/plexus/plexus-utils/1.5.15/plexus-utils-1.5.15.pom
6K downloaded  (plexus-utils-1.5.15.pom)
Downloading: http://repository.sonatype.org:8081/content/groups/sonatype-public-grid/org/codehaus/plexus/plexus/2.0.2/plexus-2.0.2.pom
11K downloaded  (plexus-2.0.2.pom)
Downloading: http://repository.sonatype.org:8081/content/groups/sonatype-public-grid/org/apache/maven/maven-artifact-manager/2.2.1/maven-artifact-manager-2.2.1.pom
3K downloaded  (maven-artifact-manager-2.2.1.pom)
Downloading: http://repository.sonatype.org:8081/content/groups/sonatype-public-grid/org/apache/maven/maven-repository-metadata/2.2.1/maven-repository-metadata-2.2.1.pom
1K downloaded  (maven-repository-metadata-2.2.1.pom)
Downloading: http://repository.sonatype.org:8081/content/groups/sonatype-public-grid/org/apache/maven/wagon/wagon-provider-api/1.0-beta-6/wagon-provider-api-1.0-beta-6.pom
1K downloaded  (wagon-provider-api-1.0-beta-6.pom)
Downloading: http://repository.sonatype.org:8081/content/groups/sonatype-public-grid/org/apache/maven/wagon/wagon/1.0-beta-6/wagon-1.0-beta-6.pom
12K downloaded  (wagon-1.0-beta-6.pom)
Downloading: http://repository.sonatype.org:8081/content/groups/sonatype-public-grid/org/codehaus/plexus/plexus-utils/1.4.2/plexus-utils-1.4.2.pom
1K downloaded  (plexus-utils-1.4.2.pom)
Downloading: http://repository.sonatype.org:8081/content/groups/sonatype-public-grid/backport-util-concurrent/backport-util-concurrent/3.1/backport-util-concurrent-3.1.pom
880b downloaded  (backport-util-concurrent-3.1.pom)
Downloading: http://repository.sonatype.org:8081/content/groups/sonatype-public-grid/org/apache/maven/maven-model/2.2.1/maven-model-2.2.1.pom
3K downloaded  (maven-model-2.2.1.pom)
Downloading: http://repository.sonatype.org:8081/content/groups/sonatype-public-grid/org/apache/maven/maven-project/2.2.1/maven-project-2.2.1.pom
2K downloaded  (maven-project-2.2.1.pom)
Downloading: http://repository.sonatype.org:8081/content/groups/sonatype-public-grid/org/apache/maven/maven-settings/2.2.1/maven-settings-2.2.1.pom
2K downloaded  (maven-settings-2.2.1.pom)
Downloading: http://repository.sonatype.org:8081/content/groups/sonatype-public-grid/org/codehaus/plexus/plexus-interpolation/1.11/plexus-interpolation-1.11.pom
889b downloaded  (plexus-interpolation-1.11.pom)
Downloading: http://repository.sonatype.org:8081/content/groups/sonatype-public-grid/org/codehaus/plexus/plexus-components/1.1.14/plexus-components-1.1.14.pom
5K downloaded  (plexus-components-1.1.14.pom)
Downloading: http://repository.sonatype.org:8081/content/groups/sonatype-public-grid/org/apache/maven/maven-profile/2.2.1/maven-profile-2.2.1.pom
2K downloaded  (maven-profile-2.2.1.pom)
Downloading: http://repository.sonatype.org:8081/content/groups/sonatype-public-grid/org/apache/maven/maven-plugin-registry/2.2.1/maven-plugin-registry-2.2.1.pom
1K downloaded  (maven-plugin-registry-2.2.1.pom)
Downloading: http://repository.sonatype.org:8081/content/groups/sonatype-public-grid/org/apache/maven/maven-error-diagnostics/2.2.1/maven-error-diagnostics-2.2.1.pom
1K downloaded  (maven-error-diagnostics-2.2.1.pom)
Downloading: http://repository.sonatype.org:8081/content/groups/sonatype-public-grid/org/apache/maven/wagon/wagon-file/1.0-beta-6/wagon-file-1.0-beta-6.pom
1K downloaded  (wagon-file-1.0-beta-6.pom)
Downloading: http://repository.sonatype.org:8081/content/groups/sonatype-public-grid/org/apache/maven/wagon/wagon-providers/1.0-beta-6/wagon-providers-1.0-beta-6.pom
2K downloaded  (wagon-providers-1.0-beta-6.pom)
Downloading: http://repository.sonatype.org:8081/content/groups/sonatype-public-grid/org/apache/maven/wagon/wagon-http-lightweight/1.0-beta-6/wagon-http-lightweight-1.0-beta-6.pom
1K downloaded  (wagon-http-lightweight-1.0-beta-6.pom)
Downloading: http://repository.sonatype.org:8081/content/groups/sonatype-public-grid/org/apache/maven/wagon/wagon-http-shared/1.0-beta-6/wagon-http-shared-1.0-beta-6.pom
2K downloaded  (wagon-http-shared-1.0-beta-6.pom)
Downloading: http://repository.sonatype.org:8081/content/groups/sonatype-public-grid/nekohtml/xercesMinimal/1.9.6.2/xercesMinimal-1.9.6.2.pom
390b downloaded  (xercesMinimal-1.9.6.2.pom)
Downloading: http://repository.sonatype.org:8081/content/groups/sonatype-public-grid/nekohtml/nekohtml/1.9.6.2/nekohtml-1.9.6.2.pom
704b downloaded  (nekohtml-1.9.6.2.pom)
Downloading: http://repository.sonatype.org:8081/content/groups/sonatype-public-grid/nekohtml/xercesMinimal/1.9.6.2/xercesMinimal-1.9.6.2.jar
Downloading: http://repository.sonatype.org:8081/content/groups/sonatype-public-grid/junit/junit/3.8.1/junit-3.8.1.jar
Downloading: http://repository.sonatype.org:8081/content/groups/sonatype-public-grid/backport-util-concurrent/backport-util-concurrent/3.1/backport-util-concurrent-3.1.jar
Downloading: http://repository.sonatype.org:8081/content/groups/sonatype-public-grid/org/apache/maven/maven-artifact/2.2.1/maven-artifact-2.2.1.jar
Downloading: http://repository.sonatype.org:8081/content/groups/sonatype-public-grid/ant/ant/1.6.2/ant-1.6.2.jar
38K downloaded  (xercesMinimal-1.9.6.2.jar)
118K downloaded  (junit-3.8.1.jar)
Downloading: http://repository.sonatype.org:8081/content/groups/sonatype-public-grid/classworlds/classworlds/1.1-alpha-2/classworlds-1.1-alpha-2.jar
323K downloaded  (backport-util-concurrent-3.1.jar)
Downloading: http://repository.sonatype.org:8081/content/groups/sonatype-public-grid/org/codehaus/plexus/plexus-container-default/1.0-alpha-9-stable-1/plexus-container-default-1.0-alpha-9-stable-1.jar
Downloading: http://repository.sonatype.org:8081/content/groups/sonatype-public-grid/org/apache/maven/wagon/wagon-provider-api/1.0-beta-6/wagon-provider-api-1.0-beta-6.jar
78K downloaded  (maven-artifact-2.2.1.jar)
Downloading: http://repository.sonatype.org:8081/content/groups/sonatype-public-grid/nekohtml/nekohtml/1.9.6.2/nekohtml-1.9.6.2.jar
189K downloaded  (plexus-container-default-1.0-alpha-9-stable-1.jar)
51K downloaded  (wagon-provider-api-1.0-beta-6.jar)
Downloading: http://repository.sonatype.org:8081/content/groups/sonatype-public-grid/org/apache/maven/maven-artifact-manager/2.2.1/maven-artifact-manager-2.2.1.jar
Downloading: http://repository.sonatype.org:8081/content/groups/sonatype-public-grid/org/codehaus/plexus/plexus-utils/1.5.5/plexus-utils-1.5.5.jar
109K downloaded  (nekohtml-1.9.6.2.jar)
65K downloaded  (maven-artifact-manager-2.2.1.jar)
Downloading: http://repository.sonatype.org:8081/content/groups/sonatype-public-grid/org/apache/maven/wagon/wagon-file/1.0-beta-6/wagon-file-1.0-beta-6.jar
Downloading: http://repository.sonatype.org:8081/content/groups/sonatype-public-grid/org/apache/maven/maven-repository-metadata/2.2.1/maven-repository-metadata-2.2.1.jar
245K downloaded  (plexus-utils-1.5.5.jar)
10K downloaded  (wagon-file-1.0-beta-6.jar)
Downloading: http://repository.sonatype.org:8081/content/groups/sonatype-public-grid/org/codehaus/plexus/plexus-interpolation/1.9/plexus-interpolation-1.9.jar
25K downloaded  (maven-repository-metadata-2.2.1.jar)
Downloading: http://repository.sonatype.org:8081/content/groups/sonatype-public-grid/org/apache/maven/maven-model/2.2.1/maven-model-2.2.1.jar
Downloading: http://repository.sonatype.org:8081/content/groups/sonatype-public-grid/org/apache/maven/wagon/wagon-http-lightweight/1.0-beta-6/wagon-http-lightweight-1.0-beta-6.jar
14K downloaded  (wagon-http-lightweight-1.0-beta-6.jar)
49K downloaded  (plexus-interpolation-1.9.jar)
Downloading: http://repository.sonatype.org:8081/content/groups/sonatype-public-grid/org/apache/maven/wagon/wagon-http-shared/1.0-beta-6/wagon-http-shared-1.0-beta-6.jar
24K downloaded  (wagon-http-shared-1.0-beta-6.jar)
85K downloaded  (maven-model-2.2.1.jar)
Downloading: http://repository.sonatype.org:8081/content/groups/sonatype-public-grid/org/apache/maven/maven-project/2.2.1/maven-project-2.2.1.jar
152K downloaded  (maven-project-2.2.1.jar)
Downloading: http://repository.sonatype.org:8081/content/groups/sonatype-public-grid/org/apache/maven/maven-settings/2.2.1/maven-settings-2.2.1.jar
976K downloaded  (ant-1.6.2.jar)
47K downloaded  (maven-settings-2.2.1.jar)
Downloading: http://repository.sonatype.org:8081/content/groups/sonatype-public-grid/org/apache/maven/maven-profile/2.2.1/maven-profile-2.2.1.jar
34K downloaded  (maven-profile-2.2.1.jar)
Downloading: http://repository.sonatype.org:8081/content/groups/sonatype-public-grid/org/apache/maven/maven-plugin-registry/2.2.1/maven-plugin-registry-2.2.1.jar
36K downloaded  (classworlds-1.1-alpha-2.jar)
[WARNING] Unable to get resource 'classworlds:classworlds:jar:1.1-alpha-2' from repository
central (http://Nexus): Error transferring file: Server returned HTTP response code: 500 for
URL: http://repository.sonatype.org:8081/content/groups/sonatype-public-grid/classworlds/classworlds/1.1-alpha-2/classworlds-1.1-alpha-2.jar.sha1
29K downloaded  (maven-plugin-registry-2.2.1.jar)
Downloading: http://repository.sonatype.org:8081/content/groups/sonatype-public-grid/org/apache/maven/maven-error-diagnostics/2.2.1/maven-error-diagnostics-2.2.1.jar
12K downloaded  (maven-error-diagnostics-2.2.1.jar)
[INFO] ------------------------------------------------------------------------
[ERROR] BUILD ERROR
[INFO] ------------------------------------------------------------------------
[INFO] Failed to resolve artifact.

Missing:
----------
1) classworlds:classworlds:jar:1.1-alpha-2

  Try downloading the file manually from the project website.

  Then, install it using the command: 
      mvn install:install-file -DgroupId=classworlds -DartifactId=classworlds -Dversion=1.1-alpha-2
-Dpackaging=jar -Dfile=/path/to/file

  Alternatively, if you host your own repository you can deploy the file there: 
      mvn deploy:deploy-file -DgroupId=classworlds -DartifactId=classworlds -Dversion=1.1-alpha-2
-Dpackaging=jar -Dfile=/path/to/file -Durl=[url] -DrepositoryId=[id]

  Path to dependency: 
  	1) org.apache.maven:maven-ant-tasks:jar:2.1.0-SNAPSHOT
  	2) classworlds:classworlds:jar:1.1-alpha-2

----------
1 required artifact is missing.

for artifact: 
  org.apache.maven:maven-ant-tasks:jar:2.1.0-SNAPSHOT

from the specified remote repositories:
  Nexus (http://repository.sonatype.org:8081/content/groups/sonatype-public-grid)



[INFO] ------------------------------------------------------------------------
[INFO] Trace
org.apache.maven.lifecycle.LifecycleExecutionException: Missing:
----------
1) classworlds:classworlds:jar:1.1-alpha-2

  Try downloading the file manually from the project website.

  Then, install it using the command: 
      mvn install:install-file -DgroupId=classworlds -DartifactId=classworlds -Dversion=1.1-alpha-2
-Dpackaging=jar -Dfile=/path/to/file

  Alternatively, if you host your own repository you can deploy the file there: 
      mvn deploy:deploy-file -DgroupId=classworlds -DartifactId=classworlds -Dversion=1.1-alpha-2
-Dpackaging=jar -Dfile=/path/to/file -Durl=[url] -DrepositoryId=[id]

  Path to dependency: 
  	1) org.apache.maven:maven-ant-tasks:jar:2.1.0-SNAPSHOT
  	2) classworlds:classworlds:jar:1.1-alpha-2

----------
1 required artifact is missing.

for artifact: 
  org.apache.maven:maven-ant-tasks:jar:2.1.0-SNAPSHOT

from the specified remote repositories:
  Nexus (http://repository.sonatype.org:8081/content/groups/sonatype-public-grid)


	at org.apache.maven.lifecycle.DefaultLifecycleExecutor.executeGoals(DefaultLifecycleExecutor.java:711)
	at org.apache.maven.lifecycle.DefaultLifecycleExecutor.executeGoalWithLifecycle(DefaultLifecycleExecutor.java:556)
	at org.apache.maven.lifecycle.DefaultLifecycleExecutor.executeGoal(DefaultLifecycleExecutor.java:535)
	at org.apache.maven.lifecycle.DefaultLifecycleExecutor.executeGoalAndHandleFailures(DefaultLifecycleExecutor.java:387)
	at org.apache.maven.lifecycle.DefaultLifecycleExecutor.executeTaskSegments(DefaultLifecycleExecutor.java:348)
	at org.apache.maven.lifecycle.DefaultLifecycleExecutor.execute(DefaultLifecycleExecutor.java:180)
	at org.apache.maven.DefaultMaven.doExecute(DefaultMaven.java:328)
	at org.apache.maven.DefaultMaven.execute(DefaultMaven.java:138)
	at org.apache.maven.cli.MavenCli.main(MavenCli.java:362)
	at org.apache.maven.cli.compat.CompatibleMain.main(CompatibleMain.java:60)
	at sun.reflect.NativeMethodAccessorImpl.invoke0(Native Method)
	at sun.reflect.NativeMethodAccessorImpl.invoke(NativeMethodAccessorImpl.java:39)
	at sun.reflect.DelegatingMethodAccessorImpl.invoke(DelegatingMethodAccessorImpl.java:25)
	at java.lang.reflect.Method.invoke(Method.java:585)
	at org.codehaus.classworlds.Launcher.launchEnhanced(Launcher.java:315)
	at org.codehaus.classworlds.Launcher.launch(Launcher.java:255)
	at org.codehaus.classworlds.Launcher.mainWithExitCode(Launcher.java:430)
	at org.codehaus.classworlds.Launcher.main(Launcher.java:375)
Caused by: org.apache.maven.artifact.resolver.MultipleArtifactsNotFoundException: Missing:
----------
1) classworlds:classworlds:jar:1.1-alpha-2

  Try downloading the file manually from the project website.

  Then, install it using the command: 
      mvn install:install-file -DgroupId=classworlds -DartifactId=classworlds -Dversion=1.1-alpha-2
-Dpackaging=jar -Dfile=/path/to/file

  Alternatively, if you host your own repository you can deploy the file there: 
      mvn deploy:deploy-file -DgroupId=classworlds -DartifactId=classworlds -Dversion=1.1-alpha-2
-Dpackaging=jar -Dfile=/path/to/file -Durl=[url] -DrepositoryId=[id]

  Path to dependency: 
  	1) org.apache.maven:maven-ant-tasks:jar:2.1.0-SNAPSHOT
  	2) classworlds:classworlds:jar:1.1-alpha-2

----------
1 required artifact is missing.

for artifact: 
  org.apache.maven:maven-ant-tasks:jar:2.1.0-SNAPSHOT

from the specified remote repositories:
  Nexus (http://repository.sonatype.org:8081/content/groups/sonatype-public-grid)


	at org.apache.maven.artifact.resolver.DefaultArtifactResolver.resolveTransitively(DefaultArtifactResolver.java:360)
	at org.apache.maven.artifact.resolver.DefaultArtifactResolver.resolveTransitively(DefaultArtifactResolver.java:304)
	at org.apache.maven.plugin.DefaultPluginManager.resolveTransitiveDependencies(DefaultPluginManager.java:1499)
	at org.apache.maven.plugin.DefaultPluginManager.executeMojo(DefaultPluginManager.java:442)
	at org.apache.maven.lifecycle.DefaultLifecycleExecutor.executeGoals(DefaultLifecycleExecutor.java:694)
	... 17 more
[INFO] ------------------------------------------------------------------------
[INFO] Total time: 33 seconds
[INFO] Finished at: Tue Nov 24 16:53:04 GMT-06:00 2009
[INFO] Final Memory: 11M/52M
[INFO] ------------------------------------------------------------------------


Mime
View raw message