maven-notifications mailing list archives

Site index · List index
Message view « Date » · « Thread »
Top « Date » · « Thread »
From Hudson <Hud...@sonatype.org>
Subject Build failed in Hudson: Maven-2.2.x-bootstrap » 1.5,windows #94
Date Sun, 27 Dec 2009 17:34:44 GMT
See <http://grid.sonatype.org/ci/job/Maven-2.2.x-bootstrap/./jdk=1.5,label=windows/94/changes>

Changes:

[Herve Boutemy] reordered maven.mdo fields to better match POM Code Convention.
Note: remaining issues cannot easily be fixed since Model inherits from ModelBase, then any
field in ModelBase appears at the end of Model (after build and profiles elements)

------------------------------------------
[...truncated 5826 lines...]
     [exec] [INFO] [clean:clean {execution: default-clean}]
     [exec] [INFO] [plugin:descriptor {execution: default-descriptor}]
     [exec] [INFO] Using 2 extractors.
     [exec] [INFO] Applying extractor for language: java
     [exec] [INFO] Extractor for language: java found 1 mojo descriptors.
     [exec] [INFO] Applying extractor for language: bsh
     [exec] [INFO] Extractor for language: bsh found 0 mojo descriptors.
     [exec] [INFO] [remote-resources:process {execution: default}]
     [exec] [INFO] [resources:resources {execution: default-resources}]
     [exec] [INFO] Using 'UTF-8' encoding to copy filtered resources.
     [exec] [INFO] Copying 1 resource
     [exec] [INFO] Copying 3 resources
     [exec] [INFO] [compiler:compile {execution: default-compile}]
     [exec] [INFO] Compiling 1 source file to C:\tmp\maven-integration-tests-2.2.x\core-it-support\core-it-plugins\maven-it-plugin-invalid-descriptor\target\classes
     [exec] [INFO] [resources:testResources {execution: default-testResources}]
     [exec] [INFO] Using 'UTF-8' encoding to copy filtered resources.
     [exec] [INFO] skip non existing resourceDirectory C:\tmp\maven-integration-tests-2.2.x\core-it-support\core-it-plugins\maven-it-plugin-invalid-descriptor\src\test\resources
     [exec] [INFO] Copying 3 resources
     [exec] [INFO] [compiler:testCompile {execution: default-testCompile}]
     [exec] [INFO] No sources to compile
     [exec] [INFO] [surefire:test {execution: default-test}]
     [exec] [INFO] Surefire report directory: C:\tmp\maven-integration-tests-2.2.x\core-it-support\core-it-plugins\maven-it-plugin-invalid-descriptor\target\surefire-reports
     [exec] 
     [exec] -------------------------------------------------------
     [exec]  T E S T S
     [exec] -------------------------------------------------------
     [exec] There are no tests to run.
     [exec] 
     [exec] Results :
     [exec] 
     [exec] Tests run: 0, Failures: 0, Errors: 0, Skipped: 0
     [exec] 
     [exec] [INFO] [jar:jar {execution: default-jar}]
     [exec] [INFO] Building jar: C:\tmp\maven-integration-tests-2.2.x\core-it-support\core-it-plugins\maven-it-plugin-invalid-descriptor\target\maven-it-plugin-invalid-descriptor-2.1-SNAPSHOT.jar
     [exec] [INFO] [plugin:addPluginArtifactMetadata {execution: default-addPluginArtifactMetadata}]
     [exec] [INFO] [install:install {execution: default-install}]
     [exec] [INFO] Installing C:\tmp\maven-integration-tests-2.2.x\core-it-support\core-it-plugins\maven-it-plugin-invalid-descriptor\target\maven-it-plugin-invalid-descriptor-2.1-SNAPSHOT.jar
to C:\opt\repos\bootstrap-maven-2.2.x\org\apache\maven\its\plugins\maven-it-plugin-invalid-descriptor\2.1-SNAPSHOT\maven-it-plugin-invalid-descriptor-2.1-SNAPSHOT.jar
     [exec] [INFO] ------------------------------------------------------------------------
     [exec] [INFO] Building Maven Integration Test Plugin :: Log File
     [exec] [INFO]    task-segment: [clean, install]
     [exec] [INFO] ------------------------------------------------------------------------
     [exec] [INFO] [clean:clean {execution: default-clean}]
     [exec] [INFO] [plugin:descriptor {execution: default-descriptor}]
     [exec] [INFO] Using 2 extractors.
     [exec] [INFO] Applying extractor for language: java
     [exec] [INFO] Extractor for language: java found 3 mojo descriptors.
     [exec] [INFO] Applying extractor for language: bsh
     [exec] [INFO] Extractor for language: bsh found 0 mojo descriptors.
     [exec] [INFO] [remote-resources:process {execution: default}]
     [exec] [INFO] [resources:resources {execution: default-resources}]
     [exec] [INFO] Using 'UTF-8' encoding to copy filtered resources.
     [exec] [INFO] skip non existing resourceDirectory C:\tmp\maven-integration-tests-2.2.x\core-it-support\core-it-plugins\maven-it-plugin-log-file\src\main\resources
     [exec] [INFO] Copying 3 resources
     [exec] [INFO] [compiler:compile {execution: default-compile}]
     [exec] [INFO] Compiling 4 source files to C:\tmp\maven-integration-tests-2.2.x\core-it-support\core-it-plugins\maven-it-plugin-log-file\target\classes
     [exec] [INFO] [resources:testResources {execution: default-testResources}]
     [exec] [INFO] Using 'UTF-8' encoding to copy filtered resources.
     [exec] [INFO] skip non existing resourceDirectory C:\tmp\maven-integration-tests-2.2.x\core-it-support\core-it-plugins\maven-it-plugin-log-file\src\test\resources
     [exec] [INFO] Copying 3 resources
     [exec] [INFO] [compiler:testCompile {execution: default-testCompile}]
     [exec] [INFO] Not compiling test sources
     [exec] [INFO] [surefire:test {execution: default-test}]
     [exec] [INFO] Tests are skipped.
     [exec] [INFO] [jar:jar {execution: default-jar}]
     [exec] [INFO] Building jar: C:\tmp\maven-integration-tests-2.2.x\core-it-support\core-it-plugins\maven-it-plugin-log-file\target\maven-it-plugin-log-file-2.1-SNAPSHOT.jar
     [exec] [INFO] [plugin:addPluginArtifactMetadata {execution: default-addPluginArtifactMetadata}]
     [exec] [INFO] [install:install {execution: default-install}]
     [exec] [INFO] Installing C:\tmp\maven-integration-tests-2.2.x\core-it-support\core-it-plugins\maven-it-plugin-log-file\target\maven-it-plugin-log-file-2.1-SNAPSHOT.jar
to C:\opt\repos\bootstrap-maven-2.2.x\org\apache\maven\its\plugins\maven-it-plugin-log-file\2.1-SNAPSHOT\maven-it-plugin-log-file-2.1-SNAPSHOT.jar
     [exec] [INFO] ------------------------------------------------------------------------
     [exec] [INFO] Building Maven Integration Test Plugin :: No Default Component
     [exec] [INFO]    task-segment: [clean, install]
     [exec] [INFO] ------------------------------------------------------------------------
     [exec] [INFO] [clean:clean {execution: default-clean}]
     [exec] [INFO] [plugin:descriptor {execution: default-descriptor}]
     [exec] [INFO] Using 2 extractors.
     [exec] [INFO] Applying extractor for language: java
     [exec] [INFO] Extractor for language: java found 1 mojo descriptors.
     [exec] [INFO] Applying extractor for language: bsh
     [exec] [INFO] Extractor for language: bsh found 0 mojo descriptors.
     [exec] [INFO] [remote-resources:process {execution: default}]
     [exec] [INFO] [resources:resources {execution: default-resources}]
     [exec] [INFO] Using 'UTF-8' encoding to copy filtered resources.
     [exec] [INFO] Copying 1 resource
     [exec] [INFO] Copying 3 resources
     [exec] [INFO] [compiler:compile {execution: default-compile}]
     [exec] [INFO] Compiling 3 source files to C:\tmp\maven-integration-tests-2.2.x\core-it-support\core-it-plugins\maven-it-plugin-no-default-comp\target\classes
     [exec] [INFO] ------------------------------------------------------------------------
     [exec] [ERROR] BUILD FAILURE
     [exec] [INFO] ------------------------------------------------------------------------
     [exec] [INFO] Compilation failure
     [exec] Failure executing javac, but could not parse the error:
     [exec] 
     [exec] 
     [exec] The system is out of resources.
     [exec] Consult the following stack trace for details.
     [exec] java.lang.OutOfMemoryError: PermGen space
     [exec] 	at java.lang.ClassLoader.defineClass1(Native Method)
     [exec] 	at java.lang.ClassLoader.defineClass(ClassLoader.java:621)
     [exec] 	at java.security.SecureClassLoader.defineClass(SecureClassLoader.java:124)
     [exec] 	at java.net.URLClassLoader.defineClass(URLClassLoader.java:260)
     [exec] 	at java.net.URLClassLoader.access$000(URLClassLoader.java:56)
     [exec] 	at java.net.URLClassLoader$1.run(URLClassLoader.java:195)
     [exec] 	at java.security.AccessController.doPrivileged(Native Method)
     [exec] 	at java.net.URLClassLoader.findClass(URLClassLoader.java:188)
     [exec] 	at org.codehaus.plexus.compiler.javac.IsolatedClassLoader.loadClass(IsolatedClassLoader.java:56)
     [exec] 	at java.lang.ClassLoader.loadClassInternal(ClassLoader.java:320)
     [exec] 	at com.sun.tools.javac.main.JavaCompiler.<init>(JavaCompiler.java:293)
     [exec] 	at com.sun.tools.javac.main.JavaCompiler.instance(JavaCompiler.java:72)
     [exec] 	at com.sun.tools.javac.main.Main.compile(Main.java:340)
     [exec] 	at com.sun.tools.javac.main.Main.compile(Main.java:279)
     [exec] 	at com.sun.tools.javac.main.Main.compile(Main.java:270)
     [exec] 	at com.sun.tools.javac.Main.compile(Main.java:87)
     [exec] 	at sun.reflect.NativeMethodAccessorImpl.invoke0(Native Method)
     [exec] 	at sun.reflect.NativeMethodAccessorImpl.invoke(NativeMethodAccessorImpl.java:39)
     [exec] 	at sun.reflect.DelegatingMethodAccessorImpl.invoke(DelegatingMethodAccessorImpl.java:25)
     [exec] 	at java.lang.reflect.Method.invoke(Method.java:597)
     [exec] 	at org.codehaus.plexus.compiler.javac.JavacCompiler.compileInProcess(JavacCompiler.java:420)
     [exec] 	at org.codehaus.plexus.compiler.javac.JavacCompiler.compile(JavacCompiler.java:141)
     [exec] 	at org.apache.maven.plugin.AbstractCompilerMojo.execute(AbstractCompilerMojo.java:493)
     [exec] 	at org.apache.maven.plugin.CompilerMojo.execute(CompilerMojo.java:114)
     [exec] 	at org.apache.maven.plugin.DefaultPluginManager.executeMojo(DefaultPluginManager.java:490)
     [exec] 	at org.apache.maven.lifecycle.DefaultLifecycleExecutor.executeGoals(DefaultLifecycleExecutor.java:694)
     [exec] 	at org.apache.maven.lifecycle.DefaultLifecycleExecutor.executeGoalWithLifecycle(DefaultLifecycleExecutor.java:556)
     [exec] 	at org.apache.maven.lifecycle.DefaultLifecycleExecutor.executeGoal(DefaultLifecycleExecutor.java:535)
     [exec] 	at org.apache.maven.lifecycle.DefaultLifecycleExecutor.executeGoalAndHandleFailures(DefaultLifecycleExecutor.java:387)
     [exec] 	at org.apache.maven.lifecycle.DefaultLifecycleExecutor.executeTaskSegments(DefaultLifecycleExecutor.java:348)
     [exec] 	at org.apache.maven.lifecycle.DefaultLifecycleExecutor.execute(DefaultLifecycleExecutor.java:180)
     [exec] 	at org.apache.maven.DefaultMaven.doExecute(DefaultMaven.java:334)
     [exec] 
     [exec] 
     [exec] [INFO] ------------------------------------------------------------------------
     [exec] [INFO] Trace
     [exec] org.apache.maven.BuildFailureException: Compilation failure
     [exec] Failure executing javac, but could not parse the error:
     [exec] 
     [exec] 
     [exec] The system is out of resources.
     [exec] Consult the following stack trace for details.
     [exec] java.lang.OutOfMemoryError: PermGen space
     [exec] 	at java.lang.ClassLoader.defineClass1(Native Method)
     [exec] 	at java.lang.ClassLoader.defineClass(ClassLoader.java:621)
     [exec] 	at java.security.SecureClassLoader.defineClass(SecureClassLoader.java:124)
     [exec] 	at java.net.URLClassLoader.defineClass(URLClassLoader.java:260)
     [exec] 	at java.net.URLClassLoader.access$000(URLClassLoader.java:56)
     [exec] 	at java.net.URLClassLoader$1.run(URLClassLoader.java:195)
     [exec] 	at java.security.AccessController.doPrivileged(Native Method)
     [exec] 	at java.net.URLClassLoader.findClass(URLClassLoader.java:188)
     [exec] 	at org.codehaus.plexus.compiler.javac.IsolatedClassLoader.loadClass(IsolatedClassLoader.java:56)
     [exec] 	at java.lang.ClassLoader.loadClassInternal(ClassLoader.java:320)
     [exec] 	at com.sun.tools.javac.main.JavaCompiler.<init>(JavaCompiler.java:293)
     [exec] 	at com.sun.tools.javac.main.JavaCompiler.instance(JavaCompiler.java:72)
     [exec] 	at com.sun.tools.javac.main.Main.compile(Main.java:340)
     [exec] 	at com.sun.tools.javac.main.Main.compile(Main.java:279)
     [exec] 	at com.sun.tools.javac.main.Main.compile(Main.java:270)
     [exec] 	at com.sun.tools.javac.Main.compile(Main.java:87)
     [exec] 	at sun.reflect.NativeMethodAccessorImpl.invoke0(Native Method)
     [exec] 	at sun.reflect.NativeMethodAccessorImpl.invoke(NativeMethodAccessorImpl.java:39)
     [exec] 	at sun.reflect.DelegatingMethodAccessorImpl.invoke(DelegatingMethodAccessorImpl.java:25)
     [exec] 	at java.lang.reflect.Method.invoke(Method.java:597)
     [exec] 	at org.codehaus.plexus.compiler.javac.JavacCompiler.compileInProcess(JavacCompiler.java:420)
     [exec] 	at org.codehaus.plexus.compiler.javac.JavacCompiler.compile(JavacCompiler.java:141)
     [exec] 	at org.apache.maven.plugin.AbstractCompilerMojo.execute(AbstractCompilerMojo.java:493)
     [exec] 	at org.apache.maven.plugin.CompilerMojo.execute(CompilerMojo.java:114)
     [exec] 	at org.apache.maven.plugin.DefaultPluginManager.executeMojo(DefaultPluginManager.java:490)
     [exec] 	at org.apache.maven.lifecycle.DefaultLifecycleExecutor.executeGoals(DefaultLifecycleExecutor.java:694)
     [exec] 	at org.apache.maven.lifecycle.DefaultLifecycleExecutor.executeGoalWithLifecycle(DefaultLifecycleExecutor.java:556)
     [exec] 	at org.apache.maven.lifecycle.DefaultLifecycleExecutor.executeGoal(DefaultLifecycleExecutor.java:535)
     [exec] 	at org.apache.maven.lifecycle.DefaultLifecycleExecutor.executeGoalAndHandleFailures(DefaultLifecycleExecutor.java:387)
     [exec] 	at org.apache.maven.lifecycle.DefaultLifecycleExecutor.executeTaskSegments(DefaultLifecycleExecutor.java:348)
     [exec] 	at org.apache.maven.lifecycle.DefaultLifecycleExecutor.execute(DefaultLifecycleExecutor.java:180)
     [exec] 	at org.apache.maven.DefaultMaven.doExecute(DefaultMaven.java:334)
     [exec] 
     [exec] 
     [exec] 	at org.apache.maven.lifecycle.DefaultLifecycleExecutor.executeGoals(DefaultLifecycleExecutor.java:715)
     [exec] 	at org.apache.maven.lifecycle.DefaultLifecycleExecutor.executeGoalWithLifecycle(DefaultLifecycleExecutor.java:556)
     [exec] 	at org.apache.maven.lifecycle.DefaultLifecycleExecutor.executeGoal(DefaultLifecycleExecutor.java:535)
     [exec] 	at org.apache.maven.lifecycle.DefaultLifecycleExecutor.executeGoalAndHandleFailures(DefaultLifecycleExecutor.java:387)
     [exec] 	at org.apache.maven.lifecycle.DefaultLifecycleExecutor.executeTaskSegments(DefaultLifecycleExecutor.java:348)
     [exec] 	at org.apache.maven.lifecycle.DefaultLifecycleExecutor.execute(DefaultLifecycleExecutor.java:180)
     [exec] 	at org.apache.maven.DefaultMaven.doExecute(DefaultMaven.java:334)
     [exec] 	at org.apache.maven.DefaultMaven.execute(DefaultMaven.java:141)
     [exec] 	at org.apache.maven.cli.MavenCli.main(MavenCli.java:362)
     [exec] 	at org.apache.maven.cli.compat.CompatibleMain.main(CompatibleMain.java:60)
     [exec] 	at sun.reflect.NativeMethodAccessorImpl.invoke0(Native Method)
     [exec] 	at sun.reflect.NativeMethodAccessorImpl.invoke(NativeMethodAccessorImpl.java:39)
     [exec] 	at sun.reflect.DelegatingMethodAccessorImpl.invoke(DelegatingMethodAccessorImpl.java:25)
     [exec] 	at java.lang.reflect.Method.invoke(Method.java:597)
     [exec] 	at org.codehaus.classworlds.Launcher.launchEnhanced(Launcher.java:315)
     [exec] 	at org.codehaus.classworlds.Launcher.launch(Launcher.java:255)
     [exec] 	at org.codehaus.classworlds.Launcher.mainWithExitCode(Launcher.java:430)
     [exec] 	at org.codehaus.classworlds.Launcher.main(Launcher.java:375)
     [exec] Caused by: org.apache.maven.plugin.CompilationFailureException: Compilation failure
     [exec] Failure executing javac, but could not parse the error:
     [exec] 
     [exec] 
     [exec] The system is out of resources.
     [exec] Consult the following stack trace for details.
     [exec] java.lang.OutOfMemoryError: PermGen space
     [exec] 	at java.lang.ClassLoader.defineClass1(Native Method)
     [exec] 	at java.lang.ClassLoader.defineClass(ClassLoader.java:621)
     [exec] 	at java.security.SecureClassLoader.defineClass(SecureClassLoader.java:124)
     [exec] 	at java.net.URLClassLoader.defineClass(URLClassLoader.java:260)
     [exec] 	at java.net.URLClassLoader.access$000(URLClassLoader.java:56)
     [exec] 	at java.net.URLClassLoader$1.run(URLClassLoader.java:195)
     [exec] 	at java.security.AccessController.doPrivileged(Native Method)
     [exec] 	at java.net.URLClassLoader.findClass(URLClassLoader.java:188)
     [exec] 	at org.codehaus.plexus.compiler.javac.IsolatedClassLoader.loadClass(IsolatedClassLoader.java:56)
     [exec] 	at java.lang.ClassLoader.loadClassInternal(ClassLoader.java:320)
     [exec] 	at com.sun.tools.javac.main.JavaCompiler.<init>(JavaCompiler.java:293)
     [exec] 	at com.sun.tools.javac.main.JavaCompiler.instance(JavaCompiler.java:72)
     [exec] 	at com.sun.tools.javac.main.Main.compile(Main.java:340)
     [exec] 	at com.sun.tools.javac.main.Main.compile(Main.java:279)
     [exec] 	at com.sun.tools.javac.main.Main.compile(Main.java:270)
     [exec] 	at com.sun.tools.javac.Main.compile(Main.java:87)
     [exec] 	at sun.reflect.NativeMethodAccessorImpl.invoke0(Native Method)
     [exec] 	at sun.reflect.NativeMethodAccessorImpl.invoke(NativeMethodAccessorImpl.java:39)
     [exec] 	at sun.reflect.DelegatingMethodAccessorImpl.invoke(DelegatingMethodAccessorImpl.java:25)
     [exec] 	at java.lang.reflect.Method.invoke(Method.java:597)
     [exec] 	at org.codehaus.plexus.compiler.javac.JavacCompiler.compileInProcess(JavacCompiler.java:420)
     [exec] 	at org.codehaus.plexus.compiler.javac.JavacCompiler.compile(JavacCompiler.java:141)
     [exec] 	at org.apache.maven.plugin.AbstractCompilerMojo.execute(AbstractCompilerMojo.java:493)
     [exec] 	at org.apache.maven.plugin.CompilerMojo.execute(CompilerMojo.java:114)
     [exec] 	at org.apache.maven.plugin.DefaultPluginManager.executeMojo(DefaultPluginManager.java:490)
     [exec] 	at org.apache.maven.lifecycle.DefaultLifecycleExecutor.executeGoals(DefaultLifecycleExecutor.java:694)
     [exec] 	at org.apache.maven.lifecycle.DefaultLifecycleExecutor.executeGoalWithLifecycle(DefaultLifecycleExecutor.java:556)
     [exec] 	at org.apache.maven.lifecycle.DefaultLifecycleExecutor.executeGoal(DefaultLifecycleExecutor.java:535)
     [exec] 	at org.apache.maven.lifecycle.DefaultLifecycleExecutor.executeGoalAndHandleFailures(DefaultLifecycleExecutor.java:387)
     [exec] 	at org.apache.maven.lifecycle.DefaultLifecycleExecutor.executeTaskSegments(DefaultLifecycleExecutor.java:348)
     [exec] 	at org.apache.maven.lifecycle.DefaultLifecycleExecutor.execute(DefaultLifecycleExecutor.java:180)
     [exec] 	at org.apache.maven.DefaultMaven.doExecute(DefaultMaven.java:334)
     [exec] 
     [exec] 
     [exec] 	at org.apache.maven.plugin.AbstractCompilerMojo.execute(AbstractCompilerMojo.java:516)
     [exec] 	at org.apache.maven.plugin.CompilerMojo.execute(CompilerMojo.java:114)
     [exec] 	at org.apache.maven.plugin.DefaultPluginManager.executeMojo(DefaultPluginManager.java:490)
     [exec] 	at org.apache.maven.lifecycle.DefaultLifecycleExecutor.executeGoals(DefaultLifecycleExecutor.java:694)
     [exec] 	... 17 more
     [exec] [INFO] ------------------------------------------------------------------------
     [exec] [INFO] Total time: 51 seconds
     [exec] [INFO] Finished at: Sun Dec 27 08:27:15 PST 2009
     [exec] [INFO] Final Memory: 37M/202M
     [exec] [INFO] ------------------------------------------------------------------------

BUILD FAILED
C:\home\hudson\workspace\Maven-2.2.x-bootstrap\jdk\1.5\label\windows\maven-2.2.x\build.xml:273:
exec returned: 1

Total time: 6 minutes 46 seconds
Archiving artifacts
Sending notification to: jdcasey@jabber.org


Mime
View raw message