maven-notifications mailing list archives

Site index · List index
Message view « Date » · « Thread »
Top « Date » · « Thread »
From Hudson <Hud...@sonatype.org>
Subject Build failed in Hudson: wagon » ubuntu #55
Date Tue, 29 Dec 2009 16:56:10 GMT
See <http://grid.sonatype.org/ci/job/wagon/./label=ubuntu/55/changes>

Changes:

[Benjamin Bentmann] o Added workaround for QDOX-148

[Benjamin Bentmann] o Fixed warnings

[Benjamin Bentmann] o Used annos to generate component descriptor

------------------------------------------
[...truncated 7938 lines...]
#https://localhost:10007/newfolder/folder2/directory-copy-existing/c/test-resource-4.txt -
Status code: 201

Transfer finished. 21 bytes copied in 0.0040 seconds
https://localhost:10007/newfolder/folder2/directory-copy-existing/test-resource-1.txt - Status
code: 200
last-modified = Tue, 29 Dec 2009 16:56:07 GMT (1262105767000)
attempting to create parent directories for destination: test-resource-1.txt
Downloading: directory-copy-existing/test-resource-1.txt from https://localhost:10007/newfolder/folder2

#
Transfer finished. 19 bytes copied in 0.0010 seconds
https://localhost:10007/newfolder/folder2/directory-copy-existing/a/test-resource-2.txt -
Status code: 200
last-modified = Tue, 29 Dec 2009 16:56:07 GMT (1262105767000)
attempting to create parent directories for destination: test-resource-2.txt
Downloading: directory-copy-existing/a/test-resource-2.txt from https://localhost:10007/newfolder/folder2

#
Transfer finished. 21 bytes copied in 0.0010 seconds
https://localhost:10007/newfolder/folder2/directory-copy-existing/a/b/test-resource-3.txt
- Status code: 200
last-modified = Tue, 29 Dec 2009 16:56:07 GMT (1262105767000)
attempting to create parent directories for destination: test-resource-3.txt
Downloading: directory-copy-existing/a/b/test-resource-3.txt from https://localhost:10007/newfolder/folder2

#
Transfer finished. 23 bytes copied in 0.0010 seconds
https://localhost:10007/newfolder/folder2/directory-copy-existing/c/test-resource-4.txt -
Status code: 200
last-modified = Tue, 29 Dec 2009 16:56:07 GMT (1262105767000)
attempting to create parent directories for destination: test-resource-4.txt
Downloading: directory-copy-existing/c/test-resource-4.txt from https://localhost:10007/newfolder/folder2

#
Transfer finished. 21 bytes copied in 0.0010 seconds
https://localhost:10007/newfolder/folder2 - Session: Disconnecting  
https://localhost:10007/newfolder/folder2 - Session: Disconnected
Local repository: Repository[file:///home/hudson/workspace/wagon/label/ubuntu/trunk/wagon-providers/wagon-webdav-jackrabbit/target/test-output/local-repository]
https://localhost:10007/newfolder/folder2 - Session: Opened  
Uploading: ./a/test-resource-2.txt to https://localhost:10007/newfolder/folder2

#https://localhost:10007/newfolder/folder2/./a/test-resource-2.txt - Status code: 201

Transfer finished. 21 bytes copied in 0.0040 seconds
Uploading: ./a/b/test-resource-3.txt to https://localhost:10007/newfolder/folder2

#https://localhost:10007/newfolder/folder2/./a/b/test-resource-3.txt - Status code: 201

Transfer finished. 23 bytes copied in 0.0060 seconds
Uploading: ./test-resource-1.txt to https://localhost:10007/newfolder/folder2

#https://localhost:10007/newfolder/folder2/./test-resource-1.txt - Status code: 201

Transfer finished. 19 bytes copied in 0.0050 seconds
Uploading: ./c/test-resource-4.txt to https://localhost:10007/newfolder/folder2

#https://localhost:10007/newfolder/folder2/./c/test-resource-4.txt - Status code: 201

Transfer finished. 21 bytes copied in 0.0030 seconds
https://localhost:10007/newfolder/folder2/test-resource-1.txt - Status code: 200
last-modified = Tue, 29 Dec 2009 16:56:08 GMT (1262105768000)
attempting to create parent directories for destination: test-resource-1.txt
Downloading: test-resource-1.txt from https://localhost:10007/newfolder/folder2

#
Transfer finished. 19 bytes copied in 0.0 seconds
https://localhost:10007/newfolder/folder2/a/test-resource-2.txt - Status code: 200
last-modified = Tue, 29 Dec 2009 16:56:08 GMT (1262105768000)
attempting to create parent directories for destination: test-resource-2.txt
Downloading: a/test-resource-2.txt from https://localhost:10007/newfolder/folder2

#
Transfer finished. 21 bytes copied in 0.0 seconds
https://localhost:10007/newfolder/folder2/a/b/test-resource-3.txt - Status code: 200
last-modified = Tue, 29 Dec 2009 16:56:08 GMT (1262105768000)
attempting to create parent directories for destination: test-resource-3.txt
Downloading: a/b/test-resource-3.txt from https://localhost:10007/newfolder/folder2

#
Transfer finished. 23 bytes copied in 0.0010 seconds
https://localhost:10007/newfolder/folder2/c/test-resource-4.txt - Status code: 200
last-modified = Tue, 29 Dec 2009 16:56:08 GMT (1262105768000)
attempting to create parent directories for destination: test-resource-4.txt
Downloading: c/test-resource-4.txt from https://localhost:10007/newfolder/folder2

#
Transfer finished. 21 bytes copied in 0.0010 seconds
https://localhost:10007/newfolder/folder2 - Session: Disconnecting  
https://localhost:10007/newfolder/folder2 - Session: Disconnected
Local repository: Repository[file:///home/hudson/workspace/wagon/label/ubuntu/trunk/wagon-providers/wagon-webdav-jackrabbit/target/test-output/local-repository]
Getting test artifact from test repository Repository[davs://localhost:10007/newfolder/folder2]
https://localhost:10007/newfolder/folder2 - Session: Opened  
https://localhost:10007/newfolder/folder2/fubar.txt - Status code: 404
 Transfer error: org.apache.maven.wagon.ResourceDoesNotExistException: File: https://localhost:10007/newfolder/folder2/fubar.txt
does not exist
https://localhost:10007/newfolder/folder2 - Session: Disconnecting  
https://localhost:10007/newfolder/folder2 - Session: Disconnected
Local repository: Repository[file:///home/hudson/workspace/wagon/label/ubuntu/trunk/wagon-providers/wagon-webdav-jackrabbit/target/test-output/local-repository]
Getting test artifact from test repository Repository[davs://localhost:10007/newfolder/folder2]
https://localhost:10007/newfolder/folder2 - Session: Opened  
https://localhost:10007/newfolder/folder2/fubar.txt - Status code: 404
 Transfer error: org.apache.maven.wagon.ResourceDoesNotExistException: File: https://localhost:10007/newfolder/folder2/fubar.txt
does not exist
https://localhost:10007/newfolder/folder2 - Session: Disconnecting  
https://localhost:10007/newfolder/folder2 - Session: Disconnected
Local repository: Repository[file:///home/hudson/workspace/wagon/label/ubuntu/trunk/wagon-providers/wagon-webdav-jackrabbit/target/test-output/local-repository]
https://localhost:10007/newfolder/folder2 - Session: Opened  
https://localhost:10007/newfolder/folder2 - Session: Disconnecting  
https://localhost:10007/newfolder/folder2 - Session: Disconnected
Local repository: Repository[file:///home/hudson/workspace/wagon/label/ubuntu/trunk/wagon-providers/wagon-webdav-jackrabbit/target/test-output/local-repository]
Putting test artifact: test-resource into test repository Repository[davs://localhost:10007/newfolder/folder2]
https://localhost:10007/newfolder/folder2 - Session: Opened  
Uploading: test-resource to https://localhost:10007/newfolder/folder2

#https://localhost:10007/newfolder/folder2/test-resource - Status code: 201

Transfer finished. 18 bytes copied in 0.0040 seconds
https://localhost:10007/newfolder/folder2 - Session: Disconnecting  
https://localhost:10007/newfolder/folder2 - Session: Disconnected
https://localhost:10007/newfolder/folder2 - Session: Opened  
https://localhost:10007/newfolder/folder2 - Session: Disconnecting  
https://localhost:10007/newfolder/folder2 - Session: Disconnected
Local repository: Repository[file:///home/hudson/workspace/wagon/label/ubuntu/trunk/wagon-providers/wagon-webdav-jackrabbit/target/test-output/local-repository]
https://localhost:10007/newfolder/folder2 - Session: Opened  
https://localhost:10007/newfolder/folder2 - Session: Disconnecting  
https://localhost:10007/newfolder/folder2 - Session: Disconnected
Tests run: 51, Failures: 0, Errors: 0, Skipped: 0, Time elapsed: 4.925 sec

Results :

Tests run: 103, Failures: 0, Errors: 0, Skipped: 0

[INFO] 
[INFO] --- maven-jar-plugin:2.2:jar (default-jar) @ wagon-webdav-jackrabbit ---
[INFO] Building jar: /home/hudson/workspace/wagon/label/ubuntu/trunk/wagon-providers/wagon-webdav-jackrabbit/target/wagon-webdav-jackrabbit-1.0-beta-7-SNAPSHOT.jar
[INFO] 
[INFO] --- maven-install-plugin:2.2:install (default-install) @ wagon-webdav-jackrabbit ---
[INFO] Installing /home/hudson/workspace/wagon/label/ubuntu/trunk/wagon-providers/wagon-webdav-jackrabbit/target/wagon-webdav-jackrabbit-1.0-beta-7-SNAPSHOT.jar
to /opt/repos/wagon/org/apache/maven/wagon/wagon-webdav-jackrabbit/1.0-beta-7-SNAPSHOT/wagon-webdav-jackrabbit-1.0-beta-7-SNAPSHOT.jar
[INFO]                                                                         
[INFO] ------------------------------------------------------------------------
[INFO] Building Maven Test Compatibility Kits 1.0-beta-7-SNAPSHOT
[INFO] ------------------------------------------------------------------------
[INFO] 
[INFO] --- maven-clean-plugin:2.3:clean (default-clean) @ wagon-tcks ---
[INFO] Deleting file set: /home/hudson/workspace/wagon/label/ubuntu/trunk/wagon-tcks/target
(included: [**], excluded: [])
[INFO] 
[INFO] --- plexus-maven-plugin:1.3.5:descriptor (generate) @ wagon-tcks ---
[INFO] 
[INFO] --- maven-remote-resources-plugin:1.0:process (default) @ wagon-tcks ---
[INFO] 
[INFO] --- maven-install-plugin:2.2:install (default-install) @ wagon-tcks ---
[INFO] Installing /home/hudson/workspace/wagon/label/ubuntu/trunk/wagon-tcks/pom.xml to /opt/repos/wagon/org/apache/maven/wagon/wagon-tcks/1.0-beta-7-SNAPSHOT/wagon-tcks-1.0-beta-7-SNAPSHOT.pom
[INFO]                                                                         
[INFO] ------------------------------------------------------------------------
[INFO] Building Wagon HTTP Test Compatibility Kit 1.0-beta-7-SNAPSHOT
[INFO] ------------------------------------------------------------------------
[INFO] 
[INFO] --- maven-clean-plugin:2.3:clean (default-clean) @ wagon-tck-http ---
[INFO] Deleting file set: /home/hudson/workspace/wagon/label/ubuntu/trunk/wagon-tcks/wagon-tck-http/target
(included: [**], excluded: [])
[INFO] 
[INFO] --- plexus-maven-plugin:1.3.5:descriptor (generate) @ wagon-tck-http ---
[INFO] 
[INFO] --- maven-remote-resources-plugin:1.0:process (default) @ wagon-tck-http ---
[INFO] 
[INFO] --- maven-resources-plugin:2.3:resources (default-resources) @ wagon-tck-http ---
[INFO] Using 'UTF-8' encoding to copy filtered resources.
[INFO] Copying 4 resources
[INFO] skip non existing resourceDirectory /home/hudson/workspace/wagon/label/ubuntu/trunk/wagon-tcks/wagon-tck-http/target/generated-resources/plexus
[INFO] Copying 3 resources
[INFO] 
[INFO] --- maven-compiler-plugin:2.1-SNAPSHOT:compile (default-compile) @ wagon-tck-http ---
[INFO] Compiling 15 source files to /home/hudson/workspace/wagon/label/ubuntu/trunk/wagon-tcks/wagon-tck-http/target/classes
[INFO] 
[INFO] --- maven-resources-plugin:2.3:testResources (default-testResources) @ wagon-tck-http
---
[INFO] Using 'UTF-8' encoding to copy filtered resources.
[INFO] skip non existing resourceDirectory /home/hudson/workspace/wagon/label/ubuntu/trunk/wagon-tcks/wagon-tck-http/src/test/resources
[INFO] Copying 3 resources
[INFO] 
[INFO] --- maven-compiler-plugin:2.1-SNAPSHOT:testCompile (default-testCompile) @ wagon-tck-http
---
[INFO] No sources to compile
[INFO] 
[INFO] --- maven-surefire-plugin:2.4.3:test (default-test) @ wagon-tck-http ---
[INFO] Surefire report directory: /home/hudson/workspace/wagon/label/ubuntu/trunk/wagon-tcks/wagon-tck-http/target/surefire-reports

-------------------------------------------------------
 T E S T S
-------------------------------------------------------
There are no tests to run.

Results :

Tests run: 0, Failures: 0, Errors: 0, Skipped: 0

[INFO] 
[INFO] --- maven-jar-plugin:2.2:jar (default-jar) @ wagon-tck-http ---
[INFO] Building jar: /home/hudson/workspace/wagon/label/ubuntu/trunk/wagon-tcks/wagon-tck-http/target/wagon-tck-http-1.0-beta-7-SNAPSHOT.jar
[INFO] 
[INFO] --- maven-install-plugin:2.2:install (default-install) @ wagon-tck-http ---
[INFO] Installing /home/hudson/workspace/wagon/label/ubuntu/trunk/wagon-tcks/wagon-tck-http/target/wagon-tck-http-1.0-beta-7-SNAPSHOT.jar
to /opt/repos/wagon/org/apache/maven/wagon/wagon-tck-http/1.0-beta-7-SNAPSHOT/wagon-tck-http-1.0-beta-7-SNAPSHOT.jar
[INFO] ------------------------------------------------------------------------
[INFO] Reactor Summary:
[INFO] 
[INFO] Maven Wagon ....................................... SUCCESS [1.647s]
[INFO] Maven Wagon API ................................... SUCCESS [25.503s]
[INFO] Maven Wagon Provider Test ......................... SUCCESS [1.273s]
[INFO] Maven Wagon Providers ............................. SUCCESS [0.128s]
[INFO] Maven Wagon File Provider ......................... SUCCESS [2.284s]
[INFO] Maven Wagon FTP Provider .......................... SUCCESS [16.096s]
[INFO] Maven Wagon HTTP Shared Library ................... SUCCESS [1.970s]
[INFO] Maven Wagon Lightweight HTTP Provider ............. FAILURE [6.185s]
[INFO] Maven Wagon HTTP Provider ......................... SUCCESS [2:00.752s]
[INFO] Maven Wagon SCM Provider .......................... SUCCESS [44.703s]
[INFO] Maven Wagon SSH Common Library .................... SUCCESS [1.650s]
[INFO] Maven Wagon SSH Common Tests ...................... SUCCESS [1.101s]
[INFO] Maven Wagon SSH External Provider ................. SUCCESS [1.486s]
[INFO] Maven Wagon SSH Provider .......................... SUCCESS [1.650s]
[INFO] Maven Wagon WebDav Provider ....................... SUCCESS [10.418s]
[INFO] Maven Test Compatibility Kits ..................... SUCCESS [0.041s]
[INFO] Wagon HTTP Test Compatibility Kit ................. SUCCESS [1.388s]
[INFO] ------------------------------------------------------------------------
[INFO] BUILD FAILURE
[INFO] ------------------------------------------------------------------------
[INFO] Total time: 3:58.719s
[INFO] Finished at: Tue Dec 29 10:56:10 CST 2009
[INFO] Final Memory: 44M/94M
[INFO] ------------------------------------------------------------------------
[ERROR] There are test failures.

Please refer to /home/hudson/workspace/wagon/label/ubuntu/trunk/wagon-providers/wagon-http-lightweight/target/surefire-reports
for the individual test results.
-> [Help 1]
org.apache.maven.plugin.MojoFailureException: There are test failures.

Please refer to /home/hudson/workspace/wagon/label/ubuntu/trunk/wagon-providers/wagon-http-lightweight/target/surefire-reports
for the individual test results.
	at org.apache.maven.plugin.surefire.SurefirePlugin.execute(SurefirePlugin.java:575)
	at org.apache.maven.plugin.DefaultBuildPluginManager.executeMojo(DefaultBuildPluginManager.java:105)
	at org.apache.maven.lifecycle.DefaultLifecycleExecutor.execute(DefaultLifecycleExecutor.java:547)
	at org.apache.maven.lifecycle.DefaultLifecycleExecutor.execute(DefaultLifecycleExecutor.java:317)
	at org.apache.maven.DefaultMaven.doExecute(DefaultMaven.java:233)
	at org.apache.maven.DefaultMaven.execute(DefaultMaven.java:102)
	at org.apache.maven.cli.MavenCli.execute(MavenCli.java:421)
	at org.apache.maven.cli.MavenCli.doMain(MavenCli.java:156)
	at org.apache.maven.cli.MavenCli.main(MavenCli.java:121)
	at sun.reflect.NativeMethodAccessorImpl.invoke0(Native Method)
	at sun.reflect.NativeMethodAccessorImpl.invoke(NativeMethodAccessorImpl.java:39)
	at sun.reflect.DelegatingMethodAccessorImpl.invoke(DelegatingMethodAccessorImpl.java:25)
	at java.lang.reflect.Method.invoke(Method.java:597)
	at org.codehaus.plexus.classworlds.launcher.Launcher.launchEnhanced(Launcher.java:290)
	at org.codehaus.plexus.classworlds.launcher.Launcher.launch(Launcher.java:230)
	at org.codehaus.plexus.classworlds.launcher.Launcher.mainWithExitCode(Launcher.java:409)
	at org.codehaus.plexus.classworlds.launcher.Launcher.main(Launcher.java:352)
[ERROR] 
[ERROR] Re-run Maven using the -X switch to enable full debug logging.
[ERROR] 
[ERROR] For more information about the errors and possible solutions, please read the following
articles:
[ERROR] [Help 1] http://cwiki.apache.org/confluence/display/MAVEN/MojoFailureException


Mime
View raw message