maven-notifications mailing list archives

Site index · List index
Message view « Date » · « Thread »
Top « Date » · « Thread »
From Hudson <Hud...@sonatype.org>
Subject Build failed in Hudson: wagon » 1.5,windows #51
Date Tue, 15 Dec 2009 02:50:34 GMT
See <http://grid.sonatype.org/ci/job/wagon/./jdk=1.5,label=windows/51/changes>

Changes:

[Olivier Lamy] ignore ide files

[Olivier Lamy] ignore ide files

------------------------------------------
[...truncated 9274 lines...]
Uploading: ./c/test-resource-4.txt to https://localhost:10007/newfolder/folder2

#https://localhost:10007/newfolder/folder2/./c/test-resource-4.txt - Status code: 201

Transfer finished. 21 bytes copied in 0.0030 seconds
Uploading: ./test-resource-1.txt to https://localhost:10007/newfolder/folder2

#https://localhost:10007/newfolder/folder2/./test-resource-1.txt - Status code: 201

Transfer finished. 19 bytes copied in 0.0030 seconds
https://localhost:10007/newfolder/folder2/test-resource-1.txt - Status code: 200
last-modified = Tue, 15 Dec 2009 02:50:17 GMT (1260845417000)
attempting to create parent directories for destination: test-resource-1.txt
Downloading: test-resource-1.txt from https://localhost:10007/newfolder/folder2

#
Transfer finished. 19 bytes copied in 0.0010 seconds
https://localhost:10007/newfolder/folder2/a/test-resource-2.txt - Status code: 200
last-modified = Tue, 15 Dec 2009 02:50:17 GMT (1260845417000)
attempting to create parent directories for destination: test-resource-2.txt
Downloading: a/test-resource-2.txt from https://localhost:10007/newfolder/folder2

#
Transfer finished. 21 bytes copied in 0.0 seconds
https://localhost:10007/newfolder/folder2/a/b/test-resource-3.txt - Status code: 200
last-modified = Tue, 15 Dec 2009 02:50:17 GMT (1260845417000)
attempting to create parent directories for destination: test-resource-3.txt
Downloading: a/b/test-resource-3.txt from https://localhost:10007/newfolder/folder2

#
Transfer finished. 23 bytes copied in 0.0010 seconds
https://localhost:10007/newfolder/folder2/c/test-resource-4.txt - Status code: 200
last-modified = Tue, 15 Dec 2009 02:50:17 GMT (1260845417000)
attempting to create parent directories for destination: test-resource-4.txt
Downloading: c/test-resource-4.txt from https://localhost:10007/newfolder/folder2

#
Transfer finished. 21 bytes copied in 0.0010 seconds
https://localhost:10007/newfolder/folder2 - Session: Disconnecting  
https://localhost:10007/newfolder/folder2 - Session: Disconnected
Local repository: Repository[file://C:\home\hudson\workspace\wagon\jdk\1.5\label\windows\trunk\wagon-providers\wagon-webdav-jackrabbit\target\test-output\local-repository]
Getting test artifact from test repository Repository[davs://localhost:10007/newfolder/folder2]
https://localhost:10007/newfolder/folder2 - Session: Opened  
https://localhost:10007/newfolder/folder2/fubar.txt - Status code: 404
 Transfer error: org.apache.maven.wagon.ResourceDoesNotExistException: File: https://localhost:10007/newfolder/folder2/fubar.txt
does not exist
https://localhost:10007/newfolder/folder2 - Session: Disconnecting  
https://localhost:10007/newfolder/folder2 - Session: Disconnected
Local repository: Repository[file://C:\home\hudson\workspace\wagon\jdk\1.5\label\windows\trunk\wagon-providers\wagon-webdav-jackrabbit\target\test-output\local-repository]
Getting test artifact from test repository Repository[davs://localhost:10007/newfolder/folder2]
https://localhost:10007/newfolder/folder2 - Session: Opened  
https://localhost:10007/newfolder/folder2/fubar.txt - Status code: 404
 Transfer error: org.apache.maven.wagon.ResourceDoesNotExistException: File: https://localhost:10007/newfolder/folder2/fubar.txt
does not exist
https://localhost:10007/newfolder/folder2 - Session: Disconnecting  
https://localhost:10007/newfolder/folder2 - Session: Disconnected
Local repository: Repository[file://C:\home\hudson\workspace\wagon\jdk\1.5\label\windows\trunk\wagon-providers\wagon-webdav-jackrabbit\target\test-output\local-repository]
https://localhost:10007/newfolder/folder2 - Session: Opened  
https://localhost:10007/newfolder/folder2 - Session: Disconnecting  
https://localhost:10007/newfolder/folder2 - Session: Disconnected
Local repository: Repository[file://C:\home\hudson\workspace\wagon\jdk\1.5\label\windows\trunk\wagon-providers\wagon-webdav-jackrabbit\target\test-output\local-repository]
Putting test artifact: test-resource into test repository Repository[davs://localhost:10007/newfolder/folder2]
https://localhost:10007/newfolder/folder2 - Session: Opened  
Uploading: test-resource to https://localhost:10007/newfolder/folder2

#https://localhost:10007/newfolder/folder2/test-resource - Status code: 201

Transfer finished. 18 bytes copied in 0.0030 seconds
https://localhost:10007/newfolder/folder2 - Session: Disconnecting  
https://localhost:10007/newfolder/folder2 - Session: Disconnected
https://localhost:10007/newfolder/folder2 - Session: Opened  
https://localhost:10007/newfolder/folder2 - Session: Disconnecting  
https://localhost:10007/newfolder/folder2 - Session: Disconnected
Local repository: Repository[file://C:\home\hudson\workspace\wagon\jdk\1.5\label\windows\trunk\wagon-providers\wagon-webdav-jackrabbit\target\test-output\local-repository]
https://localhost:10007/newfolder/folder2 - Session: Opened  
https://localhost:10007/newfolder/folder2 - Session: Disconnecting  
https://localhost:10007/newfolder/folder2 - Session: Disconnected
Tests run: 51, Failures: 0, Errors: 0, Skipped: 0, Time elapsed: 7.407 sec

Results :

Tests in error: 
  testProxiedRequestWithAuthentication(org.apache.maven.wagon.providers.webdav.WebDavWagonTest)

Tests run: 103, Failures: 0, Errors: 1, Skipped: 0

[INFO] ------------------------------------------------------------------------
[INFO] Building Maven Test Compatibility Kits
[INFO]    task-segment: [clean, install]
[INFO] ------------------------------------------------------------------------
[INFO] [clean:clean {execution: default-clean}]
[INFO] [plexus:descriptor {execution: generate}]
[INFO] [remote-resources:process {execution: default}]
[INFO] [site:attach-descriptor {execution: default-attach-descriptor}]
[INFO] [install:install {execution: default-install}]
[INFO] Installing C:\home\hudson\workspace\wagon\jdk\1.5\label\windows\trunk\wagon-tcks\pom.xml
to C:\opt\repos\wagon\org\apache\maven\wagon\wagon-tcks\1.0-beta-7-SNAPSHOT\wagon-tcks-1.0-beta-7-SNAPSHOT.pom
[INFO] ------------------------------------------------------------------------
[INFO] Building Wagon HTTP Test Compatibility Kit
[INFO]    task-segment: [clean, install]
[INFO] ------------------------------------------------------------------------
[INFO] [clean:clean {execution: default-clean}]
[INFO] [plexus:descriptor {execution: generate}]
Downloading: http://repository.sonatype.org:8081/content/groups/sonatype-public-grid/org/apache/maven/wagon/wagon-http-lightweight/1.0-beta-6/wagon-http-lightweight-1.0-beta-6.pom
1K downloaded  (wagon-http-lightweight-1.0-beta-6.pom)
Downloading: http://repository.sonatype.org:8081/content/groups/sonatype-public-grid/org/apache/maven/wagon/wagon-providers/1.0-beta-6/wagon-providers-1.0-beta-6.pom
2K downloaded  (wagon-providers-1.0-beta-6.pom)
Downloading: http://repository.sonatype.org:8081/content/groups/sonatype-public-grid/org/apache/maven/wagon/wagon/1.0-beta-6/wagon-1.0-beta-6.pom
12K downloaded  (wagon-1.0-beta-6.pom)
Downloading: http://repository.sonatype.org:8081/content/groups/sonatype-public-grid/org/apache/maven/wagon/wagon-http-shared/1.0-beta-6/wagon-http-shared-1.0-beta-6.pom
2K downloaded  (wagon-http-shared-1.0-beta-6.pom)
Downloading: http://repository.sonatype.org:8081/content/groups/sonatype-public-grid/junit/junit/4.5/junit-4.5.pom
1K downloaded  (junit-4.5.pom)
Downloading: http://repository.sonatype.org:8081/content/groups/sonatype-public-grid/org/mortbay/jetty/jetty/6.1.21/jetty-6.1.21.pom
6K downloaded  (jetty-6.1.21.pom)
Downloading: http://repository.sonatype.org:8081/content/groups/sonatype-public-grid/org/mortbay/jetty/project/6.1.21/project-6.1.21.pom
8K downloaded  (project-6.1.21.pom)
Downloading: http://repository.sonatype.org:8081/content/groups/sonatype-public-grid/org/mortbay/jetty/jetty-parent/8/jetty-parent-8.pom
2K downloaded  (jetty-parent-8.pom)
Downloading: http://repository.sonatype.org:8081/content/groups/sonatype-public-grid/org/eclipse/jetty/jetty-parent/9/jetty-parent-9.pom
14K downloaded  (jetty-parent-9.pom)
Downloading: http://repository.sonatype.org:8081/content/groups/sonatype-public-grid/org/mortbay/jetty/jetty-util/6.1.21/jetty-util-6.1.21.pom
3K downloaded  (jetty-util-6.1.21.pom)
Downloading: http://repository.sonatype.org:8081/content/groups/sonatype-public-grid/org/mortbay/jetty/servlet-api/2.5-20081211/servlet-api-2.5-20081211.pom
2K downloaded  (servlet-api-2.5-20081211.pom)
Downloading: http://repository.sonatype.org:8081/content/groups/sonatype-public-grid/org/mortbay/jetty/jetty-parent/7/jetty-parent-7.pom
12K downloaded  (jetty-parent-7.pom)
Downloading: http://repository.sonatype.org:8081/content/groups/sonatype-public-grid/org/apache/maven/wagon/wagon-provider-api/1.0-beta-6/wagon-provider-api-1.0-beta-6.pom
1K downloaded  (wagon-provider-api-1.0-beta-6.pom)
Downloading: http://repository.sonatype.org:8081/content/groups/sonatype-public-grid/commons-codec/commons-codec/1.4/commons-codec-1.4.pom
10K downloaded  (commons-codec-1.4.pom)
Downloading: http://repository.sonatype.org:8081/content/groups/sonatype-public-grid/org/mortbay/jetty/jetty/6.1.21/jetty-6.1.21.jar
Downloading: http://repository.sonatype.org:8081/content/groups/sonatype-public-grid/commons-codec/commons-codec/1.4/commons-codec-1.4.jar
Downloading: http://repository.sonatype.org:8081/content/groups/sonatype-public-grid/org/apache/maven/wagon/wagon-http-lightweight/1.0-beta-6/wagon-http-lightweight-1.0-beta-6.jar
Downloading: http://repository.sonatype.org:8081/content/groups/sonatype-public-grid/junit/junit/4.5/junit-4.5.jar
Downloading: http://repository.sonatype.org:8081/content/groups/sonatype-public-grid/org/codehaus/plexus/plexus-container-default/1.0-alpha-9-stable-1/plexus-container-default-1.0-alpha-9-stable-1.jar
194K downloaded  (junit-4.5.jar)
14K downloaded  (wagon-http-lightweight-1.0-beta-6.jar)
56K downloaded  (commons-codec-1.4.jar)
189K downloaded  (plexus-container-default-1.0-alpha-9-stable-1.jar)
521K downloaded  (jetty-6.1.21.jar)
Downloading: http://repository.sonatype.org:8081/content/groups/sonatype-public-grid/org/apache/maven/wagon/wagon-http-shared/1.0-beta-6/wagon-http-shared-1.0-beta-6.jar
Downloading: http://repository.sonatype.org:8081/content/groups/sonatype-public-grid/org/mortbay/jetty/jetty-util/6.1.21/jetty-util-6.1.21.jar
24K downloaded  (wagon-http-shared-1.0-beta-6.jar)
171K downloaded  (jetty-util-6.1.21.jar)
Downloading: http://repository.sonatype.org:8081/content/groups/sonatype-public-grid/org/apache/maven/wagon/wagon-provider-api/1.0-beta-6/wagon-provider-api-1.0-beta-6.jar
51K downloaded  (wagon-provider-api-1.0-beta-6.jar)
Downloading: http://repository.sonatype.org:8081/content/groups/sonatype-public-grid/org/mortbay/jetty/servlet-api/2.5-20081211/servlet-api-2.5-20081211.jar
130K downloaded  (servlet-api-2.5-20081211.jar)
[INFO] [remote-resources:process {execution: default}]
[INFO] [resources:resources {execution: default-resources}]
[INFO] Using 'UTF-8' encoding to copy filtered resources.
[INFO] Copying 4 resources
[INFO] skip non existing resourceDirectory C:\home\hudson\workspace\wagon\jdk\1.5\label\windows\trunk\wagon-tcks\wagon-tck-http\target\generated-resources\plexus
[INFO] Copying 3 resources
[INFO] [compiler:compile {execution: default-compile}]
[INFO] Compiling 15 source files to C:\home\hudson\workspace\wagon\jdk\1.5\label\windows\trunk\wagon-tcks\wagon-tck-http\target\classes
[INFO] [resources:testResources {execution: default-testResources}]
[INFO] Using 'UTF-8' encoding to copy filtered resources.
[INFO] skip non existing resourceDirectory C:\home\hudson\workspace\wagon\jdk\1.5\label\windows\trunk\wagon-tcks\wagon-tck-http\src\test\resources
[INFO] Copying 3 resources
[INFO] [compiler:testCompile {execution: default-testCompile}]
[INFO] No sources to compile
[INFO] [surefire:test {execution: default-test}]
Downloading: http://repository.sonatype.org:8081/content/groups/sonatype-public-grid/org/apache/maven/surefire/surefire-junit4/2.4.3/surefire-junit4-2.4.3.pom
1K downloaded  (surefire-junit4-2.4.3.pom)
Downloading: http://repository.sonatype.org:8081/content/groups/sonatype-public-grid/junit/junit/4.0/junit-4.0.pom
210b downloaded  (junit-4.0.pom)
Downloading: http://repository.sonatype.org:8081/content/groups/sonatype-public-grid/org/apache/maven/surefire/surefire-junit4/2.4.3/surefire-junit4-2.4.3.jar
Downloading: http://repository.sonatype.org:8081/content/groups/sonatype-public-grid/junit/junit/4.0/junit-4.0.jar
11K downloaded  (surefire-junit4-2.4.3.jar)
103K downloaded  (junit-4.0.jar)
[INFO] Surefire report directory: C:\home\hudson\workspace\wagon\jdk\1.5\label\windows\trunk\wagon-tcks\wagon-tck-http\target\surefire-reports

-------------------------------------------------------
 T E S T S
-------------------------------------------------------
There are no tests to run.

Results :

Tests run: 0, Failures: 0, Errors: 0, Skipped: 0

[INFO] [jar:jar {execution: default-jar}]
[INFO] Building jar: C:\home\hudson\workspace\wagon\jdk\1.5\label\windows\trunk\wagon-tcks\wagon-tck-http\target\wagon-tck-http-1.0-beta-7-SNAPSHOT.jar
[INFO] [install:install {execution: default-install}]
[INFO] Installing C:\home\hudson\workspace\wagon\jdk\1.5\label\windows\trunk\wagon-tcks\wagon-tck-http\target\wagon-tck-http-1.0-beta-7-SNAPSHOT.jar
to C:\opt\repos\wagon\org\apache\maven\wagon\wagon-tck-http\1.0-beta-7-SNAPSHOT\wagon-tck-http-1.0-beta-7-SNAPSHOT.jar
[INFO] 
[INFO] 
[INFO] ------------------------------------------------------------------------
[INFO] Reactor Summary:
[INFO] ------------------------------------------------------------------------
[INFO] Maven Wagon ........................................... SUCCESS [46.225s]
[INFO] Maven Wagon API ....................................... SUCCESS [23.436s]
[INFO] Maven Wagon Provider Test ............................. SUCCESS [2.368s]
[INFO] Maven Wagon Providers ................................. SUCCESS [0.077s]
[INFO] Maven Wagon File Provider ............................. SUCCESS [1.902s]
[INFO] Maven Wagon FTP Provider .............................. SUCCESS [1:05.155s]
[INFO] Maven Wagon HTTP Shared Library ....................... SUCCESS [2.611s]
[INFO] Maven Wagon Lightweight HTTP Provider ................. SUCCESS [16.868s]
[INFO] Maven Wagon HTTP Provider ............................. SUCCESS [18.886s]
[INFO] Maven Wagon SCM Provider .............................. SUCCESS [55.692s]
[INFO] Maven Wagon SSH Common Library ........................ SUCCESS [2.110s]
[INFO] Maven Wagon SSH Common Tests .......................... SUCCESS [0.667s]
[INFO] Maven Wagon SSH External Provider ..................... SUCCESS [1.284s]
[INFO] Maven Wagon SSH Provider .............................. SUCCESS [1.966s]
[INFO] Maven Wagon WebDav Provider ........................... FAILED [24.669s]
[INFO] Maven Test Compatibility Kits ......................... SUCCESS [0.033s]
[INFO] Wagon HTTP Test Compatibility Kit ..................... SUCCESS [5.422s]
[INFO] ------------------------------------------------------------------------
[INFO] Error for project: Maven Wagon WebDav Provider (during install)
[INFO] ------------------------------------------------------------------------
[INFO] There are test failures.

Please refer to C:\home\hudson\workspace\wagon\jdk\1.5\label\windows\trunk\wagon-providers\wagon-webdav-jackrabbit\target\surefire-reports
for the individual test results.
[INFO] ------------------------------------------------------------------------
[INFO] Trace
org.apache.maven.BuildFailureException: There are test failures.

Please refer to C:\home\hudson\workspace\wagon\jdk\1.5\label\windows\trunk\wagon-providers\wagon-webdav-jackrabbit\target\surefire-reports
for the individual test results.
	at org.apache.maven.lifecycle.DefaultLifecycleExecutor.executeGoals(DefaultLifecycleExecutor.java:715)
	at org.apache.maven.lifecycle.DefaultLifecycleExecutor.executeGoalWithLifecycle(DefaultLifecycleExecutor.java:556)
	at org.apache.maven.lifecycle.DefaultLifecycleExecutor.executeGoal(DefaultLifecycleExecutor.java:535)
	at org.apache.maven.lifecycle.DefaultLifecycleExecutor.executeGoalAndHandleFailures(DefaultLifecycleExecutor.java:387)
	at org.apache.maven.lifecycle.DefaultLifecycleExecutor.executeTaskSegments(DefaultLifecycleExecutor.java:348)
	at org.apache.maven.lifecycle.DefaultLifecycleExecutor.execute(DefaultLifecycleExecutor.java:180)
	at org.apache.maven.DefaultMaven.doExecute(DefaultMaven.java:328)
	at org.apache.maven.DefaultMaven.execute(DefaultMaven.java:138)
	at org.apache.maven.cli.MavenCli.main(MavenCli.java:362)
	at org.apache.maven.cli.compat.CompatibleMain.main(CompatibleMain.java:60)
	at sun.reflect.NativeMethodAccessorImpl.invoke0(Native Method)
	at sun.reflect.NativeMethodAccessorImpl.invoke(NativeMethodAccessorImpl.java:39)
	at sun.reflect.DelegatingMethodAccessorImpl.invoke(DelegatingMethodAccessorImpl.java:25)
	at java.lang.reflect.Method.invoke(Method.java:597)
	at org.codehaus.classworlds.Launcher.launchEnhanced(Launcher.java:315)
	at org.codehaus.classworlds.Launcher.launch(Launcher.java:255)
	at org.codehaus.classworlds.Launcher.mainWithExitCode(Launcher.java:430)
	at org.codehaus.classworlds.Launcher.main(Launcher.java:375)
Caused by: org.apache.maven.plugin.MojoFailureException: There are test failures.

Please refer to C:\home\hudson\workspace\wagon\jdk\1.5\label\windows\trunk\wagon-providers\wagon-webdav-jackrabbit\target\surefire-reports
for the individual test results.
	at org.apache.maven.plugin.surefire.SurefirePlugin.execute(SurefirePlugin.java:575)
	at org.apache.maven.plugin.DefaultPluginManager.executeMojo(DefaultPluginManager.java:490)
	at org.apache.maven.lifecycle.DefaultLifecycleExecutor.executeGoals(DefaultLifecycleExecutor.java:694)
	... 17 more
[INFO] ------------------------------------------------------------------------
[INFO] BUILD ERRORS
[INFO] ------------------------------------------------------------------------
[INFO] Total time: 4 minutes 30 seconds
[INFO] Finished at: Mon Dec 14 18:50:23 PST 2009
[INFO] Final Memory: 56M/101M
[INFO] ------------------------------------------------------------------------


Mime
View raw message