maven-notifications mailing list archives

Site index · List index
Message view « Date » · « Thread »
Top « Date » · « Thread »
From Hudson <Hud...@sonatype.org>
Subject Build failed in Hudson: maven-3.0.x-ITs » ubuntu #164
Date Sat, 23 Jan 2010 14:40:58 GMT
See <http://grid.sonatype.org/ci/job/maven-3.0.x-ITs/./label=ubuntu/164/>

------------------------------------------
[...truncated 7429 lines...]
	at org.apache.maven.it.Verifier.executeGoals(Verifier.java:1326)
	at org.apache.maven.it.Verifier.executeGoal(Verifier.java:1164)
	at org.apache.maven.it.Verifier.executeGoal(Verifier.java:1158)
	at org.apache.maven.it.MavenITmng3118TestClassPathOrderTest.testit(MavenITmng3118TestClassPathOrderTest.java:54)

testProfilesWithMultipleActivators(org.apache.maven.it.MavenITmng3106ProfileMultipleActivatorsTest)
 Time elapsed: 0.355 sec  <<< ERROR!
org.apache.maven.it.VerificationException: Exit code was non-zero: 1; command line and log
= 
/home/hudson/workspace/maven-3.0.x-ITs/label/ubuntu/core-integration-tests/target/distro/bin/mvn
-Dprofile1.on=true -e --batch-mode -Dmaven.repo.local=/opt/repos/local-repository validate
EMMA: collecting runtime coverage data ...
java.net.BindException: Address already in use
	at java.net.PlainSocketImpl.socketBind(Native Method)
	at java.net.PlainSocketImpl.bind(PlainSocketImpl.java:359)
	at java.net.ServerSocket.bind(ServerSocket.java:319)
	at java.net.ServerSocket.<init>(ServerSocket.java:185)
	at java.net.ServerSocket.<init>(ServerSocket.java:97)
	at com.vladium.emma.rt.RTController.start(RTController.java:99)
	at com.vladium.emma.rt.RT.reset(RT.java:222)
	at com.vladium.emma.rt.RT.<clinit>(RT.java:540)
	at org.apache.maven.cli.MavenCli.$VRi(MavenCli.java)
	at org.apache.maven.cli.MavenCli.<clinit>(MavenCli.java)
	at sun.reflect.NativeMethodAccessorImpl.invoke0(Native Method)
	at sun.reflect.NativeMethodAccessorImpl.invoke(NativeMethodAccessorImpl.java:39)
	at sun.reflect.DelegatingMethodAccessorImpl.invoke(DelegatingMethodAccessorImpl.java:25)
	at java.lang.reflect.Method.invoke(Method.java:597)
	at org.codehaus.plexus.classworlds.launcher.Launcher.launchEnhanced(Launcher.java:290)
	at org.codehaus.plexus.classworlds.launcher.Launcher.launch(Launcher.java:230)
	at org.codehaus.plexus.classworlds.launcher.Launcher.mainWithExitCode(Launcher.java:409)
	at org.codehaus.plexus.classworlds.launcher.Launcher.main(Launcher.java:352)
Exception in thread "main" java.lang.Error: EMMA: runtime controller could not be started,
aborting
	at com.vladium.emma.rt.RT.reset(RT.java:233)
	at com.vladium.emma.rt.RT.<clinit>(RT.java:540)
	at org.apache.maven.cli.MavenCli.$VRi(MavenCli.java)
	at org.apache.maven.cli.MavenCli.<clinit>(MavenCli.java)
	at sun.reflect.NativeMethodAccessorImpl.invoke0(Native Method)
	at sun.reflect.NativeMethodAccessorImpl.invoke(NativeMethodAccessorImpl.java:39)
	at sun.reflect.DelegatingMethodAccessorImpl.invoke(DelegatingMethodAccessorImpl.java:25)
	at java.lang.reflect.Method.invoke(Method.java:597)
	at org.codehaus.plexus.classworlds.launcher.Launcher.launchEnhanced(Launcher.java:290)
	at org.codehaus.plexus.classworlds.launcher.Launcher.launch(Launcher.java:230)
	at org.codehaus.plexus.classworlds.launcher.Launcher.mainWithExitCode(Launcher.java:409)
	at org.codehaus.plexus.classworlds.launcher.Launcher.main(Launcher.java:352)
	at org.apache.maven.it.Verifier.executeGoals(Verifier.java:1326)
	at org.apache.maven.it.Verifier.executeGoal(Verifier.java:1164)
	at org.apache.maven.it.Verifier.executeGoal(Verifier.java:1158)
	at org.apache.maven.it.MavenITmng3106ProfileMultipleActivatorsTest.testProfilesWithMultipleActivators(MavenITmng3106ProfileMultipleActivatorsTest.java:63)


Results :

Failed tests: 
  testitMNG3220b(org.apache.maven.it.MavenITmng3220ImportScopeTest)

Tests in error: 
  testitMNG4034(org.apache.maven.it.MavenITmng4034ManagedProfileDependencyTest)
  testitMNG4026(org.apache.maven.it.MavenITmng4026ReactorDependenciesOrderTest)
  testitMNG4023(org.apache.maven.it.MavenITmng4023ParentProfileOneTimeInjectionTest)
  testitMNG4016(org.apache.maven.it.MavenITmng4016PrefixedPropertyInterpolationTest)
  testitMNG4009(org.apache.maven.it.MavenITmng4009InheritProfileEffectsTest)
  testitMNG4008(org.apache.maven.it.MavenITmng4008MergedFilterOrderTest)
  testitMNG4007(org.apache.maven.it.MavenITmng4007PlatformFileSeparatorTest)
  testitWithoutPluginMngt(org.apache.maven.it.MavenITmng4000MultiPluginExecutionsTest)
  testitWithPluginMngt(org.apache.maven.it.MavenITmng4000MultiPluginExecutionsTest)
  testitMNG3998(org.apache.maven.it.MavenITmng3998PluginExecutionConfigTest)
  testitFromSettings(org.apache.maven.it.MavenITmng3983PluginResolutionFromProfileReposTest)
  testitMNG3979(org.apache.maven.it.MavenITmng3979ElementJoinTest)
  testitFirstMatchWins(org.apache.maven.it.MavenITmng3974MirrorOrderingTest)
  testitFromSettings(org.apache.maven.it.MavenITmng3970DepResolutionFromProfileReposTest)
  testitMNG3955(org.apache.maven.it.MavenITmng3955EffectiveSettingsTest)
  testitRelease(org.apache.maven.it.MavenITmng3953AuthenticatedDeploymentTest)
  testitSnapshot(org.apache.maven.it.MavenITmng3953AuthenticatedDeploymentTest)
  testitMNG3951(org.apache.maven.it.MavenITmng3951AbsolutePathsTest)
  testitMNG3947(org.apache.maven.it.MavenITmng3947PluginDefaultExecutionConfigTest)
  testitMNG3944(org.apache.maven.it.MavenITmng3944BasedirInterpolationTest)
  testitMNG3943(org.apache.maven.it.MavenITmng3943PluginExecutionInheritanceTest)
  testit(org.apache.maven.it.MavenITmng3941ExecutionProjectRestrictedToForkingMojoTest)
  testitMNG3940(org.apache.maven.it.MavenITmng3940EnvVarInterpolationTest)
  testitWithoutPluginMngt(org.apache.maven.it.MavenITmng3938MergePluginExecutionsTest)
  testitWithPluginMngt(org.apache.maven.it.MavenITmng3938MergePluginExecutionsTest)
  testitWithoutPluginMngt(org.apache.maven.it.MavenITmng3937MergedPluginExecutionGoalsTest)
  testitWithPluginMngt(org.apache.maven.it.MavenITmng3937MergedPluginExecutionGoalsTest)
  testitMNG3927(org.apache.maven.it.MavenITmng3927PluginDefaultExecutionConfigTest)
  testitWithoutPluginMngt(org.apache.maven.it.MavenITmng3925MergedPluginExecutionOrderTest)
  testitWithPluginMngt(org.apache.maven.it.MavenITmng3925MergedPluginExecutionOrderTest)
  testitMNG3924(org.apache.maven.it.MavenITmng3924XmlMarkupInterpolationTest)
  testitMNG3920(org.apache.maven.it.MavenITmng3920PlexusComponentApiTest)
  testitMNG3916(org.apache.maven.it.MavenITmng3916PluginExecutionInheritanceTest)
  testitMNG3906(org.apache.maven.it.MavenITmng3906MergedPluginClassPathOrderingTest)
  testitMNG3904(org.apache.maven.it.MavenITmng3904NestedBuildDirInterpolationTest)
  testitMNG3900(org.apache.maven.it.MavenITmng3900ProfilePropertiesInterpolationTest)
  testitMNG3899(org.apache.maven.it.MavenITmng3899ExtensionInheritanceTest)
  testitMNG3892(org.apache.maven.it.MavenITmng3892ReleaseDeploymentTest)
  testitWithoutPluginMngt(org.apache.maven.it.MavenITmng3887PluginExecutionOrderTest)
  testitWithPluginMngt(org.apache.maven.it.MavenITmng3887PluginExecutionOrderTest)
  testitWithoutPluginMngt(org.apache.maven.it.MavenITmng3886ExecutionGoalsOrderTest)
  testitWithPluginMngt(org.apache.maven.it.MavenITmng3886ExecutionGoalsOrderTest)
  testitMNG3877(org.apache.maven.it.MavenITmng3877BasedirAlignedModelTest)
  testitWithoutPluginMngt(org.apache.maven.it.MavenITmng3873MultipleExecutionGoalsTest)
  testitWithPluginMngt(org.apache.maven.it.MavenITmng3873MultipleExecutionGoalsTest)
  testit(org.apache.maven.it.MavenITmng3872ProfileActivationInRelocatedPomTest)
  testitMNG3866(org.apache.maven.it.MavenITmng3866PluginConfigInheritanceTest)
  testitMNG3864(org.apache.maven.it.MavenITmng3864PerExecPluginConfigTest)
  testitMNG3853(org.apache.maven.it.MavenITmng3853ProfileInjectedDistReposTest)
  testitMNG3852(org.apache.maven.it.MavenITmng3852PluginConfigWithHeterogeneousListTest)
  testitOneParent(org.apache.maven.it.MavenITmng3846PomInheritanceUrlAdjustmentTest)
  testitTwoParents(org.apache.maven.it.MavenITmng3846PomInheritanceUrlAdjustmentTest)
  testitMNG3845(org.apache.maven.it.MavenITmng3845LimitedPomInheritanceTest)
  testitMNG3843(org.apache.maven.it.MavenITmng3843PomInheritanceTest)
  testitMNG3839(org.apache.maven.it.MavenITmng3839PomParsingCoalesceTextTest)
  testitMNG3838(org.apache.maven.it.MavenITmng3838EqualPluginDepsTest)
  testitMNG3836(org.apache.maven.it.MavenITmng3836PluginConfigInheritanceTest)
  testitMNG3833(org.apache.maven.it.MavenITmng3833PomInterpolationDataFlowChainTest)
  testitMNG3831(org.apache.maven.it.MavenITmng3831PomInterpolationTest)
  testitMNG3827(org.apache.maven.it.MavenITmng3827PluginConfigTest)
  testitMNG3822(org.apache.maven.it.MavenITmng3822BasedirAlignedInterpolationTest)
  testitMNG3821(org.apache.maven.it.MavenITmng3821EqualPluginExecIdsTest)
  testitMNG3819(org.apache.maven.it.MavenITmng3819PluginDepPlexusUtilsTest)
  testitMNG3814(org.apache.maven.it.MavenITmng3814BogusProjectCycleTest)
  testitMNG3813(org.apache.maven.it.MavenITmng3813PluginClassPathOrderingTest)
  testitMNG3811(org.apache.maven.it.MavenITmng3811ReportingPluginConfigurationInheritanceTest)
  testitMNG3810Property(org.apache.maven.it.MavenITmng3810BadProfileActivationTest)
  testitMNG3808(org.apache.maven.it.MavenITmng3808ReportInheritenceOrderingTest)
  testit(org.apache.maven.it.MavenITmng3807PluginConfigExpressionEvaluationTest)
  testitMNG3805(org.apache.maven.it.MavenITmng3805ExtensionClassPathOrderingTest)
  testitMNG3796(org.apache.maven.it.MavenITmng3796ClassImportInconsistencyTest)
  testitMNG3769(org.apache.maven.it.MavenITmng3769ExclusionRelocatedTransdepsTest)
  testitMNG3760(org.apache.maven.it.MavenITmng3760BaseUriPropertyTest)
  testitMNG3760SystemPropertyOverride(org.apache.maven.it.MavenITmng3760BaseUriPropertyTest)
  testit(org.apache.maven.it.MavenITmng3748BadSettingsXmlTest)
  testitMNG3747(org.apache.maven.it.MavenITmng3747PrefixedPathExpressionTest)
  testitMNG3746_UsingDefaultSystemProperty(org.apache.maven.it.MavenITmng3746POMPropertyOverrideTest)
  testitMNG3746_UsingCLIProperty(org.apache.maven.it.MavenITmng3746POMPropertyOverrideTest)
  testitMNG3743(org.apache.maven.it.MavenITmng3743ForkWithPluginManagementTest)
  testitMNG3740(org.apache.maven.it.MavenITmng3740SelfReferentialReactorProjectsTest)
  testitMNG3732(org.apache.maven.it.MavenITmng3732ActiveProfilesTest)
  testitMNG3729(org.apache.maven.it.MavenITmng3729MultiForkAggregatorsTest)
  testitMNG3724(org.apache.maven.it.MavenITmng3724ExecutionProjectSyncTest)
  testitMNG3723(org.apache.maven.it.MavenITmng3723ConcreteParentProjectTest)
  testitMNG3719(org.apache.maven.it.MavenITmng3719PomExecutionOrderingTest)
  testitMNG3716(org.apache.maven.it.MavenITmng3716AggregatorForkingTest)
  testitMNG3714(org.apache.maven.it.MavenITmng3714ToolchainsCliOptionTest)
  testitMNG3710_POMInheritance(org.apache.maven.it.MavenITmng3710PollutedClonedPluginsTest)
  testitMNG3710_OriginalModel(org.apache.maven.it.MavenITmng3710PollutedClonedPluginsTest)
  testForkFromMojo(org.apache.maven.it.MavenITmng3703ExecutionProjectWithRelativePathsTest)
  testForkFromReport(org.apache.maven.it.MavenITmng3703ExecutionProjectWithRelativePathsTest)
  testitMNG3701(org.apache.maven.it.MavenITmng3701ImplicitProfileIdTest)
  testitMNG3694(org.apache.maven.it.MavenITmng3694ReactorProjectsDynamismTest)
  testitMNG3693(org.apache.maven.it.MavenITmng3693PomFileBasedirChangeTest)
  testitMNG3684(org.apache.maven.it.MavenITmng3684BuildPluginParameterTest)
  testitMNG3680(org.apache.maven.it.MavenITmng3680InvalidDependencyPOMTest)
  testitMNG3679(org.apache.maven.it.MavenITmng3679PluginExecIdInterpolationTest)
  testitMNG3671(org.apache.maven.it.MavenITmng3671PluginLevelDepInterpolationTest)
  testitMNG3667(org.apache.maven.it.MavenITmng3667ResolveDepsWithBadPomVersionTest)
  testitMNG3642(org.apache.maven.it.MavenITmng3642DynamicResourcesTest)
  testitMNG3641(org.apache.maven.it.MavenITmng3641ProfileActivationWarningTest)
  testitMNG3621(org.apache.maven.it.MavenITmng3621UNCInheritedPathsTest)
  testit(org.apache.maven.it.MavenITmng3607ClassLoadersUseValidUrlsTest)
  testmng3599useHttpProxyForHttp(org.apache.maven.it.MavenITmng3599useHttpProxyForWebDAVTest)
  testitFromPlugin(org.apache.maven.it.MavenITmng3586SystemScopePluginDependencyTest)
  testitFromProject(org.apache.maven.it.MavenITmng3586SystemScopePluginDependencyTest)
  testit(org.apache.maven.it.MavenITmng3581PluginUsesWagonDependencyTest)
  testBasicBuildWithDefaultProfiles(org.apache.maven.it.MavenITmng3545ProfileDeactivationTest)
  testDeactivateDefaultProfilesDash(org.apache.maven.it.MavenITmng3545ProfileDeactivationTest)
  testDeactivateDefaultProfilesExclamation(org.apache.maven.it.MavenITmng3545ProfileDeactivationTest)
  testDeactivateActivatedByProp(org.apache.maven.it.MavenITmng3545ProfileDeactivationTest)
  testActivateThenDeactivate(org.apache.maven.it.MavenITmng3545ProfileDeactivationTest)
  testDefaultProfileAutoDeactivation(org.apache.maven.it.MavenITmng3545ProfileDeactivationTest)
  testitMNG3536(org.apache.maven.it.MavenITmng3536AppendedAbsolutePathsTest)
  testitMNG3535_ShouldSucceed(org.apache.maven.it.MavenITmng3535SelfReferentialPropertiesTest)
  testProjectPackagingUsage(org.apache.maven.it.MavenITmng3506ArtifactHandlersFromPluginsTest)
  testitMNG3503NoLinkageErrors(org.apache.maven.it.MavenITmng3503Xpp3ShadingTest)
  testitMNG3503Xpp3Shading(org.apache.maven.it.MavenITmng3503Xpp3ShadingTest)
  testitMNG3498(org.apache.maven.it.MavenITmng3498ForkToOtherMojoTest)
  testitMNG3482(org.apache.maven.it.MavenITmng3482DependencyPomInterpolationTest)
  testitMNG3475(org.apache.maven.it.MavenITmng3475BaseAlignedDirTest)
  testitExactMatchDominatesWildcard(org.apache.maven.it.MavenITmng3461MirrorMatchingTest)
  testitExternalWildcard(org.apache.maven.it.MavenITmng3461MirrorMatchingTest)
  testitNonGreedyWildcard(org.apache.maven.it.MavenITmng3461MirrorMatchingTest)
  testitMNG3441(org.apache.maven.it.MavenITmng3441MetadataUpdatedFromDeploymentRepositoryTest)
  testitMNG3422(org.apache.maven.it.MavenITmng3422ActiveComponentCollectionTest)
  testitTransferFailed(org.apache.maven.it.MavenITmng3415JunkRepositoryMetadataTest)
  testShouldNotRepeatedlyUpdateOnResourceNotFoundException(org.apache.maven.it.MavenITmng3415JunkRepositoryMetadataTest)
  testitWithoutPluginManagement(org.apache.maven.it.MavenITmng3401CLIDefaultExecIdTest)
  testitWithPluginManagement(org.apache.maven.it.MavenITmng3401CLIDefaultExecIdTest)
  testitMNG3396(org.apache.maven.it.MavenITmng3396DependencyManagementForOverConstrainedRangesTest)
  testitMNG3394a(org.apache.maven.it.MavenITmng3394POMPluginVersionDominanceTest)
  testitMNG3394b(org.apache.maven.it.MavenITmng3394POMPluginVersionDominanceTest)
  testitMNG3380(org.apache.maven.it.MavenITmng3380ManagedRelocatedTransdepsTest)
  testitMNG3379(org.apache.maven.it.MavenITmng3379ParallelArtifactDownloadsTest)
  testitMNG3372(org.apache.maven.it.MavenITmng3372DirectInvocationOfPluginsTest)
  testDependencyTreeInvocation(org.apache.maven.it.MavenITmng3372DirectInvocationOfPluginsTest)
  testitMNG3355(org.apache.maven.it.MavenITmng3355TranslatedPathInterpolationTest)
  testitMNG3331a(org.apache.maven.it.MavenITmng3331ModulePathNormalizationTest)
  testitMNG3331b(org.apache.maven.it.MavenITmng3331ModulePathNormalizationTest)
  testitMNG3314(org.apache.maven.it.MavenITmng3314OfflineSnapshotsTest)
  testitMNG3284(org.apache.maven.it.MavenITmng3284UsingCachedPluginsTest)
  testMultipleProfileParams(org.apache.maven.it.MavenITmng3268MultipleDashPCommandLineTest)
  testitMNG3259(org.apache.maven.it.MavenITmng3259DepsDroppedInMultiModuleBuildTest)
  testitMNG3220a(org.apache.maven.it.MavenITmng3220ImportScopeTest)
  testitMNG3217(org.apache.maven.it.MavenITmng3217InterPluginDependencyTest)
  testitMNG3203(org.apache.maven.it.MavenITmng3203DefaultLifecycleExecIdTest)
  testit(org.apache.maven.it.MavenITmng3183LoggingToFileTest)
  testitMNG3139(org.apache.maven.it.MavenITmng3139UseCachedMetadataOfBlacklistedRepoTest)
  testit(org.apache.maven.it.MavenITmng3118TestClassPathOrderTest)
  testProfilesWithMultipleActivators(org.apache.maven.it.MavenITmng3106ProfileMultipleActivatorsTest)

Tests run: 543, Failures: 1, Errors: 151, Skipped: 0

[INFO] ------------------------------------------------------------------------
[INFO] BUILD FAILURE
[INFO] ------------------------------------------------------------------------
[INFO] Total time: 27:24.995s
[INFO] Finished at: Sat Jan 23 08:40:57 CST 2010
[INFO] Final Memory: 6M/62M
[INFO] ------------------------------------------------------------------------
[ERROR] Failed to execute goal org.apache.maven.plugins:maven-surefire-plugin:2.4.3:test (default-test)
on project core-it-suite: There are test failures.

Please refer to /home/hudson/workspace/maven-3.0.x-ITs/label/ubuntu/core-integration-tests/target/surefire-reports
for the individual test results.
-> [Help 1]
org.apache.maven.lifecycle.LifecycleExecutionException: Failed to execute goal org.apache.maven.plugins:maven-surefire-plugin:2.4.3:test
(default-test) on project core-it-suite: There are test failures.

Please refer to /home/hudson/workspace/maven-3.0.x-ITs/label/ubuntu/core-integration-tests/target/surefire-reports
for the individual test results.
	at org.apache.maven.lifecycle.DefaultLifecycleExecutor.execute(DefaultLifecycleExecutor.java:566)
	at org.apache.maven.lifecycle.DefaultLifecycleExecutor.execute(DefaultLifecycleExecutor.java:317)
	at org.apache.maven.DefaultMaven.doExecute(DefaultMaven.java:247)
	at org.apache.maven.DefaultMaven.execute(DefaultMaven.java:104)
	at org.apache.maven.cli.MavenCli.execute(MavenCli.java:427)
	at org.apache.maven.cli.MavenCli.doMain(MavenCli.java:157)
	at org.apache.maven.cli.MavenCli.main(MavenCli.java:121)
	at sun.reflect.NativeMethodAccessorImpl.invoke0(Native Method)
	at sun.reflect.NativeMethodAccessorImpl.invoke(NativeMethodAccessorImpl.java:39)
	at sun.reflect.DelegatingMethodAccessorImpl.invoke(DelegatingMethodAccessorImpl.java:25)
	at java.lang.reflect.Method.invoke(Method.java:597)
	at org.codehaus.plexus.classworlds.launcher.Launcher.launchEnhanced(Launcher.java:290)
	at org.codehaus.plexus.classworlds.launcher.Launcher.launch(Launcher.java:230)
	at org.codehaus.plexus.classworlds.launcher.Launcher.mainWithExitCode(Launcher.java:409)
	at org.codehaus.plexus.classworlds.launcher.Launcher.main(Launcher.java:352)
Caused by: org.apache.maven.plugin.MojoFailureException: There are test failures.

Please refer to /home/hudson/workspace/maven-3.0.x-ITs/label/ubuntu/core-integration-tests/target/surefire-reports
for the individual test results.
	at org.apache.maven.plugin.surefire.SurefirePlugin.execute(SurefirePlugin.java:575)
	at org.apache.maven.plugin.DefaultBuildPluginManager.executeMojo(DefaultBuildPluginManager.java:105)
	at org.apache.maven.lifecycle.DefaultLifecycleExecutor.execute(DefaultLifecycleExecutor.java:562)
	... 14 more
[ERROR] 
[ERROR] Re-run Maven using the -X switch to enable full debug logging.
[ERROR] 
[ERROR] For more information about the errors and possible solutions, please read the following
articles:
[ERROR] [Help 1] http://cwiki.apache.org/confluence/display/MAVEN/MojoFailureException
Recording Emma reports core-integration-tests/target/site/emma/coverage.xml


Mime
View raw message