maven-notifications mailing list archives

Site index · List index
Message view « Date » · « Thread »
Top « Date » · « Thread »
From Hudson <Hud...@sonatype.org>
Subject Build failed in Hudson: maven-3.0.x-bootstrap » ubuntu #914
Date Sun, 17 Jan 2010 18:26:04 GMT
See <http://grid.sonatype.org/ci/job/maven-3.0.x-bootstrap/./label=ubuntu/914/changes>

Changes:

[Hervé Boutemy] [MNG-2281] 1.0-beta-3 should be < 1.0-SNAPSHOT

[Hervé Boutemy] moved some unit-tests to follow tested classes move done in r828793

[Hervé Boutemy] [MNG-4534] prepared POM XML elements order configuration, that will be effective
when upgrading to Modello 1.2

------------------------------------------
[...truncated 896 lines...]
     [java] Running org.apache.maven.model.RepositoryTest
     [java] Tests run: 4, Failures: 0, Errors: 0, Skipped: 0, Time elapsed: 0.005 sec
     [java] Running org.apache.maven.model.ActivationPropertyTest
     [java] Tests run: 4, Failures: 0, Errors: 0, Skipped: 0, Time elapsed: 0.004 sec
     [java] Running org.apache.maven.model.RepositoryPolicyTest
     [java] Tests run: 4, Failures: 0, Errors: 0, Skipped: 0, Time elapsed: 0.027 sec
     [java] Running org.apache.maven.model.PluginManagementTest
     [java] Tests run: 4, Failures: 0, Errors: 0, Skipped: 0, Time elapsed: 0.003 sec
     [java] Running org.apache.maven.model.MailingListTest
     [java] Tests run: 4, Failures: 0, Errors: 0, Skipped: 0, Time elapsed: 0.003 sec
     [java] 
     [java] Results :
     [java] 
     [java] Tests run: 148, Failures: 0, Errors: 0, Skipped: 0
     [java] 
     [java] [INFO] 
     [java] [INFO] --- maven-jar-plugin:2.2:jar (default-jar) @ maven-model ---
     [java] Downloading: http://repository.sonatype.org:8081/content/groups/sonatype-public-grid/org/apache/maven/plugins/maven-jar-plugin/2.2/maven-jar-plugin-2.2.pom
     [java] 9 KB downloaded at 98.3 KB/sec
     [java] Downloading: http://repository.sonatype.org:8081/content/groups/sonatype-public-grid/org/apache/maven/plugins/maven-plugins/10/maven-plugins-10.pom
     [java] 8 KB downloaded at 93.3 KB/sec
     [java] Downloading: http://repository.sonatype.org:8081/content/groups/sonatype-public-grid/org/apache/maven/maven-archiver/2.3/maven-archiver-2.3.pom
     [java] 4 KB downloaded at 38.0 KB/sec
     [java] Downloading: http://repository.sonatype.org:8081/content/groups/sonatype-public-grid/org/apache/maven/maven-model/2.0/maven-model-2.0.pom
     [java] 3 KB downloaded at 27.7 KB/sec
     [java] Downloading: http://repository.sonatype.org:8081/content/groups/sonatype-public-grid/org/codehaus/plexus/plexus-archiver/1.0-alpha-9/plexus-archiver-1.0-alpha-9.pom
     [java] 2 KB downloaded at 14.8 KB/sec
     [java] Downloading: http://repository.sonatype.org:8081/content/groups/sonatype-public-grid/org/codehaus/plexus/plexus-components/1.1.9/plexus-components-1.1.9.pom
     [java] 3 KB downloaded at 27.9 KB/sec
     [java] Downloading: http://repository.sonatype.org:8081/content/groups/sonatype-public-grid/org/codehaus/plexus/plexus-container-default/1.0-alpha-15/plexus-container-default-1.0-alpha-15.pom
     [java] 2 KB downloaded at 19.2 KB/sec
     [java] Downloading: http://repository.sonatype.org:8081/content/groups/sonatype-public-grid/org/codehaus/plexus/plexus-containers/1.0-alpha-15/plexus-containers-1.0-alpha-15.pom
     [java] 2 KB downloaded at 16.5 KB/sec
     [java] Downloading: http://repository.sonatype.org:8081/content/groups/sonatype-public-grid/org/codehaus/plexus/plexus-component-api/1.0-alpha-15/plexus-component-api-1.0-alpha-15.pom
     [java] 948 B downloaded at 5.1 KB/sec
     [java] Downloading: http://repository.sonatype.org:8081/content/groups/sonatype-public-grid/org/codehaus/plexus/plexus-classworlds/1.2-alpha-6/plexus-classworlds-1.2-alpha-6.pom
     [java] 3 KB downloaded at 23.4 KB/sec
     [java] Downloading: http://repository.sonatype.org:8081/content/groups/sonatype-public-grid/org/codehaus/plexus/plexus-io/1.0-alpha-1/plexus-io-1.0-alpha-1.pom
     [java] 2 KB downloaded at 6.3 KB/sec
     [java] Downloading: http://repository.sonatype.org:8081/content/groups/sonatype-public-grid/org/codehaus/plexus/plexus-component-api/1.0-alpha-16/plexus-component-api-1.0-alpha-16.pom
     [java] 3 KB downloaded at 15.8 KB/sec
     [java] Downloading: http://repository.sonatype.org:8081/content/groups/sonatype-public-grid/org/codehaus/plexus/plexus-containers/1.0-alpha-16/plexus-containers-1.0-alpha-16.pom
     [java] 2 KB downloaded at 13.3 KB/sec
     [java] Downloading: http://repository.sonatype.org:8081/content/groups/sonatype-public-grid/org/codehaus/plexus/plexus-utils/1.4.9/plexus-utils-1.4.9.pom
     [java] 3 KB downloaded at 4.3 KB/sec
     [java] Downloading: http://repository.sonatype.org:8081/content/groups/sonatype-public-grid/commons-lang/commons-lang/2.1/commons-lang-2.1.pom
     [java] 10 KB downloaded at 38.0 KB/sec
     [java] Downloading: http://repository.sonatype.org:8081/content/groups/sonatype-public-grid/org/codehaus/plexus/plexus-utils/1.4.9/plexus-utils-1.4.9.jar
     [java] 200 KB downloaded at 230.6 KB/sec
     [java] Downloading: http://repository.sonatype.org:8081/content/groups/sonatype-public-grid/org/apache/maven/maven-archiver/2.3/maven-archiver-2.3.jar
     [java] 18 KB downloaded at 72.2 KB/sec
     [java] Downloading: http://repository.sonatype.org:8081/content/groups/sonatype-public-grid/org/codehaus/plexus/plexus-archiver/1.0-alpha-9/plexus-archiver-1.0-alpha-9.jar
     [java] 154 KB downloaded at 270.1 KB/sec
     [java] Downloading: http://repository.sonatype.org:8081/content/groups/sonatype-public-grid/org/codehaus/plexus/plexus-io/1.0-alpha-1/plexus-io-1.0-alpha-1.jar
     [java] 12 KB downloaded at 76.6 KB/sec
     [java] Downloading: http://repository.sonatype.org:8081/content/groups/sonatype-public-grid/commons-lang/commons-lang/2.1/commons-lang-2.1.jar
     [java] 203 KB downloaded at 220.5 KB/sec
     [java] [INFO] Building jar: /home/hudson/workspace/maven-3.0.x-bootstrap/label/ubuntu/trunk/maven-model/target/maven-model-3.0-SNAPSHOT.jar
     [java] [INFO] 
     [java] [INFO] --- maven-install-plugin:2.2:install (default-install) @ maven-model ---
     [java] [INFO] Installing /home/hudson/workspace/maven-3.0.x-bootstrap/label/ubuntu/trunk/maven-model/target/maven-model-3.0-SNAPSHOT.jar
to /home/hudson/.m2/repository/org/apache/maven/maven-model/3.0-SNAPSHOT/maven-model-3.0-SNAPSHOT.jar
     [java] [INFO]                                                                       
 
     [java] [INFO] ------------------------------------------------------------------------
     [java] [INFO] Building Maven Settings 3.0-SNAPSHOT
     [java] [INFO] ------------------------------------------------------------------------
     [java] [INFO] 
     [java] [INFO] --- maven-clean-plugin:2.3:clean (default-clean) @ maven-settings ---
     [java] [INFO] Deleting file set: /home/hudson/workspace/maven-3.0.x-bootstrap/label/ubuntu/trunk/maven-settings/target
(included: [**], excluded: [])
     [java] [INFO] 
     [java] [INFO] --- modello-maven-plugin:1.1:java (standard) @ maven-settings ---
     [java] [INFO] outputDirectory: /home/hudson/workspace/maven-3.0.x-bootstrap/label/ubuntu/trunk/maven-settings/target/generated-sources/modello
     [java] [INFO] Working on model: src/main/mdo/settings.mdo
     [java] [INFO] Generating current version: 1.1.0
     [java] [INFO] 
     [java] [INFO] --- modello-maven-plugin:1.1:xpp3-reader (standard) @ maven-settings ---
     [java] [INFO] outputDirectory: /home/hudson/workspace/maven-3.0.x-bootstrap/label/ubuntu/trunk/maven-settings/target/generated-sources/modello
     [java] [INFO] Working on model: src/main/mdo/settings.mdo
     [java] [INFO] Generating current version: 1.1.0
     [java] [INFO] 
     [java] [INFO] --- modello-maven-plugin:1.1:xpp3-writer (standard) @ maven-settings ---
     [java] [INFO] outputDirectory: /home/hudson/workspace/maven-3.0.x-bootstrap/label/ubuntu/trunk/maven-settings/target/generated-sources/modello
     [java] [INFO] Working on model: src/main/mdo/settings.mdo
     [java] [INFO] Generating current version: 1.1.0
     [java] [INFO] 
     [java] [INFO] --- maven-remote-resources-plugin:1.1:process (default) @ maven-settings
---
     [java] [INFO] 
     [java] [INFO] --- maven-resources-plugin:2.4:resources (default-resources) @ maven-settings
---
     [java] [INFO] Using 'UTF-8' encoding to copy filtered resources.
     [java] [INFO] skip non existing resourceDirectory /home/hudson/workspace/maven-3.0.x-bootstrap/label/ubuntu/trunk/maven-settings/src/main/resources
     [java] [INFO] Copying 3 resources
     [java] [INFO] 
     [java] [INFO] --- maven-compiler-plugin:2.0.2:compile (default-compile) @ maven-settings
---
     [java] [INFO] Compiling 17 source files to /home/hudson/workspace/maven-3.0.x-bootstrap/label/ubuntu/trunk/maven-settings/target/classes
     [java] [INFO] 
     [java] [INFO] --- maven-resources-plugin:2.4:testResources (default-testResources) @
maven-settings ---
     [java] [INFO] Using 'UTF-8' encoding to copy filtered resources.
     [java] [INFO] skip non existing resourceDirectory /home/hudson/workspace/maven-3.0.x-bootstrap/label/ubuntu/trunk/maven-settings/src/test/resources
     [java] [INFO] Copying 3 resources
     [java] [INFO] 
     [java] [INFO] --- maven-compiler-plugin:2.0.2:testCompile (default-testCompile) @ maven-settings
---
     [java] [INFO] No sources to compile
     [java] [INFO] 
     [java] [INFO] --- maven-surefire-plugin:2.4.3:test (default-test) @ maven-settings ---
     [java] [INFO] Surefire report directory: /home/hudson/workspace/maven-3.0.x-bootstrap/label/ubuntu/trunk/maven-settings/target/surefire-reports
     [java] 
     [java] -------------------------------------------------------
     [java]  T E S T S
     [java] -------------------------------------------------------
     [java] There are no tests to run.
     [java] 
     [java] Results :
     [java] 
     [java] Tests run: 0, Failures: 0, Errors: 0, Skipped: 0
     [java] 
     [java] [INFO] 
     [java] [INFO] --- maven-jar-plugin:2.2:jar (default-jar) @ maven-settings ---
     [java] [INFO] Building jar: /home/hudson/workspace/maven-3.0.x-bootstrap/label/ubuntu/trunk/maven-settings/target/maven-settings-3.0-SNAPSHOT.jar
     [java] [INFO] 
     [java] [INFO] --- maven-install-plugin:2.2:install (default-install) @ maven-settings
---
     [java] [INFO] Installing /home/hudson/workspace/maven-3.0.x-bootstrap/label/ubuntu/trunk/maven-settings/target/maven-settings-3.0-SNAPSHOT.jar
to /home/hudson/.m2/repository/org/apache/maven/maven-settings/3.0-SNAPSHOT/maven-settings-3.0-SNAPSHOT.jar
     [java] [INFO]                                                                       
 
     [java] [INFO] ------------------------------------------------------------------------
     [java] [INFO] Building Maven Artifact 3.0-SNAPSHOT
     [java] [INFO] ------------------------------------------------------------------------
     [java] [INFO] 
     [java] [INFO] --- maven-clean-plugin:2.3:clean (default-clean) @ maven-artifact ---
     [java] [INFO] Deleting file set: /home/hudson/workspace/maven-3.0.x-bootstrap/label/ubuntu/trunk/maven-artifact/target
(included: [**], excluded: [])
     [java] [INFO] 
     [java] [INFO] --- maven-remote-resources-plugin:1.1:process (default) @ maven-artifact
---
     [java] [INFO] 
     [java] [INFO] --- maven-resources-plugin:2.4:resources (default-resources) @ maven-artifact
---
     [java] [INFO] Using 'UTF-8' encoding to copy filtered resources.
     [java] [INFO] Copying 0 resource
     [java] [INFO] Copying 3 resources
     [java] [INFO] 
     [java] [INFO] --- maven-compiler-plugin:2.0.2:compile (default-compile) @ maven-artifact
---
     [java] [INFO] Compiling 27 source files to /home/hudson/workspace/maven-3.0.x-bootstrap/label/ubuntu/trunk/maven-artifact/target/classes
     [java] [INFO] 
     [java] [INFO] --- plexus-component-metadata:1.5.2:generate-metadata (default) @ maven-artifact
---
     [java] [INFO] 
     [java] [INFO] --- maven-resources-plugin:2.4:testResources (default-testResources) @
maven-artifact ---
     [java] [INFO] Using 'UTF-8' encoding to copy filtered resources.
     [java] [INFO] Copying 0 resource
     [java] [INFO] Copying 3 resources
     [java] [INFO] 
     [java] [INFO] --- maven-compiler-plugin:2.0.2:testCompile (default-testCompile) @ maven-artifact
---
     [java] [INFO] Compiling 3 source files to /home/hudson/workspace/maven-3.0.x-bootstrap/label/ubuntu/trunk/maven-artifact/target/test-classes
     [java] [INFO] 
     [java] [INFO] --- plexus-component-metadata:1.5.2:generate-test-metadata (default) @
maven-artifact ---
     [java] [INFO] 
     [java] [INFO] --- maven-surefire-plugin:2.4.3:test (default-test) @ maven-artifact ---
     [java] [INFO] Surefire report directory: /home/hudson/workspace/maven-3.0.x-bootstrap/label/ubuntu/trunk/maven-artifact/target/surefire-reports
     [java] 
     [java] -------------------------------------------------------
     [java]  T E S T S
     [java] -------------------------------------------------------
     [java] Running org.apache.maven.artifact.versioning.VersionRangeTest
     [java] Tests run: 5, Failures: 0, Errors: 0, Skipped: 0, Time elapsed: 0.147 sec
     [java] Running org.apache.maven.artifact.versioning.ComparableVersionTest
     [java] Tests run: 6, Failures: 0, Errors: 0, Skipped: 0, Time elapsed: 0.048 sec
     [java] Running org.apache.maven.artifact.versioning.DefaultArtifactVersionTest
     [java] Tests run: 7, Failures: 3, Errors: 0, Skipped: 0, Time elapsed: 0.042 sec <<<
FAILURE!
     [java] testVersionComparing(org.apache.maven.artifact.versioning.DefaultArtifactVersionTest)
 Time elapsed: 0.006 sec  <<< FAILURE!
     [java] junit.framework.AssertionFailedError: 1.0-SNAPSHOT should be older than 1.0-beta-1
     [java] 	at junit.framework.Assert.fail(Assert.java:47)
     [java] 	at junit.framework.Assert.assertTrue(Assert.java:20)
     [java] 	at org.apache.maven.artifact.versioning.DefaultArtifactVersionTest.assertVersionOlder(DefaultArtifactVersionTest.java:192)
     [java] 	at org.apache.maven.artifact.versioning.DefaultArtifactVersionTest.testVersionComparing(DefaultArtifactVersionTest.java:106)
     [java] 
     [java] testVersionSnapshotComparing(org.apache.maven.artifact.versioning.DefaultArtifactVersionTest)
 Time elapsed: 0.004 sec  <<< FAILURE!
     [java] junit.framework.AssertionFailedError: 1.0-SNAPSHOT-SNAPSHOT should be older than
1.0-beta-1-SNAPSHOT
     [java] 	at junit.framework.Assert.fail(Assert.java:47)
     [java] 	at junit.framework.Assert.assertTrue(Assert.java:20)
     [java] 	at org.apache.maven.artifact.versioning.DefaultArtifactVersionTest.assertVersionOlder(DefaultArtifactVersionTest.java:192)
     [java] 	at org.apache.maven.artifact.versioning.DefaultArtifactVersionTest.testVersionSnapshotComparing(DefaultArtifactVersionTest.java:147)
     [java] 
     [java] testSnapshotVsReleases(org.apache.maven.artifact.versioning.DefaultArtifactVersionTest)
 Time elapsed: 0 sec  <<< FAILURE!
     [java] junit.framework.AssertionFailedError: 1.0-SNAPSHOT should be older than 1.0-RC1
     [java] 	at junit.framework.Assert.fail(Assert.java:47)
     [java] 	at junit.framework.Assert.assertTrue(Assert.java:20)
     [java] 	at org.apache.maven.artifact.versioning.DefaultArtifactVersionTest.assertVersionOlder(DefaultArtifactVersionTest.java:192)
     [java] 	at org.apache.maven.artifact.versioning.DefaultArtifactVersionTest.testSnapshotVsReleases(DefaultArtifactVersionTest.java:167)
     [java] 
     [java] 
     [java] Results :
     [java] 
     [java] Failed tests: 
     [java]   testVersionComparing(org.apache.maven.artifact.versioning.DefaultArtifactVersionTest)
     [java]   testVersionSnapshotComparing(org.apache.maven.artifact.versioning.DefaultArtifactVersionTest)
     [java]   testSnapshotVsReleases(org.apache.maven.artifact.versioning.DefaultArtifactVersionTest)
     [java] 
     [java] Tests run: 18, Failures: 3, Errors: 0, Skipped: 0
     [java] 
     [java] [INFO] ------------------------------------------------------------------------
     [java] [INFO] Reactor Summary:
     [java] [INFO] 
     [java] [INFO] Apache Maven 3.x .................................. SUCCESS [1:07.011s]
     [java] [INFO] Maven Model ....................................... SUCCESS [1:04.867s]
     [java] [INFO] Maven Settings .................................... SUCCESS [31.908s]
     [java] [INFO] Maven Artifact .................................... FAILURE [6.572s]
     [java] [INFO] Maven Plugin API .................................. SKIPPED
     [java] [INFO] Maven Model Builder ............................... SKIPPED
     [java] [INFO] Maven Core ........................................ SKIPPED
     [java] [INFO] Maven Compat ...................................... SKIPPED
     [java] [INFO] Maven Embedder .................................... SKIPPED
     [java] [INFO] Maven Distribution ................................ SKIPPED
     [java] [INFO] ------------------------------------------------------------------------
     [java] [INFO] BUILD FAILURE
     [java] [INFO] ------------------------------------------------------------------------
     [java] [INFO] Total time: 3:02.373s
     [java] [INFO] Finished at: Sun Jan 17 12:14:47 CST 2010
     [java] [INFO] Final Memory: 19M/151M
     [java] [INFO] ------------------------------------------------------------------------
     [java] [ERROR] Failed to execute goal org.apache.maven.plugins:maven-surefire-plugin:2.4.3:test
(default-test) on project maven-artifact: There are test failures.
     [java] 
     [java] Please refer to /home/hudson/workspace/maven-3.0.x-bootstrap/label/ubuntu/trunk/maven-artifact/target/surefire-reports
for the individual test results.
     [java] -> [Help 1]
     [java] org.apache.maven.lifecycle.LifecycleExecutionException: Failed to execute goal
org.apache.maven.plugins:maven-surefire-plugin:2.4.3:test (default-test) on project maven-artifact:
There are test failures.
     [java] 
     [java] Please refer to /home/hudson/workspace/maven-3.0.x-bootstrap/label/ubuntu/trunk/maven-artifact/target/surefire-reports
for the individual test results.
     [java] 	at org.apache.maven.lifecycle.DefaultLifecycleExecutor.execute(DefaultLifecycleExecutor.java:566)
     [java] 	at org.apache.maven.lifecycle.DefaultLifecycleExecutor.execute(DefaultLifecycleExecutor.java:317)
     [java] 	at org.apache.maven.DefaultMaven.doExecute(DefaultMaven.java:247)
     [java] 	at org.apache.maven.DefaultMaven.execute(DefaultMaven.java:104)
     [java] 	at org.apache.maven.cli.MavenCli.execute(MavenCli.java:422)
     [java] 	at org.apache.maven.cli.MavenCli.doMain(MavenCli.java:157)
     [java] 	at org.apache.maven.cli.MavenCli.main(MavenCli.java:122)
     [java] 	at org.apache.maven.cli.MavenCli.main(MavenCli.java:113)
     [java] Caused by: org.apache.maven.plugin.MojoFailureException: There are test failures.
     [java] 
     [java] Please refer to /home/hudson/workspace/maven-3.0.x-bootstrap/label/ubuntu/trunk/maven-artifact/target/surefire-reports
for the individual test results.
     [java] 	at org.apache.maven.plugin.surefire.SurefirePlugin.execute(SurefirePlugin.java:575)
     [java] 	at org.apache.maven.plugin.DefaultBuildPluginManager.executeMojo(DefaultBuildPluginManager.java:105)
     [java] 	at org.apache.maven.lifecycle.DefaultLifecycleExecutor.execute(DefaultLifecycleExecutor.java:562)
     [java] 	... 7 more
     [java] [ERROR] 
     [java] [ERROR] Re-run Maven using the -X switch to enable full debug logging.
     [java] [ERROR] 
     [java] [ERROR] For more information about the errors and possible solutions, please read
the following articles:
     [java] [ERROR] [Help 1] http://cwiki.apache.org/confluence/display/MAVEN/MojoFailureException
     [java] [ERROR] 
     [java] [ERROR] After correcting the problems, you can resume the build with the command
     [java] [ERROR]   mvn <goals> -rf :maven-artifact

BUILD FAILED
/home/hudson/workspace/maven-3.0.x-bootstrap/label/ubuntu/trunk/build.xml:209: Java returned:
1

Total time: 5 minutes 8 seconds
Archiving artifacts


Mime
View raw message