maven-notifications mailing list archives

Site index · List index
Message view « Date » · « Thread »
Top « Date » · « Thread »
From Hudson <Hud...@sonatype.org>
Subject Build failed in Hudson: maven-core-integration-testing » windows #555
Date Wed, 20 Jan 2010 02:06:06 GMT
See <http://grid.sonatype.org/ci/job/maven-core-integration-testing/./label=windows/555/changes>

Changes:

[Benjamin Bentmann] o Increased concurrency

------------------------------------------
[...truncated 575 lines...]
[INFO] ------------------------------------------------------------------------
[INFO]                                                                         
[INFO] ------------------------------------------------------------------------
[INFO] Skipping Maven Integration Test Plugin :: Project Interpolation
[INFO] This project has been banned from the build due to previous failures.
[INFO] ------------------------------------------------------------------------
[INFO]                                                                         
[INFO] ------------------------------------------------------------------------
[INFO] Skipping Maven Integration Test Plugin :: Setter
[INFO] This project has been banned from the build due to previous failures.
[INFO] ------------------------------------------------------------------------
[INFO]                                                                         
[INFO] ------------------------------------------------------------------------
[INFO] Skipping Maven Integration Test Plugin :: Singleton Component
[INFO] This project has been banned from the build due to previous failures.
[INFO] ------------------------------------------------------------------------
[INFO]                                                                         
[INFO] ------------------------------------------------------------------------
[INFO] Skipping Maven Integration Test Plugin :: Site
[INFO] This project has been banned from the build due to previous failures.
[INFO] ------------------------------------------------------------------------
[INFO]                                                                         
[INFO] ------------------------------------------------------------------------
[INFO] Skipping Maven Integration Test Plugin :: Toolchain
[INFO] This project has been banned from the build due to previous failures.
[INFO] ------------------------------------------------------------------------
[INFO]                                                                         
[INFO] ------------------------------------------------------------------------
[INFO] Skipping Maven Integration Test Plugin :: Touch
[INFO] This project has been banned from the build due to previous failures.
[INFO] ------------------------------------------------------------------------
[INFO]                                                                         
[INFO] ------------------------------------------------------------------------
[INFO] Skipping Maven Integration Test Plugin :: Uses Properties Plugin
[INFO] This project has been banned from the build due to previous failures.
[INFO] ------------------------------------------------------------------------
[INFO]                                                                         
[INFO] ------------------------------------------------------------------------
[INFO] Skipping Maven Integration Test Plugin :: Uses Wagon Plugin
[INFO] This project has been banned from the build due to previous failures.
[INFO] ------------------------------------------------------------------------
[INFO]                                                                         
[INFO] ------------------------------------------------------------------------
[INFO] Skipping Maven Integration Test Plugin :: This plugin should contain the mojos needed
by all tests.
[INFO] This project has been banned from the build due to previous failures.
[INFO] ------------------------------------------------------------------------
[INFO]                                                                         
[INFO] ------------------------------------------------------------------------
[INFO] Skipping Maven Integration Test Plugin :: Plexus Utils 1.1
[INFO] This project has been banned from the build due to previous failures.
[INFO] ------------------------------------------------------------------------
[INFO]                                                                         
[INFO] ------------------------------------------------------------------------
[INFO] Skipping Maven Integration Test Plugin :: Plexus Utils New
[INFO] This project has been banned from the build due to previous failures.
[INFO] ------------------------------------------------------------------------
[INFO]                                                                         
[INFO] ------------------------------------------------------------------------
[INFO] Skipping Maven Integration Test Plugin :: Plexus Component API
[INFO] This project has been banned from the build due to previous failures.
[INFO] ------------------------------------------------------------------------
[INFO]                                                                         
[INFO] ------------------------------------------------------------------------
[INFO] Skipping Maven Integration Test Plugin :: Log4J Client
[INFO] This project has been banned from the build due to previous failures.
[INFO] ------------------------------------------------------------------------
[INFO]                                                                         
[INFO] ------------------------------------------------------------------------
[INFO] Skipping Unnamed - org.apache.maven.its.plugins:maven-it-plugin-extension1:maven-plugin:2.1-SNAPSHOT
[INFO] This project has been banned from the build due to previous failures.
[INFO] ------------------------------------------------------------------------
[INFO]                                                                         
[INFO] ------------------------------------------------------------------------
[INFO] Skipping Unnamed - org.apache.maven.its.plugins:maven-it-plugin-extension2:maven-plugin:2.1-SNAPSHOT
[INFO] This project has been banned from the build due to previous failures.
[INFO] ------------------------------------------------------------------------
[INFO]                                                                         
[INFO] ------------------------------------------------------------------------
[INFO] Skipping Maven Integration Test Wagon
[INFO] This project has been banned from the build due to previous failures.
[INFO] ------------------------------------------------------------------------
[INFO]                                                                         
[INFO] ------------------------------------------------------------------------
[INFO] Skipping Maven Integration Test Support Artifacts
[INFO] This project has been banned from the build due to previous failures.
[INFO] ------------------------------------------------------------------------
[INFO]                                                                         
[INFO] ------------------------------------------------------------------------
[INFO] Skipping Maven Integration Test Extension
[INFO] This project has been banned from the build due to previous failures.
[INFO] ------------------------------------------------------------------------
[INFO]                                                                         
[INFO] ------------------------------------------------------------------------
[INFO] Skipping Maven Integration Tests
[INFO] This project has been banned from the build due to previous failures.
[INFO] ------------------------------------------------------------------------
[INFO] ------------------------------------------------------------------------
[INFO] Reactor Summary:
[INFO] 
[INFO] Maven Integration Tests Parent .................... FAILURE [1.119s]
[INFO] Maven Integration Testing Support ................. SKIPPED
[INFO] Maven Integration Tests :: Plugins ................ SKIPPED
[INFO] Maven Integration Test Plugin :: Active Collection  SKIPPED
[INFO] Maven Integration Test Plugin :: Ant-Based ........ SKIPPED
[INFO] Maven Integration Test Plugin :: Artifact ......... SKIPPED
[INFO] Maven Integration Test Plugin :: Class Loader :: Aggregator  SKIPPED
[INFO] Maven Integration Test Plugin :: Class Loader :: Dependency A  SKIPPED
[INFO] Maven Integration Test Plugin :: Class Loader :: Dependency B  SKIPPED
[INFO] Maven Integration Test Plugin :: Class Loader ..... SKIPPED
[INFO] Maven Integration Test Plugin :: Configuration .... SKIPPED
[INFO] Maven Integration Test Plugin :: Context Passing .. SKIPPED
[INFO] Maven Integration Tests :: Core Plugin Stubs ...... SKIPPED
[INFO] Maven Integration Test Plugin :: Maven Clean Plugin Stub  SKIPPED
[INFO] Maven Integration Test Plugin :: Maven Compiler Plugin Stub  SKIPPED
[INFO] Maven Integration Test Plugin :: Maven Deploy Plugin Stub  SKIPPED
[INFO] Maven Integration Test Plugin :: Maven EAR Plugin Stub  SKIPPED
[INFO] Maven Integration Test Plugin :: Maven EJB Plugin Stub  SKIPPED
[INFO] Maven Integration Test Plugin :: Maven Install Plugin Stub  SKIPPED
[INFO] Maven Integration Test Plugin :: Maven JAR Plugin Stub  SKIPPED
[INFO] Maven Integration Test Plugin :: Maven Javadoc Plugin Stub  SKIPPED
[INFO] Maven Integration Test Plugin :: Maven Plugin Plugin Stub  SKIPPED
[INFO] Maven Integration Test Plugin :: Maven RAR Plugin Stub  SKIPPED
[INFO] Maven Integration Test Plugin :: Maven Resources Plugin Stub  SKIPPED
[INFO] Maven Integration Test Plugin :: Maven Site Plugin Stub  SKIPPED
[INFO] Maven Integration Test Plugin :: Maven Source Plugin Stub  SKIPPED
[INFO] Maven Integration Test Plugin :: Maven Surefire Plugin Stub  SKIPPED
[INFO] Maven Integration Test Plugin :: Maven WAR Plugin Stub  SKIPPED
[INFO] Maven Integration Test Plugin :: Dependency Collection  SKIPPED
[INFO] Maven Integration Test Plugin :: Dependency Resolution  SKIPPED
[INFO] Maven Integration Test Plugin :: Expression ....... SKIPPED
[INFO] Maven Integration Test Plugin :: Error Mojos ...... SKIPPED
[INFO] Maven Integration Test Component .................. SKIPPED
[INFO] Maven Integration Test Plugin :: Extension Consumer  SKIPPED
[INFO] Maven Integration Test Plugin :: Extension Provider  SKIPPED
[INFO] Maven Integration Test Plugin :: Fork ............. SKIPPED
[INFO] Maven Integration Test Plugin :: Invalid Descriptor  SKIPPED
[INFO] Maven Integration Test Plugin :: Log File ......... SKIPPED
[INFO] Maven Integration Test Plugin :: No Default Component  SKIPPED
[INFO] Maven Integration Test Plugin :: No Project ....... SKIPPED
[INFO] Maven Integration Test Plugin :: Online ........... SKIPPED
[INFO] Maven Integration Test Plugin :: Optional Mojos ... SKIPPED
[INFO] Maven Integration Test Plugin :: Packaging ........ SKIPPED
[INFO] Maven Integration Test Plugin :: Parameter Implementation  SKIPPED
[INFO] Maven Integration Test Plugin :: Plugin Dependency  SKIPPED
[INFO] Maven Integration Test Helper Library ............. SKIPPED
[INFO] Maven Integration Test Plugin :: Project Interpolation  SKIPPED
[INFO] Maven Integration Test Plugin :: Setter ........... SKIPPED
[INFO] Maven Integration Test Plugin :: Singleton Component  SKIPPED
[INFO] Maven Integration Test Plugin :: Site ............. SKIPPED
[INFO] Maven Integration Test Plugin :: Toolchain ........ SKIPPED
[INFO] Maven Integration Test Plugin :: Touch ............ SKIPPED
[INFO] Maven Integration Test Plugin :: Uses Properties Plugin  SKIPPED
[INFO] Maven Integration Test Plugin :: Uses Wagon Plugin  SKIPPED
[INFO] Maven Integration Test Plugin :: This plugin should contain the mojos needed by all
tests.  SKIPPED
[INFO] Maven Integration Test Plugin :: Plexus Utils 1.1 . SKIPPED
[INFO] Maven Integration Test Plugin :: Plexus Utils New . SKIPPED
[INFO] Maven Integration Test Plugin :: Plexus Component API  SKIPPED
[INFO] Maven Integration Test Plugin :: Log4J Client ..... SKIPPED
[INFO] Unnamed - org.apache.maven.its.plugins:maven-it-plugin-extension1:maven-plugin:2.1-SNAPSHOT
 SKIPPED
[INFO] Unnamed - org.apache.maven.its.plugins:maven-it-plugin-extension2:maven-plugin:2.1-SNAPSHOT
 SKIPPED
[INFO] Maven Integration Test Wagon ...................... SKIPPED
[INFO] Maven Integration Test Support Artifacts .......... SKIPPED
[INFO] Maven Integration Test Extension .................. SKIPPED
[INFO] Maven Integration Tests ........................... SKIPPED
[INFO] ------------------------------------------------------------------------
[INFO] BUILD FAILURE
[INFO] ------------------------------------------------------------------------
[INFO] Total time: 2.140s
[INFO] Finished at: Tue Jan 19 18:04:54 PST 2010
[INFO] Final Memory: 3M/10M
[INFO] ------------------------------------------------------------------------
[ERROR] Plugin org.apache.maven.plugins:maven-install-plugin:2.2 or one of its dependencies
could not be resolved: Error transferring file: Connection refused: connect
  org.apache.maven.plugins:maven-install-plugin:maven-plugin:2.2

from the specified remote repositories:
  Nexus (http://repository.sonatype.org:8081/content/groups/sonatype-public-grid, releases=true,
snapshots=true)
-> [Help 1]
org.apache.maven.plugin.PluginResolutionException: Plugin org.apache.maven.plugins:maven-install-plugin:2.2
or one of its dependencies could not be resolved: Error transferring file: Connection refused:
connect
  org.apache.maven.plugins:maven-install-plugin:maven-plugin:2.2

from the specified remote repositories:
  Nexus (http://repository.sonatype.org:8081/content/groups/sonatype-public-grid, releases=true,
snapshots=true)

	at org.apache.maven.plugin.internal.DefaultMavenPluginManager.resolvePluginArtifact(DefaultMavenPluginManager.java:173)
	at org.apache.maven.plugin.internal.DefaultMavenPluginManager.getPluginDescriptor(DefaultMavenPluginManager.java:144)
	at org.apache.maven.plugin.internal.DefaultMavenPluginManager.getMojoDescriptor(DefaultMavenPluginManager.java:280)
	at org.apache.maven.plugin.DefaultBuildPluginManager.getMojoDescriptor(DefaultBuildPluginManager.java:194)
	at org.apache.maven.lifecycle.DefaultLifecycleExecutor.calculateExecutionPlan(DefaultLifecycleExecutor.java:785)
	at org.apache.maven.lifecycle.DefaultLifecycleExecutor.execute(DefaultLifecycleExecutor.java:281)
	at org.apache.maven.DefaultMaven.doExecute(DefaultMaven.java:247)
	at org.apache.maven.DefaultMaven.execute(DefaultMaven.java:104)
	at org.apache.maven.cli.MavenCli.execute(MavenCli.java:423)
	at org.apache.maven.cli.MavenCli.doMain(MavenCli.java:158)
	at org.apache.maven.cli.MavenCli.main(MavenCli.java:123)
	at sun.reflect.NativeMethodAccessorImpl.invoke0(Native Method)
	at sun.reflect.NativeMethodAccessorImpl.invoke(NativeMethodAccessorImpl.java:39)
	at sun.reflect.DelegatingMethodAccessorImpl.invoke(DelegatingMethodAccessorImpl.java:25)
	at java.lang.reflect.Method.invoke(Method.java:597)
	at org.codehaus.plexus.classworlds.launcher.Launcher.launchEnhanced(Launcher.java:290)
	at org.codehaus.plexus.classworlds.launcher.Launcher.launch(Launcher.java:230)
	at org.codehaus.plexus.classworlds.launcher.Launcher.mainWithExitCode(Launcher.java:409)
	at org.codehaus.plexus.classworlds.launcher.Launcher.main(Launcher.java:352)
Caused by: org.apache.maven.artifact.resolver.ArtifactResolutionException: Error transferring
file: Connection refused: connect
  org.apache.maven.plugins:maven-install-plugin:maven-plugin:2.2

from the specified remote repositories:
  Nexus (http://repository.sonatype.org:8081/content/groups/sonatype-public-grid, releases=true,
snapshots=true)

	at org.apache.maven.artifact.resolver.DefaultArtifactResolver.resolve(DefaultArtifactResolver.java:230)
	at org.apache.maven.artifact.resolver.DefaultArtifactResolver.resolve(DefaultArtifactResolver.java:469)
	at org.apache.maven.repository.legacy.LegacyRepositorySystem.resolve(LegacyRepositorySystem.java:325)
	at org.apache.maven.plugin.internal.DefaultMavenPluginManager.resolvePluginArtifact(DefaultMavenPluginManager.java:165)
	... 18 more
Caused by: org.apache.maven.wagon.TransferFailedException: Error transferring file: Connection
refused: connect
	at org.apache.maven.wagon.providers.http.LightweightHttpWagon.fillInputData(LightweightHttpWagon.java:143)
	at org.apache.maven.wagon.StreamWagon.getInputStream(StreamWagon.java:116)
	at org.apache.maven.wagon.StreamWagon.getIfNewer(StreamWagon.java:88)
	at org.apache.maven.wagon.StreamWagon.get(StreamWagon.java:61)
	at org.apache.maven.repository.legacy.DefaultWagonManager.getRemoteFile(DefaultWagonManager.java:309)
	at org.apache.maven.repository.legacy.DefaultWagonManager.getArtifact(DefaultWagonManager.java:98)
	at org.apache.maven.repository.legacy.DefaultWagonManager.getArtifact(DefaultWagonManager.java:129)
	at org.apache.maven.artifact.resolver.DefaultArtifactResolver.resolve(DefaultArtifactResolver.java:213)
	... 21 more
Caused by: java.net.ConnectException: Connection refused: connect
	at java.net.PlainSocketImpl.socketConnect(Native Method)
	at java.net.PlainSocketImpl.doConnect(PlainSocketImpl.java:333)
	at java.net.PlainSocketImpl.connectToAddress(PlainSocketImpl.java:195)
	at java.net.PlainSocketImpl.connect(PlainSocketImpl.java:182)
	at java.net.SocksSocketImpl.connect(SocksSocketImpl.java:366)
	at java.net.Socket.connect(Socket.java:519)
	at java.net.Socket.connect(Socket.java:469)
	at sun.net.NetworkClient.doConnect(NetworkClient.java:163)
	at sun.net.www.http.HttpClient.openServer(HttpClient.java:394)
	at sun.net.www.http.HttpClient.openServer(HttpClient.java:529)
	at sun.net.www.http.HttpClient.<init>(HttpClient.java:233)
	at sun.net.www.http.HttpClient.New(HttpClient.java:306)
	at sun.net.www.http.HttpClient.New(HttpClient.java:323)
	at sun.net.www.protocol.http.HttpURLConnection.getNewHttpClient(HttpURLConnection.java:837)
	at sun.net.www.protocol.http.HttpURLConnection.plainConnect(HttpURLConnection.java:778)
	at sun.net.www.protocol.http.HttpURLConnection.connect(HttpURLConnection.java:703)
	at sun.net.www.protocol.http.HttpURLConnection.getInputStream(HttpURLConnection.java:1026)
	at java.net.HttpURLConnection.getResponseCode(HttpURLConnection.java:373)
	at org.apache.maven.wagon.providers.http.LightweightHttpWagon.fillInputData(LightweightHttpWagon.java:115)
	... 28 more
[ERROR] 
[ERROR] Re-run Maven using the -X switch to enable full debug logging.
[ERROR] 
[ERROR] For more information about the errors and possible solutions, please read the following
articles:
[ERROR] [Help 1] http://cwiki.apache.org/confluence/display/MAVEN/PluginResolutionException


Mime
View raw message