maven-notifications mailing list archives

Site index · List index
Message view « Date » · « Thread »
Top « Date » · « Thread »
From Hudson <Hud...@sonatype.org>
Subject Build failed in Hudson: surefire » windows #45
Date Sun, 10 Jan 2010 07:20:05 GMT
See <http://grid.sonatype.org/ci/job/surefire/./label=windows/45/changes>

Changes:

[Dennis Lundberg] o Use our annotations for deprecation and default-value. Fix typos.

[Dennis Lundberg] o Minor corrections to the site, including fixing typos and adding formating

[Dennis Lundberg] o Remove unnecessary project name.

------------------------------------------
[...truncated 1781 lines...]
Downloading: http://repository.sonatype.org:8081/content/groups/sonatype-public-grid/org/apache/maven/shared/maven-invoker/2.0.11/maven-invoker-2.0.11.jar
29 KB downloaded at 441.1 KB/sec
Downloading: http://repository.sonatype.org:8081/content/groups/sonatype-public-grid/org/apache/maven/doxia/doxia-sink-api/1.0-alpha-11/doxia-sink-api-1.0-alpha-11.jar
10 KB downloaded at 121.9 KB/sec
Downloading: http://repository.sonatype.org:8081/content/groups/sonatype-public-grid/org/apache/maven/reporting/maven-reporting-impl/2.0.4.1/maven-reporting-impl-2.0.4.1.jar
19 KB downloaded at 160.9 KB/sec
Downloading: http://repository.sonatype.org:8081/content/groups/sonatype-public-grid/org/apache/maven/doxia/doxia-core/1.0-alpha-10/doxia-core-1.0-alpha-10.jar
54 KB downloaded at 762.2 KB/sec
Downloading: http://repository.sonatype.org:8081/content/groups/sonatype-public-grid/org/apache/maven/doxia/doxia-site-renderer/1.0-alpha-11/doxia-site-renderer-1.0-alpha-11.jar
45 KB downloaded at 760.7 KB/sec
Downloading: http://repository.sonatype.org:8081/content/groups/sonatype-public-grid/org/apache/maven/doxia/doxia-decoration-model/1.0-alpha-11/doxia-decoration-model-1.0-alpha-11.jar
49 KB downloaded at 725.7 KB/sec
Downloading: http://repository.sonatype.org:8081/content/groups/sonatype-public-grid/org/apache/maven/doxia/doxia-module-apt/1.0-alpha-11/doxia-module-apt-1.0-alpha-11.jar
46 KB downloaded at 713.5 KB/sec
Downloading: http://repository.sonatype.org:8081/content/groups/sonatype-public-grid/org/apache/maven/doxia/doxia-module-fml/1.0-alpha-11/doxia-module-fml-1.0-alpha-11.jar
18 KB downloaded at 306.9 KB/sec
Downloading: http://repository.sonatype.org:8081/content/groups/sonatype-public-grid/org/apache/maven/doxia/doxia-module-xdoc/1.0-alpha-11/doxia-module-xdoc-1.0-alpha-11.jar
27 KB downloaded at 470.8 KB/sec
Downloading: http://repository.sonatype.org:8081/content/groups/sonatype-public-grid/org/apache/maven/doxia/doxia-module-xhtml/1.0-alpha-11/doxia-module-xhtml-1.0-alpha-11.jar
21 KB downloaded at 381.4 KB/sec
Downloading: http://repository.sonatype.org:8081/content/groups/sonatype-public-grid/org/beanshell/bsh/2.0b4/bsh-2.0b4.jar
276 KB downloaded at 4743.0 KB/sec
Downloading: http://repository.sonatype.org:8081/content/groups/sonatype-public-grid/org/codehaus/groovy/groovy/1.5.6/groovy-1.5.6.jar
2252 KB downloaded at 15854.7 KB/sec
Downloading: http://repository.sonatype.org:8081/content/groups/sonatype-public-grid/antlr/antlr/2.7.6/antlr-2.7.6.jar
434 KB downloaded at 5697.9 KB/sec
Downloading: http://repository.sonatype.org:8081/content/groups/sonatype-public-grid/asm/asm/2.2/asm-2.2.jar
34 KB downloaded at 640.8 KB/sec
Downloading: http://repository.sonatype.org:8081/content/groups/sonatype-public-grid/org/apache/ant/ant/1.7.1/ant-1.7.1.jar
1292 KB downloaded at 14355.5 KB/sec
Downloading: http://repository.sonatype.org:8081/content/groups/sonatype-public-grid/org/apache/ant/ant-launcher/1.7.0/ant-launcher-1.7.0.jar
12 KB downloaded at 51.6 KB/sec
Downloading: http://repository.sonatype.org:8081/content/groups/sonatype-public-grid/asm/asm-util/2.2/asm-util-2.2.jar
33 KB downloaded at 563.0 KB/sec
Downloading: http://repository.sonatype.org:8081/content/groups/sonatype-public-grid/asm/asm-analysis/2.2/asm-analysis-2.2.jar
18 KB downloaded at 189.0 KB/sec
Downloading: http://repository.sonatype.org:8081/content/groups/sonatype-public-grid/asm/asm-tree/2.2/asm-tree-2.2.jar
16 KB downloaded at 131.2 KB/sec
Downloading: http://repository.sonatype.org:8081/content/groups/sonatype-public-grid/jline/jline/0.9.94/jline-0.9.94.jar
86 KB downloaded at 1332.5 KB/sec
Downloading: http://repository.sonatype.org:8081/content/groups/sonatype-public-grid/org/codehaus/plexus/plexus-interpolation/1.2/plexus-interpolation-1.2.jar
36 KB downloaded at 416.8 KB/sec
[INFO] Installing C:\home\hudson\workspace\surefire\label\windows\trunk\maven-surefire-report-plugin\pom.xml
to C:\opt\repos\surefire\label=windows\org\apache\maven\plugins\maven-surefire-report-plugin\2.6-SNAPSHOT\maven-surefire-report-plugin-2.6-SNAPSHOT.pom
[INFO] Installing C:\home\hudson\workspace\surefire\label\windows\trunk\maven-surefire-report-plugin\target\maven-surefire-report-plugin-2.6-SNAPSHOT.jar
to C:\opt\repos\surefire\label=windows\org\apache\maven\plugins\maven-surefire-report-plugin\2.6-SNAPSHOT\maven-surefire-report-plugin-2.6-20100110.070328-1.jar
[INFO] Installing C:\home\hudson\workspace\surefire\label\windows\trunk\pom.xml to C:\opt\repos\surefire\label=windows\org\apache\maven\surefire\surefire\2.6-SNAPSHOT\surefire-2.6-SNAPSHOT.pom
[INFO] Installing C:\home\hudson\workspace\surefire\label\windows\trunk\maven-surefire-plugin\pom.xml
to C:\opt\repos\surefire\label=windows\org\apache\maven\plugins\maven-surefire-plugin\2.6-SNAPSHOT\maven-surefire-plugin-2.6-SNAPSHOT.pom
[INFO] Installing C:\home\hudson\workspace\surefire\label\windows\trunk\maven-surefire-plugin\target\maven-surefire-plugin-2.6-SNAPSHOT.jar
to C:\opt\repos\surefire\label=windows\org\apache\maven\plugins\maven-surefire-plugin\2.6-SNAPSHOT\maven-surefire-plugin-2.6-20100110.070328-1.jar
[INFO] Installing C:\home\hudson\workspace\surefire\label\windows\trunk\surefire-booter\target\dependency-reduced-pom.xml
to C:\opt\repos\surefire\label=windows\org\apache\maven\surefire\surefire-booter\2.6-SNAPSHOT\surefire-booter-2.6-SNAPSHOT.pom
[INFO] Installing C:\home\hudson\workspace\surefire\label\windows\trunk\surefire-booter\target\surefire-booter-2.6-SNAPSHOT.jar
to C:\opt\repos\surefire\label=windows\org\apache\maven\surefire\surefire-booter\2.6-SNAPSHOT\surefire-booter-2.6-20100110.070328-1.jar
[INFO] Installing C:\home\hudson\workspace\surefire\label\windows\trunk\surefire-api\target\dependency-reduced-pom.xml
to C:\opt\repos\surefire\label=windows\org\apache\maven\surefire\surefire-api\2.6-SNAPSHOT\surefire-api-2.6-SNAPSHOT.pom
[INFO] Installing C:\home\hudson\workspace\surefire\label\windows\trunk\surefire-api\target\surefire-api-2.6-SNAPSHOT.jar
to C:\opt\repos\surefire\label=windows\org\apache\maven\surefire\surefire-api\2.6-SNAPSHOT\surefire-api-2.6-20100110.070328-1.jar
[INFO] Installing C:\home\hudson\workspace\surefire\label\windows\trunk\surefire-providers\surefire-testng\pom.xml
to C:\opt\repos\surefire\label=windows\org\apache\maven\surefire\surefire-testng\2.6-SNAPSHOT\surefire-testng-2.6-SNAPSHOT.pom
[INFO] Installing C:\home\hudson\workspace\surefire\label\windows\trunk\surefire-providers\surefire-testng\target\surefire-testng-2.6-SNAPSHOT.jar
to C:\opt\repos\surefire\label=windows\org\apache\maven\surefire\surefire-testng\2.6-SNAPSHOT\surefire-testng-2.6-20100110.070328-1.jar
[INFO] Installing C:\home\hudson\workspace\surefire\label\windows\trunk\surefire-providers\pom.xml
to C:\opt\repos\surefire\label=windows\org\apache\maven\surefire\surefire-providers\2.6-SNAPSHOT\surefire-providers-2.6-SNAPSHOT.pom
[INFO] Installing C:\home\hudson\workspace\surefire\label\windows\trunk\surefire-providers\surefire-junit\pom.xml
to C:\opt\repos\surefire\label=windows\org\apache\maven\surefire\surefire-junit\2.6-SNAPSHOT\surefire-junit-2.6-SNAPSHOT.pom
[INFO] Installing C:\home\hudson\workspace\surefire\label\windows\trunk\surefire-providers\surefire-junit\target\surefire-junit-2.6-SNAPSHOT.jar
to C:\opt\repos\surefire\label=windows\org\apache\maven\surefire\surefire-junit\2.6-SNAPSHOT\surefire-junit-2.6-20100110.070328-1.jar
[INFO] Installing C:\home\hudson\workspace\surefire\label\windows\trunk\surefire-providers\surefire-junit4\pom.xml
to C:\opt\repos\surefire\label=windows\org\apache\maven\surefire\surefire-junit4\2.6-SNAPSHOT\surefire-junit4-2.6-SNAPSHOT.pom
[INFO] Installing C:\home\hudson\workspace\surefire\label\windows\trunk\surefire-providers\surefire-junit4\target\surefire-junit4-2.6-SNAPSHOT.jar
to C:\opt\repos\surefire\label=windows\org\apache\maven\surefire\surefire-junit4\2.6-SNAPSHOT\surefire-junit4-2.6-20100110.070328-1.jar
[INFO] Installing C:\home\hudson\workspace\surefire\label\windows\trunk\surefire-providers\surefire-junit47\pom.xml
to C:\opt\repos\surefire\label=windows\org\apache\maven\surefire\surefire-junit47\2.6-SNAPSHOT\surefire-junit47-2.6-SNAPSHOT.pom
[INFO] Installing C:\home\hudson\workspace\surefire\label\windows\trunk\surefire-providers\surefire-junit47\target\surefire-junit47-2.6-SNAPSHOT.jar
to C:\opt\repos\surefire\label=windows\org\apache\maven\surefire\surefire-junit47\2.6-SNAPSHOT\surefire-junit47-2.6-20100110.070328-1.jar
[INFO] Installing C:\home\hudson\workspace\surefire\label\windows\trunk\surefire-integration-tests\pom.xml
to C:\opt\repos\surefire\label=windows\org\apache\maven\surefire\surefire-integration-tests\2.6-SNAPSHOT\surefire-integration-tests-2.6-SNAPSHOT.pom
[INFO] Installing C:\home\hudson\workspace\surefire\label\windows\trunk\surefire-integration-tests\target\surefire-integration-tests-2.6-SNAPSHOT.jar
to C:\opt\repos\surefire\label=windows\org\apache\maven\surefire\surefire-integration-tests\2.6-SNAPSHOT\surefire-integration-tests-2.6-SNAPSHOT.jar
[INFO] 
[INFO] --- failsafe-maven-plugin:2.4.3-alpha-1:integration-test (default) @ surefire-integration-tests
---
Downloading: http://repository.sonatype.org:8081/content/groups/sonatype-public-grid/org/codehaus/mojo/failsafe-maven-plugin/2.4.3-alpha-1/failsafe-maven-plugin-2.4.3-alpha-1.pom
8 KB downloaded at 2.8 KB/sec
Downloading: http://repository.sonatype.org:8081/content/groups/sonatype-public-grid/org/codehaus/mojo/mojo-parent/21/mojo-parent-21.pom
19 KB downloaded at 13.1 KB/sec
Downloading: http://repository.sonatype.org:8081/content/groups/sonatype-public-grid/org/apache/maven/surefire/surefire-booter/2.4.3/surefire-booter-2.4.3.pom
2 KB downloaded at 28.7 KB/sec
Downloading: http://repository.sonatype.org:8081/content/groups/sonatype-public-grid/org/apache/maven/surefire/surefire/2.4.3/surefire-2.4.3.pom
8 KB downloaded at 137.8 KB/sec
Downloading: http://repository.sonatype.org:8081/content/groups/sonatype-public-grid/org/apache/maven/surefire/surefire-api/2.4.3/surefire-api-2.4.3.pom
3 KB downloaded at 33.8 KB/sec
Downloading: http://repository.sonatype.org:8081/content/groups/sonatype-public-grid/org/codehaus/plexus/plexus-utils/1.5.1/plexus-utils-1.5.1.pom
3 KB downloaded at 31.6 KB/sec
Downloading: http://repository.sonatype.org:8081/content/groups/sonatype-public-grid/org/apache/maven/surefire/surefire-booter/2.4.3/surefire-booter-2.4.3.jar
262 KB downloaded at 3847.0 KB/sec
Downloading: http://repository.sonatype.org:8081/content/groups/sonatype-public-grid/org/apache/maven/surefire/surefire-api/2.4.3/surefire-api-2.4.3.jar
504 KB downloaded at 6141.7 KB/sec
Downloading: http://repository.sonatype.org:8081/content/groups/sonatype-public-grid/org/codehaus/plexus/plexus-utils/1.5.1/plexus-utils-1.5.1.jar
206 KB downloaded at 3547.3 KB/sec
Downloading: http://repository.sonatype.org:8081/content/groups/sonatype-public-grid/org/apache/maven/surefire/surefire-junit/2.4.3/surefire-junit-2.4.3.pom
2 KB downloaded at 27.4 KB/sec
Downloading: http://repository.sonatype.org:8081/content/groups/sonatype-public-grid/org/apache/maven/surefire/surefire-providers/2.4.3/surefire-providers-2.4.3.pom
2 KB downloaded at 14.5 KB/sec
Downloading: http://repository.sonatype.org:8081/content/groups/sonatype-public-grid/org/apache/maven/surefire/surefire-junit/2.4.3/surefire-junit-2.4.3.jar
15 KB downloaded at 169.4 KB/sec
[INFO] Failsafe report directory: C:\home\hudson\workspace\surefire\label\windows\trunk\surefire-integration-tests\target\failsafe-reports

-------------------------------------------------------
 T E S T S
-------------------------------------------------------
Running org.apache.maven.surefire.its.UseIsolatedClassLoaderIT
Tests run: 1, Failures: 0, Errors: 0, Skipped: 0, Time elapsed: 16.916 sec
Running org.apache.maven.surefire.its.TwoTestCasesIT
Tests run: 4, Failures: 0, Errors: 0, Skipped: 0, Time elapsed: 28.189 sec
Running org.apache.maven.surefire.its.PlexusConflictIT
Tests run: 2, Failures: 0, Errors: 0, Skipped: 0, Time elapsed: 28.829 sec
Running org.apache.maven.surefire.its.AdditionalClasspathIT
Tests run: 1, Failures: 0, Errors: 0, Skipped: 0, Time elapsed: 3.103 sec
Running org.apache.maven.surefire.its.AbstractTestCaseIT
Tests run: 1, Failures: 0, Errors: 0, Skipped: 0, Time elapsed: 4.095 sec
Running org.apache.maven.surefire.its.JUnit44HamcrestIT
Tests run: 1, Failures: 0, Errors: 0, Skipped: 0, Time elapsed: 3.781 sec
Running org.apache.maven.surefire.its.CheckTestNgBeforeMethodFailureIT
Tests run: 1, Failures: 0, Errors: 0, Skipped: 0, Time elapsed: 4.174 sec
Running org.apache.maven.surefire.its.ArgLineIT
Tests run: 1, Failures: 0, Errors: 0, Skipped: 0, Time elapsed: 3.796 sec
Running org.apache.maven.surefire.its.CheckSingleTestIT
Tests run: 4, Failures: 1, Errors: 0, Skipped: 0, Time elapsed: 39.178 sec <<< FAILURE!
Running org.apache.maven.surefire.its.JUnit4ForkAlwaysStaticInitPollutionIT
Tests run: 1, Failures: 0, Errors: 0, Skipped: 0, Time elapsed: 5.527 sec
Running org.apache.maven.surefire.its.Surefire44InnerClassTestIT
Tests run: 1, Failures: 0, Errors: 0, Skipped: 0, Time elapsed: 5.287 sec
Running org.apache.maven.surefire.its.WorkingDirectoryIT
Tests run: 4, Failures: 0, Errors: 0, Skipped: 0, Time elapsed: 24.23 sec
Running org.apache.maven.surefire.its.Surefire377TestNgAndJUnitTogetherIT
Tests run: 1, Failures: 0, Errors: 0, Skipped: 0, Time elapsed: 5.998 sec
Running org.apache.maven.surefire.its.DefaultConfigurationIT
Tests run: 1, Failures: 0, Errors: 0, Skipped: 0, Time elapsed: 6.058 sec
Running org.apache.maven.surefire.its.CheckTestNgSuiteXmlIT
Tests run: 2, Failures: 0, Errors: 0, Skipped: 0, Time elapsed: 14.444 sec
Running org.apache.maven.surefire.its.Surefire42NotExtendingTestCaseIT
Tests run: 1, Failures: 0, Errors: 0, Skipped: 0, Time elapsed: 6.414 sec
Running org.apache.maven.surefire.its.PlainOldJavaClasspathIT
Tests run: 1, Failures: 0, Errors: 0, Skipped: 0, Time elapsed: 7.04 sec
Running org.apache.maven.surefire.its.CheckTestFailIfNoTestsForkModeIT
Tests run: 6, Failures: 0, Errors: 0, Skipped: 0, Time elapsed: 54.188 sec
Running org.apache.maven.surefire.its.ClassPathOrderIT
Tests run: 1, Failures: 0, Errors: 0, Skipped: 0, Time elapsed: 9.86 sec
Running org.apache.maven.surefire.its.Junit4IgnoreIT
Tests run: 1, Failures: 0, Errors: 0, Skipped: 0, Time elapsed: 6.713 sec
Running org.apache.maven.surefire.its.CheckTestNgJdk14IT
Tests run: 1, Failures: 0, Errors: 0, Skipped: 0, Time elapsed: 7.254 sec
Running org.apache.maven.surefire.its.CheckTestNgExecuteErrorIT
Tests run: 1, Failures: 0, Errors: 0, Skipped: 0, Time elapsed: 7.172 sec
Running org.apache.maven.surefire.its.ForkModeIT
Tests run: 5, Failures: 0, Errors: 0, Skipped: 0, Time elapsed: 49.057 sec
Running org.apache.maven.surefire.its.Junit4VersionsIT
Tests run: 6, Failures: 0, Errors: 0, Skipped: 0, Time elapsed: 61.848 sec
Running org.apache.maven.surefire.its.TimeoutForkedTestIT
Tests run: 1, Failures: 0, Errors: 0, Skipped: 0, Time elapsed: 15.603 sec
Running org.apache.maven.surefire.its.Surefire146ForkPerTestNoSetupIT
Tests run: 1, Failures: 0, Errors: 0, Skipped: 0, Time elapsed: 4.78 sec
Running org.apache.maven.surefire.its.SystemPropertiesTestIT
Tests run: 2, Failures: 0, Errors: 0, Skipped: 0, Time elapsed: 18.519 sec
Running org.apache.maven.surefire.its.CheckTestNgGroupThreadParallelIT
Tests run: 1, Failures: 0, Errors: 0, Skipped: 0, Time elapsed: 6.174 sec
Running org.apache.maven.surefire.its.PojoSimpleIT
Tests run: 1, Failures: 0, Errors: 0, Skipped: 0, Time elapsed: 4.492 sec
Running org.apache.maven.surefire.its.Surefire162CharsetProviderIT
Tests run: 1, Failures: 0, Errors: 0, Skipped: 0, Time elapsed: 5.638 sec
Running org.apache.maven.surefire.its.CheckTestNgBeforeMethodIT
Tests run: 1, Failures: 0, Errors: 0, Skipped: 0, Time elapsed: 5.451 sec
Running org.apache.maven.surefire.its.SiblingAggregatorIT
Tests run: 1, Failures: 0, Errors: 0, Skipped: 0, Time elapsed: 5.129 sec
Running org.apache.maven.surefire.its.AggregateReportIT
Tests run: 1, Failures: 0, Errors: 0, Skipped: 0, Time elapsed: 14.904 sec
Running org.apache.maven.surefire.its.CheckTestNgReportTestIT
Tests run: 1, Failures: 0, Errors: 0, Skipped: 0, Time elapsed: 4.765 sec
Running org.apache.maven.surefire.its.CheckTestNgSuiteXmlSingleIT
Tests run: 1, Failures: 0, Errors: 0, Skipped: 0, Time elapsed: 7.67 sec
Running org.apache.maven.surefire.its.CheckTestNgPathWithSpacesIT
Tests run: 1, Failures: 0, Errors: 0, Skipped: 0, Time elapsed: 3.84 sec
Running org.apache.maven.surefire.its.Surefire224WellFormedXmlFailuresIT
Tests run: 1, Failures: 0, Errors: 0, Skipped: 0, Time elapsed: 5.272 sec
Running org.apache.maven.surefire.its.CheckTestNgListenerReporterIT
Tests run: 1, Failures: 0, Errors: 0, Skipped: 0, Time elapsed: 4.337 sec
Running org.apache.maven.surefire.its.ChekcTestNgVersionsIT
Tests run: 6, Failures: 0, Errors: 0, Skipped: 0, Time elapsed: 66.076 sec
Running org.apache.maven.surefire.its.UmlautDirIT
Tests run: 2, Failures: 0, Errors: 0, Skipped: 0, Time elapsed: 18.019 sec
Running org.apache.maven.surefire.its.EnvironmentVariableIT
Tests run: 1, Failures: 0, Errors: 0, Skipped: 0, Time elapsed: 6.179 sec
Running org.apache.maven.surefire.its.CheckTestFailIfNoTestsIT
Tests run: 2, Failures: 0, Errors: 0, Skipped: 0, Time elapsed: 7.183 sec
Running org.apache.maven.surefire.its.IncludesExcludesIT
Tests run: 1, Failures: 0, Errors: 0, Skipped: 0, Time elapsed: 5.025 sec

Results :

Failed tests: 
  testSingleTestNonExistent(org.apache.maven.surefire.its.CheckSingleTestIT)

Tests run: 76, Failures: 1, Errors: 0, Skipped: 0

[INFO] 
[INFO] --- failsafe-maven-plugin:2.4.3-alpha-1:verify (default) @ surefire-integration-tests
---
[INFO] Failsafe report directory: C:\home\hudson\workspace\surefire\label\windows\trunk\surefire-integration-tests\target\failsafe-reports
[INFO] ------------------------------------------------------------------------
[INFO] Reactor Summary:
[INFO] 
[INFO] SureFire .......................................... SUCCESS [1:37.338s]
[INFO] SureFire API ...................................... SUCCESS [47.752s]
[INFO] SureFire Booter ................................... SUCCESS [7.842s]
[INFO] SureFire Providers ................................ SUCCESS [0.103s]
[INFO] SureFire JUnit Runner ............................. SUCCESS [1.068s]
[INFO] SureFire JUnit4 Runner ............................ SUCCESS [3.476s]
[INFO] SureFire JUnitCore Runner ......................... SUCCESS [6.946s]
[INFO] SureFire TestNG Runner ............................ SUCCESS [4.110s]
[INFO] Maven Surefire Plugin ............................. SUCCESS [2:27.343s]
[INFO] Maven Failsafe Plugin ............................. SUCCESS [17.048s]
[INFO] Maven Surefire Report Plugin ...................... SUCCESS [21.963s]
[INFO] Maven Surefire Integration Tests .................. FAILURE [11:06.378s]
[INFO] ------------------------------------------------------------------------
[INFO] BUILD FAILURE
[INFO] ------------------------------------------------------------------------
[INFO] Total time: 17:03.144s
[INFO] Finished at: Sat Jan 09 23:18:52 PST 2010
[INFO] Final Memory: 18M/36M
[INFO] ------------------------------------------------------------------------
[ERROR] Failed to execute goal org.codehaus.mojo:failsafe-maven-plugin:2.4.3-alpha-1:verify
(default) on project surefire-integration-tests: There are test failures.

Please refer to C:\home\hudson\workspace\surefire\label\windows\trunk\surefire-integration-tests\target\failsafe-reports
for the individual test results.
-> [Help 1]
org.apache.maven.lifecycle.LifecycleExecutionException: Failed to execute goal org.codehaus.mojo:failsafe-maven-plugin:2.4.3-alpha-1:verify
(default) on project surefire-integration-tests: There are test failures.

Please refer to C:\home\hudson\workspace\surefire\label\windows\trunk\surefire-integration-tests\target\failsafe-reports
for the individual test results.
	at org.apache.maven.lifecycle.DefaultLifecycleExecutor.execute(DefaultLifecycleExecutor.java:566)
	at org.apache.maven.lifecycle.DefaultLifecycleExecutor.execute(DefaultLifecycleExecutor.java:317)
	at org.apache.maven.DefaultMaven.doExecute(DefaultMaven.java:247)
	at org.apache.maven.DefaultMaven.execute(DefaultMaven.java:104)
	at org.apache.maven.cli.MavenCli.execute(MavenCli.java:423)
	at org.apache.maven.cli.MavenCli.doMain(MavenCli.java:158)
	at org.apache.maven.cli.MavenCli.main(MavenCli.java:123)
	at sun.reflect.NativeMethodAccessorImpl.invoke0(Native Method)
	at sun.reflect.NativeMethodAccessorImpl.invoke(NativeMethodAccessorImpl.java:39)
	at sun.reflect.DelegatingMethodAccessorImpl.invoke(DelegatingMethodAccessorImpl.java:25)
	at java.lang.reflect.Method.invoke(Method.java:597)
	at org.codehaus.plexus.classworlds.launcher.Launcher.launchEnhanced(Launcher.java:290)
	at org.codehaus.plexus.classworlds.launcher.Launcher.launch(Launcher.java:230)
	at org.codehaus.plexus.classworlds.launcher.Launcher.mainWithExitCode(Launcher.java:409)
	at org.codehaus.plexus.classworlds.launcher.Launcher.main(Launcher.java:352)
Caused by: org.apache.maven.plugin.MojoFailureException: There are test failures.

Please refer to C:\home\hudson\workspace\surefire\label\windows\trunk\surefire-integration-tests\target\failsafe-reports
for the individual test results.
	at org.codehaus.mojo.failsafe.VerifyMojo.execute(VerifyMojo.java:218)
	at org.apache.maven.plugin.DefaultBuildPluginManager.executeMojo(DefaultBuildPluginManager.java:105)
	at org.apache.maven.lifecycle.DefaultLifecycleExecutor.execute(DefaultLifecycleExecutor.java:562)
	... 14 more
[ERROR] 
[ERROR] Re-run Maven using the -X switch to enable full debug logging.
[ERROR] 
[ERROR] For more information about the errors and possible solutions, please read the following
articles:
[ERROR] [Help 1] http://cwiki.apache.org/confluence/display/MAVEN/MojoFailureException
[ERROR] 
[ERROR] After correcting the problems, you can resume the build with the command
[ERROR]   mvn <goals> -rf :surefire-integration-tests


Mime
View raw message