maven-notifications mailing list archives

Site index · List index
Message view « Date » · « Thread »
Top « Date » · « Thread »
From Hudson <Hud...@sonatype.org>
Subject Build failed in Hudson: maven-3.0.x-ITs » windows #163
Date Fri, 22 Jan 2010 17:58:16 GMT
See <http://grid.sonatype.org/ci/job/maven-3.0.x-ITs/./label=windows/163/>

------------------------------------------
[...truncated 685 lines...]

for artifact: 
  org.apache.maven.its.mng0507:test:pom:1.0

from the specified remote repositories:
  Nexus (http://repository.sonatype.org:8081/content/groups/sonatype-public-grid, releases=true,
snapshots=true)

	at org.apache.maven.lifecycle.DefaultLifecycleExecutor.resolveProjectDependencies(DefaultLifecycleExecutor.java:409)
	at org.apache.maven.lifecycle.DefaultLifecycleExecutor.execute(DefaultLifecycleExecutor.java:307)
	at org.apache.maven.DefaultMaven.doExecute(DefaultMaven.java:247)
	at org.apache.maven.DefaultMaven.execute(DefaultMaven.java:104)
	at org.apache.maven.cli.MavenCli.execute(MavenCli.java:427)
	at org.apache.maven.cli.MavenCli.doMain(MavenCli.java:157)
	at org.apache.maven.cli.MavenCli.main(MavenCli.java:121)
	at sun.reflect.NativeMethodAccessorImpl.invoke0(Native Method)
	at sun.reflect.NativeMethodAccessorImpl.invoke(NativeMethodAccessorImpl.java:39)
	at sun.reflect.DelegatingMethodAccessorImpl.invoke(DelegatingMethodAccessorImpl.java:25)
	at java.lang.reflect.Method.invoke(Method.java:597)
	at org.codehaus.plexus.classworlds.launcher.Launcher.launchEnhanced(Launcher.java:290)
	at org.codehaus.plexus.classworlds.launcher.Launcher.launch(Launcher.java:230)
	at org.codehaus.plexus.classworlds.launcher.Launcher.mainWithExitCode(Launcher.java:409)
	at org.codehaus.plexus.classworlds.launcher.Launcher.main(Launcher.java:352)
Caused by: org.apache.maven.artifact.resolver.MultipleArtifactsNotFoundException: Missing:
----------
1) org.apache.maven:maven-core-it-support-old-location:jar:1.1

  Try downloading the file manually from the project website.

  Then, install it using the command: 
      mvn install:install-file -DgroupId=org.apache.maven -DartifactId=maven-core-it-support-old-location
-Dversion=1.1 -Dpackaging=jar -Dfile=/path/to/file

  Alternatively, if you host your own repository you can deploy the file there: 
      mvn deploy:deploy-file -DgroupId=org.apache.maven -DartifactId=maven-core-it-support-old-location
-Dversion=1.1 -Dpackaging=jar -Dfile=/path/to/file -Durl=[url] -DrepositoryId=[id]

  Path to dependency: 
  	1) org.apache.maven.its.mng0507:test:pom:pom:1.0
  	2) org.apache.maven:maven-core-it-support-old-location:jar:1.1

----------
1 required artifact is missing.

for artifact: 
  org.apache.maven.its.mng0507:test:pom:1.0

from the specified remote repositories:
  Nexus (http://repository.sonatype.org:8081/content/groups/sonatype-public-grid, releases=true,
snapshots=true)

	at org.apache.maven.artifact.resolver.DefaultResolutionErrorHandler.throwErrors(DefaultResolutionErrorHandler.java:71)
	at org.apache.maven.DefaultProjectDependenciesResolver.resolve(DefaultProjectDependenciesResolver.java:156)
	at org.apache.maven.DefaultProjectDependenciesResolver.resolve(DefaultProjectDependenciesResolver.java:66)
	at org.apache.maven.lifecycle.DefaultLifecycleExecutor.resolveProjectDependencies(DefaultLifecycleExecutor.java:378)
	... 14 more
[ERROR] 
[ERROR] Re-run Maven using the -X switch to enable full debug logging.
[ERROR] 
[ERROR] For more information about the errors and possible solutions, please read the following
articles:
[ERROR] [Help 1] http://cwiki.apache.org/confluence/display/MAVEN/MultipleArtifactsNotFoundException
EMMA: locking coverage output file [C:\home\hudson\workspace\maven-3.0.x-ITs\label\windows\core-integration-tests\target\test-classes\mng-0507\coverage.ec]
...
EMMA: runtime coverage data merged into [C:\home\hudson\workspace\maven-3.0.x-ITs\label\windows\core-integration-tests\target\test-classes\mng-0507\coverage.ec]
{in 10 ms}

	at org.apache.maven.it.Verifier.executeGoals(Verifier.java:1326)
	at org.apache.maven.it.Verifier.executeGoal(Verifier.java:1164)
	at org.apache.maven.it.Verifier.executeGoal(Verifier.java:1158)
	at org.apache.maven.it.MavenITmng0507ArtifactRelocationTest.testitMNG507(MavenITmng0507ArtifactRelocationTest.java:57)
	at sun.reflect.NativeMethodAccessorImpl.invoke0(Native Method)
	at sun.reflect.NativeMethodAccessorImpl.invoke(NativeMethodAccessorImpl.java:39)
	at sun.reflect.DelegatingMethodAccessorImpl.invoke(DelegatingMethodAccessorImpl.java:25)
	at java.lang.reflect.Method.invoke(Method.java:597)
	at junit.framework.TestCase.runTest(TestCase.java:164)
	at org.apache.maven.it.AbstractMavenIntegrationTestCase.runTest(AbstractMavenIntegrationTestCase.java:198)
	at junit.framework.TestCase.runBare(TestCase.java:130)
	at junit.framework.TestResult$1.protect(TestResult.java:106)
	at junit.framework.TestResult.runProtected(TestResult.java:124)
	at junit.framework.TestResult.run(TestResult.java:109)
	at junit.framework.TestCase.run(TestCase.java:120)
	at junit.framework.TestSuite.runTest(TestSuite.java:230)
	at junit.framework.TestSuite.run(TestSuite.java:225)
	at junit.framework.TestSuite.runTest(TestSuite.java:230)
	at junit.framework.TestSuite.run(TestSuite.java:225)
	at sun.reflect.NativeMethodAccessorImpl.invoke0(Native Method)
	at sun.reflect.NativeMethodAccessorImpl.invoke(NativeMethodAccessorImpl.java:39)
	at sun.reflect.DelegatingMethodAccessorImpl.invoke(DelegatingMethodAccessorImpl.java:25)
	at java.lang.reflect.Method.invoke(Method.java:597)
	at org.apache.maven.surefire.junit.JUnitTestSet.execute(JUnitTestSet.java:213)
	at org.apache.maven.surefire.suite.AbstractDirectoryTestSuite.executeTestSet(AbstractDirectoryTestSuite.java:140)
	at org.apache.maven.surefire.suite.AbstractDirectoryTestSuite.execute(AbstractDirectoryTestSuite.java:127)
	at org.apache.maven.surefire.Surefire.run(Surefire.java:177)
	at sun.reflect.NativeMethodAccessorImpl.invoke0(Native Method)
	at sun.reflect.NativeMethodAccessorImpl.invoke(NativeMethodAccessorImpl.java:39)
	at sun.reflect.DelegatingMethodAccessorImpl.invoke(DelegatingMethodAccessorImpl.java:25)
	at java.lang.reflect.Method.invoke(Method.java:597)
	at org.apache.maven.surefire.booter.SurefireBooter.runSuitesInProcess(SurefireBooter.java:345)
	at org.apache.maven.surefire.booter.SurefireBooter.run(SurefireBooter.java:241)
	at org.apache.maven.plugin.surefire.SurefirePlugin.execute(SurefirePlugin.java:537)
	at org.apache.maven.plugin.DefaultBuildPluginManager.executeMojo(DefaultBuildPluginManager.java:105)
	at org.apache.maven.lifecycle.DefaultLifecycleExecutor.execute(DefaultLifecycleExecutor.java:562)
	at org.apache.maven.lifecycle.DefaultLifecycleExecutor.execute(DefaultLifecycleExecutor.java:317)
	at org.apache.maven.DefaultMaven.doExecute(DefaultMaven.java:247)
	at org.apache.maven.DefaultMaven.execute(DefaultMaven.java:104)
	at org.apache.maven.cli.MavenCli.execute(MavenCli.java:427)
	at org.apache.maven.cli.MavenCli.doMain(MavenCli.java:157)
	at org.apache.maven.cli.MavenCli.main(MavenCli.java:121)
	at sun.reflect.NativeMethodAccessorImpl.invoke0(Native Method)
	at sun.reflect.NativeMethodAccessorImpl.invoke(NativeMethodAccessorImpl.java:39)
	at sun.reflect.DelegatingMethodAccessorImpl.invoke(DelegatingMethodAccessorImpl.java:25)
	at java.lang.reflect.Method.invoke(Method.java:597)
	at org.codehaus.plexus.classworlds.launcher.Launcher.launchEnhanced(Launcher.java:290)
	at org.codehaus.plexus.classworlds.launcher.Launcher.launch(Launcher.java:230)
	at org.codehaus.plexus.classworlds.launcher.Launcher.mainWithExitCode(Launcher.java:409)
	at org.codehaus.plexus.classworlds.launcher.Launcher.main(Launcher.java:352)
Caused by: org.apache.maven.artifact.resolver.MultipleArtifactsNotFoundException: Missing:
----------
1) org.apache.maven:maven-core-it-support-old-location:jar:1.1

  Try downloading the file manually from the project website.

  Then, install it using the command: 
      mvn install:install-file -DgroupId=org.apache.maven -DartifactId=maven-core-it-support-old-location
-Dversion=1.1 -Dpackaging=jar -Dfile=/path/to/file

  Alternatively, if you host your own repository you can deploy the file there: 
      mvn deploy:deploy-file -DgroupId=org.apache.maven -DartifactId=maven-core-it-support-old-location
-Dversion=1.1 -Dpackaging=jar -Dfile=/path/to/file -Durl=[url] -DrepositoryId=[id]

  Path to dependency: 
  	1) org.apache.maven.its.mng0507:test:pom:pom:1.0
  	2) org.apache.maven:maven-core-it-support-old-location:jar:1.1

----------
1 required artifact is missing.

for artifact: 
  org.apache.maven.its.mng0507:test:pom:1.0

from the specified remote repositories:
  Nexus (http://repository.sonatype.org:8081/content/groups/sonatype-public-grid, releases=true,
snapshots=true)

	at org.apache.maven.artifact.resolver.DefaultResolutionErrorHandler.throwErrors(DefaultResolutionErrorHandler.java:71)
	at org.apache.maven.DefaultProjectDependenciesResolver.resolve(DefaultProjectDependenciesResolver.java:156)
	at org.apache.maven.DefaultProjectDependenciesResolver.resolve(DefaultProjectDependenciesResolver.java:66)
	at org.apache.maven.lifecycle.DefaultLifecycleExecutor.resolveProjectDependencies(DefaultLifecycleExecutor.java:378)
	... 14 more
[ERROR] 
[ERROR] Re-run Maven using the -X switch to enable full debug logging.
[ERROR] 
[ERROR] For more information about the errors and possible solutions, please read the following
articles:
[ERROR] [Help 1] http://cwiki.apache.org/confluence/display/MAVEN/MultipleArtifactsNotFoundException
EMMA: locking coverage output file [C:\home\hudson\workspace\maven-3.0.x-ITs\label\windows\core-integration-tests\target\test-classes\mng-0507\coverage.ec]
...
EMMA: runtime coverage data merged into [C:\home\hudson\workspace\maven-3.0.x-ITs\label\windows\core-integration-tests\target\test-classes\mng-0507\coverage.ec]
{in 10 ms}

	at org.apache.maven.it.Verifier.executeGoals(Verifier.java:1326)
	at org.apache.maven.it.Verifier.executeGoal(Verifier.java:1164)
	at org.apache.maven.it.Verifier.executeGoal(Verifier.java:1158)
	at org.apache.maven.it.MavenITmng0507ArtifactRelocationTest.testitMNG507(MavenITmng0507ArtifactRelocationTest.java:57)
	at sun.reflect.NativeMethodAccessorImpl.invoke0(Native Method)
	at sun.reflect.NativeMethodAccessorImpl.invoke(NativeMethodAccessorImpl.java:39)
	at sun.reflect.DelegatingMethodAccessorImpl.invoke(DelegatingMethodAccessorImpl.java:25)
	at java.lang.reflect.Method.invoke(Method.java:597)
	at junit.framework.TestCase.runTest(TestCase.java:164)
	at org.apache.maven.it.AbstractMavenIntegrationTestCase.runTest(AbstractMavenIntegrationTestCase.java:198)
	at junit.framework.TestCase.runBare(TestCase.java:130)
	at junit.framework.TestResult$1.protect(TestResult.java:106)
	at junit.framework.TestResult.runProtected(TestResult.java:124)
	at junit.framework.TestResult.run(TestResult.java:109)
	at junit.framework.TestCase.run(TestCase.java:120)
	at junit.framework.TestSuite.runTest(TestSuite.java:230)
	at junit.framework.TestSuite.run(TestSuite.java:225)
	at junit.framework.TestSuite.runTest(TestSuite.java:230)
	at junit.framework.TestSuite.run(TestSuite.java:225)
	at sun.reflect.NativeMethodAccessorImpl.invoke0(Native Method)
	at sun.reflect.NativeMethodAccessorImpl.invoke(NativeMethodAccessorImpl.java:39)
	at sun.reflect.DelegatingMethodAccessorImpl.invoke(DelegatingMethodAccessorImpl.java:25)
	at java.lang.reflect.Method.invoke(Method.java:597)
	at org.apache.maven.surefire.junit.JUnitTestSet.execute(JUnitTestSet.java:213)
	at org.apache.maven.surefire.suite.AbstractDirectoryTestSuite.executeTestSet(AbstractDirectoryTestSuite.java:140)
	at org.apache.maven.surefire.suite.AbstractDirectoryTestSuite.execute(AbstractDirectoryTestSuite.java:127)
	at org.apache.maven.surefire.Surefire.run(Surefire.java:177)
	at sun.reflect.NativeMethodAccessorImpl.invoke0(Native Method)
	at sun.reflect.NativeMethodAccessorImpl.invoke(NativeMethodAccessorImpl.java:39)
	at sun.reflect.DelegatingMethodAccessorImpl.invoke(DelegatingMethodAccessorImpl.java:25)
	at java.lang.reflect.Method.invoke(Method.java:597)
	at org.apache.maven.surefire.booter.SurefireBooter.runSuitesInProcess(SurefireBooter.java:345)
	at org.apache.maven.surefire.booter.SurefireBooter.run(SurefireBooter.java:241)
	at org.apache.maven.plugin.surefire.SurefirePlugin.execute(SurefirePlugin.java:537)
	at org.apache.maven.plugin.DefaultBuildPluginManager.executeMojo(DefaultBuildPluginManager.java:105)
	at org.apache.maven.lifecycle.DefaultLifecycleExecutor.execute(DefaultLifecycleExecutor.java:562)
	at org.apache.maven.lifecycle.DefaultLifecycleExecutor.execute(DefaultLifecycleExecutor.java:317)
	at org.apache.maven.DefaultMaven.doExecute(DefaultMaven.java:247)
	at org.apache.maven.DefaultMaven.execute(DefaultMaven.java:104)
	at org.apache.maven.cli.MavenCli.execute(MavenCli.java:427)
	at org.apache.maven.cli.MavenCli.doMain(MavenCli.java:157)
	at org.apache.maven.cli.MavenCli.main(MavenCli.java:121)
	at sun.reflect.NativeMethodAccessorImpl.invoke0(Native Method)
	at sun.reflect.NativeMethodAccessorImpl.invoke(NativeMethodAccessorImpl.java:39)
	at sun.reflect.DelegatingMethodAccessorImpl.invoke(DelegatingMethodAccessorImpl.java:25)
	at java.lang.reflect.Method.invoke(Method.java:597)
	at org.codehaus.plexus.classworlds.launcher.Launcher.launchEnhanced(Launcher.java:290)
	at org.codehaus.plexus.classworlds.launcher.Launcher.launch(Launcher.java:230)
	at org.codehaus.plexus.classworlds.launcher.Launcher.mainWithExitCode(Launcher.java:409)
	at org.codehaus.plexus.classworlds.launcher.Launcher.main(Launcher.java:352)


Results :

Tests in error: 
  testitMNG507(org.apache.maven.it.MavenITmng0507ArtifactRelocationTest)

Tests run: 543, Failures: 0, Errors: 1, Skipped: 0

[INFO] ------------------------------------------------------------------------
[INFO] BUILD FAILURE
[INFO] ------------------------------------------------------------------------
[INFO] Total time: 26:07.545s
[INFO] Finished at: Fri Jan 22 09:58:06 PST 2010
[INFO] Final Memory: 7M/25M
[INFO] ------------------------------------------------------------------------
[ERROR] Failed to execute goal org.apache.maven.plugins:maven-surefire-plugin:2.4.3:test (default-test)
on project core-it-suite: There are test failures.

Please refer to C:\home\hudson\workspace\maven-3.0.x-ITs\label\windows\core-integration-tests\target\surefire-reports
for the individual test results.
-> [Help 1]
org.apache.maven.lifecycle.LifecycleExecutionException: Failed to execute goal org.apache.maven.plugins:maven-surefire-plugin:2.4.3:test
(default-test) on project core-it-suite: There are test failures.

Please refer to C:\home\hudson\workspace\maven-3.0.x-ITs\label\windows\core-integration-tests\target\surefire-reports
for the individual test results.
	at org.apache.maven.lifecycle.DefaultLifecycleExecutor.execute(DefaultLifecycleExecutor.java:566)
	at org.apache.maven.lifecycle.DefaultLifecycleExecutor.execute(DefaultLifecycleExecutor.java:317)
	at org.apache.maven.DefaultMaven.doExecute(DefaultMaven.java:247)
	at org.apache.maven.DefaultMaven.execute(DefaultMaven.java:104)
	at org.apache.maven.cli.MavenCli.execute(MavenCli.java:427)
	at org.apache.maven.cli.MavenCli.doMain(MavenCli.java:157)
	at org.apache.maven.cli.MavenCli.main(MavenCli.java:121)
	at sun.reflect.NativeMethodAccessorImpl.invoke0(Native Method)
	at sun.reflect.NativeMethodAccessorImpl.invoke(NativeMethodAccessorImpl.java:39)
	at sun.reflect.DelegatingMethodAccessorImpl.invoke(DelegatingMethodAccessorImpl.java:25)
	at java.lang.reflect.Method.invoke(Method.java:597)
	at org.codehaus.plexus.classworlds.launcher.Launcher.launchEnhanced(Launcher.java:290)
	at org.codehaus.plexus.classworlds.launcher.Launcher.launch(Launcher.java:230)
	at org.codehaus.plexus.classworlds.launcher.Launcher.mainWithExitCode(Launcher.java:409)
	at org.codehaus.plexus.classworlds.launcher.Launcher.main(Launcher.java:352)
Caused by: org.apache.maven.plugin.MojoFailureException: There are test failures.

Please refer to C:\home\hudson\workspace\maven-3.0.x-ITs\label\windows\core-integration-tests\target\surefire-reports
for the individual test results.
	at org.apache.maven.plugin.surefire.SurefirePlugin.execute(SurefirePlugin.java:575)
	at org.apache.maven.plugin.DefaultBuildPluginManager.executeMojo(DefaultBuildPluginManager.java:105)
	at org.apache.maven.lifecycle.DefaultLifecycleExecutor.execute(DefaultLifecycleExecutor.java:562)
	... 14 more
[ERROR] 
[ERROR] Re-run Maven using the -X switch to enable full debug logging.
[ERROR] 
[ERROR] For more information about the errors and possible solutions, please read the following
articles:
[ERROR] [Help 1] http://cwiki.apache.org/confluence/display/MAVEN/MojoFailureException
Recording Emma reports core-integration-tests/target/site/emma/coverage.xml


Mime
View raw message