maven-notifications mailing list archives

Site index · List index
Message view « Date » · « Thread »
Top « Date » · « Thread »
From Hudson <Hud...@sonatype.org>
Subject Build failed in Hudson: maven-3.0.x-ITs » 1.5,windows #179
Date Mon, 15 Feb 2010 00:04:59 GMT
See <http://grid.sonatype.org/ci/job/maven-3.0.x-ITs/./jdk=1.5,label=windows/179/changes>

Changes:

[Benjamin Bentmann] o Added profile to run ITs using embedded Maven

[Benjamin Bentmann] [MNG-4528] [regression] mvn deploy ignores proxy settings

o Added IT

[Benjamin Bentmann] o Worked around connection/proxy caching by Sun's HTTP client when ITs
run in embedded mode

[Benjamin Bentmann] o Strengthened IT

[Benjamin Bentmann] o Strengthened IT

------------------------------------------
[...truncated 769 lines...]
0090EnvVarInterpolation(it0090).............................FAILURE (0.4 s)
Exit code: 1
0087PluginRealmWithProjectLevelDeps(it0087).................OK (1.8 s)
0086PluginRealm(it0086).....................................OK (0.7 s)
0085TransitiveSystemScope(it0085)...........................OK (0.5 s)
0072InterpolationWithDottedProperty(it0072).................OK (0.4 s)
0071PluginConfigWithDottedProperty(it0071)..................OK (0.5 s)
0064MojoConfigViaSetters(it0064)............................OK (4.5 s)
0063SystemScopeDependency(it0063)...........................OK (0.5 s)
0056MultipleGoalExecutions(it0056)..........................OK (0.4 s)
0052ReleaseProfile(it0052)..................................OK (2.0 s)
0051ReleaseProfile(it0051)..................................OK (6.5 s)
0041ArtifactTypeFromPluginExtension(it0041).................OK (1.4 s)
0040PackagingFromPluginExtension(it0040)....................OK (0.6 s)
0039ReleasePomInReactor(it0039).............................SKIPPED - version 3.0-SNAPSHOT
not in range [2.0,3.0-alpha-1)
0038AlternatePomFileDifferentDir(it0038)....................OK (0.5 s)
0037AlternatePomFileSameDir(it0037).........................OK (0.5 s)
0036ReleasePom(it0036)......................................SKIPPED - version 3.0-SNAPSHOT
not in range (2.0,3.0-alpha-1)
0032MavenPrerequisite(it0032)...............................OK (0.5 s)
0030DepPomDepMngtInheritance(it0030)........................OK (3.2 s)
0025MultipleExecutionLevelConfigs(it0025)...................OK (0.5 s)
0024MultipleGoalExecutions(it0024)..........................OK (0.6 s)
0023SettingsProfile(it0023).................................OK (0.5 s)
0021PomProfile(it0021)......................................OK (0.8 s)
0019PluginVersionMngtBySuperPom(it0019).....................OK (0.6 s)
0018DependencyManagement(it0018)............................OK (0.7 s)
0012PomInterpolation(it0012)................................OK (0.7 s)
0011DefaultVersionByDependencyManagement(it0011)............OK (0.7 s)
0010DependencyClosureResolution(it0010).....................OK (0.5 s)
0009GoalConfiguration(it0009)...............................OK (0.5 s)
0008SimplePlugin(it0008)....................................OK (1.0 s)
Tests run: 553, Failures: 0, Errors: 4, Skipped: 0, Time elapsed: 651.417 sec <<<
FAILURE!
testit(org.apache.maven.it.MavenITmng4379TransitiveSystemPathInterpolatedWithEnvVarTest) 
Time elapsed: 0.43 sec  <<< ERROR!
org.apache.maven.it.VerificationException: Exit code was non-zero: 1; command line and log
= 
C:\home\hudson\workspace\maven-3.0.x-ITs\jdk\1.5\label\windows\core-integration-tests\target\distro\bin\mvn
-s settings.xml -e --batch-mode -Dmaven.repo.local=C:\opt\repos\local-repository validate
EMMA: collecting runtime coverage data ...
java.net.BindException: Address already in use: JVM_Bind
	at java.net.PlainSocketImpl.socketBind(Native Method)
	at java.net.PlainSocketImpl.bind(PlainSocketImpl.java:359)
	at java.net.ServerSocket.bind(ServerSocket.java:319)
	at java.net.ServerSocket.<init>(ServerSocket.java:185)
	at java.net.ServerSocket.<init>(ServerSocket.java:97)
	at com.vladium.emma.rt.RTController.start(RTController.java:99)
	at com.vladium.emma.rt.RT.reset(RT.java:222)
	at com.vladium.emma.rt.RT.<clinit>(RT.java:540)
	at org.apache.maven.cli.MavenCli.$VRi(MavenCli.java)
	at org.apache.maven.cli.MavenCli.<clinit>(MavenCli.java)
	at sun.reflect.NativeMethodAccessorImpl.invoke0(Native Method)
	at sun.reflect.NativeMethodAccessorImpl.invoke(NativeMethodAccessorImpl.java:39)
	at sun.reflect.DelegatingMethodAccessorImpl.invoke(DelegatingMethodAccessorImpl.java:25)
	at java.lang.reflect.Method.invoke(Method.java:585)
	at org.codehaus.plexus.classworlds.launcher.Launcher.launchEnhanced(Launcher.java:290)
	at org.codehaus.plexus.classworlds.launcher.Launcher.launch(Launcher.java:230)
	at org.codehaus.plexus.classworlds.launcher.Launcher.mainWithExitCode(Launcher.java:409)
	at org.codehaus.plexus.classworlds.launcher.Launcher.main(Launcher.java:352)
Exception in thread "main" java.lang.Error: EMMA: runtime controller could not be started,
aborting
	at com.vladium.emma.rt.RT.reset(RT.java:233)
	at com.vladium.emma.rt.RT.<clinit>(RT.java:540)
	at org.apache.maven.cli.MavenCli.$VRi(MavenCli.java)
	at org.apache.maven.cli.MavenCli.<clinit>(MavenCli.java)
	at sun.reflect.NativeMethodAccessorImpl.invoke0(Native Method)
	at sun.reflect.NativeMethodAccessorImpl.invoke(NativeMethodAccessorImpl.java:39)
	at sun.reflect.DelegatingMethodAccessorImpl.invoke(DelegatingMethodAccessorImpl.java:25)
	at java.lang.reflect.Method.invoke(Method.java:585)
	at org.codehaus.plexus.classworlds.launcher.Launcher.launchEnhanced(Launcher.java:290)
	at org.codehaus.plexus.classworlds.launcher.Launcher.launch(Launcher.java:230)
	at org.codehaus.plexus.classworlds.launcher.Launcher.mainWithExitCode(Launcher.java:409)
	at org.codehaus.plexus.classworlds.launcher.Launcher.main(Launcher.java:352)

	at org.apache.maven.it.Verifier.executeGoals(Verifier.java:1326)
	at org.apache.maven.it.Verifier.executeGoal(Verifier.java:1164)
	at org.apache.maven.it.MavenITmng4379TransitiveSystemPathInterpolatedWithEnvVarTest.testit(MavenITmng4379TransitiveSystemPathInterpolatedWithEnvVarTest.java:59)

testitMNG3940(org.apache.maven.it.MavenITmng3940EnvVarInterpolationTest)  Time elapsed: 0.448
sec  <<< ERROR!
org.apache.maven.it.VerificationException: Exit code was non-zero: 1; command line and log
= 
C:\home\hudson\workspace\maven-3.0.x-ITs\jdk\1.5\label\windows\core-integration-tests\target\distro\bin\mvn
-e --batch-mode -Dmaven.repo.local=C:\opt\repos\local-repository validate
EMMA: collecting runtime coverage data ...
java.net.BindException: Address already in use: JVM_Bind
	at java.net.PlainSocketImpl.socketBind(Native Method)
	at java.net.PlainSocketImpl.bind(PlainSocketImpl.java:359)
	at java.net.ServerSocket.bind(ServerSocket.java:319)
	at java.net.ServerSocket.<init>(ServerSocket.java:185)
	at java.net.ServerSocket.<init>(ServerSocket.java:97)
	at com.vladium.emma.rt.RTController.start(RTController.java:99)
	at com.vladium.emma.rt.RT.reset(RT.java:222)
	at com.vladium.emma.rt.RT.<clinit>(RT.java:540)
	at org.apache.maven.cli.MavenCli.$VRi(MavenCli.java)
	at org.apache.maven.cli.MavenCli.<clinit>(MavenCli.java)
	at sun.reflect.NativeMethodAccessorImpl.invoke0(Native Method)
	at sun.reflect.NativeMethodAccessorImpl.invoke(NativeMethodAccessorImpl.java:39)
	at sun.reflect.DelegatingMethodAccessorImpl.invoke(DelegatingMethodAccessorImpl.java:25)
	at java.lang.reflect.Method.invoke(Method.java:585)
	at org.codehaus.plexus.classworlds.launcher.Launcher.launchEnhanced(Launcher.java:290)
	at org.codehaus.plexus.classworlds.launcher.Launcher.launch(Launcher.java:230)
	at org.codehaus.plexus.classworlds.launcher.Launcher.mainWithExitCode(Launcher.java:409)
	at org.codehaus.plexus.classworlds.launcher.Launcher.main(Launcher.java:352)
Exception in thread "main" java.lang.Error: EMMA: runtime controller could not be started,
aborting
	at com.vladium.emma.rt.RT.reset(RT.java:233)
	at com.vladium.emma.rt.RT.<clinit>(RT.java:540)
	at org.apache.maven.cli.MavenCli.$VRi(MavenCli.java)
	at org.apache.maven.cli.MavenCli.<clinit>(MavenCli.java)
	at sun.reflect.NativeMethodAccessorImpl.invoke0(Native Method)
	at sun.reflect.NativeMethodAccessorImpl.invoke(NativeMethodAccessorImpl.java:39)
	at sun.reflect.DelegatingMethodAccessorImpl.invoke(DelegatingMethodAccessorImpl.java:25)
	at java.lang.reflect.Method.invoke(Method.java:585)
	at org.codehaus.plexus.classworlds.launcher.Launcher.launchEnhanced(Launcher.java:290)
	at org.codehaus.plexus.classworlds.launcher.Launcher.launch(Launcher.java:230)
	at org.codehaus.plexus.classworlds.launcher.Launcher.mainWithExitCode(Launcher.java:409)
	at org.codehaus.plexus.classworlds.launcher.Launcher.main(Launcher.java:352)

	at org.apache.maven.it.Verifier.executeGoals(Verifier.java:1326)
	at org.apache.maven.it.Verifier.executeGoal(Verifier.java:1164)
	at org.apache.maven.it.MavenITmng3940EnvVarInterpolationTest.testitMNG3940(MavenITmng3940EnvVarInterpolationTest.java:72)

testitRelocation(org.apache.maven.it.MavenITmng0553SettingsAuthzEncryptionTest)  Time elapsed:
0.502 sec  <<< ERROR!
org.apache.maven.it.VerificationException: Exit code was non-zero: 1; command line and log
= 
C:\home\hudson\workspace\maven-3.0.x-ITs\jdk\1.5\label\windows\core-integration-tests\target\distro\bin\mvn
--settings settings.xml -e --batch-mode -Dsettings.security=C:\home\hudson\workspace\maven-3.0.x-ITs\jdk\1.5\label\windows\core-integration-tests\target\test-classes\mng-0553\test-2\settings~security.xml
-Dmaven.repo.local=C:\opt\repos\local-repository validate
EMMA: collecting runtime coverage data ...
java.net.BindException: Address already in use: JVM_Bind
	at java.net.PlainSocketImpl.socketBind(Native Method)
	at java.net.PlainSocketImpl.bind(PlainSocketImpl.java:359)
	at java.net.ServerSocket.bind(ServerSocket.java:319)
	at java.net.ServerSocket.<init>(ServerSocket.java:185)
	at java.net.ServerSocket.<init>(ServerSocket.java:97)
	at com.vladium.emma.rt.RTController.start(RTController.java:99)
	at com.vladium.emma.rt.RT.reset(RT.java:222)
	at com.vladium.emma.rt.RT.<clinit>(RT.java:540)
	at org.apache.maven.cli.MavenCli.$VRi(MavenCli.java)
	at org.apache.maven.cli.MavenCli.<clinit>(MavenCli.java)
	at sun.reflect.NativeMethodAccessorImpl.invoke0(Native Method)
	at sun.reflect.NativeMethodAccessorImpl.invoke(NativeMethodAccessorImpl.java:39)
	at sun.reflect.DelegatingMethodAccessorImpl.invoke(DelegatingMethodAccessorImpl.java:25)
	at java.lang.reflect.Method.invoke(Method.java:585)
	at org.codehaus.plexus.classworlds.launcher.Launcher.launchEnhanced(Launcher.java:290)
	at org.codehaus.plexus.classworlds.launcher.Launcher.launch(Launcher.java:230)
	at org.codehaus.plexus.classworlds.launcher.Launcher.mainWithExitCode(Launcher.java:409)
	at org.codehaus.plexus.classworlds.launcher.Launcher.main(Launcher.java:352)
Exception in thread "main" java.lang.Error: EMMA: runtime controller could not be started,
aborting
	at com.vladium.emma.rt.RT.reset(RT.java:233)
	at com.vladium.emma.rt.RT.<clinit>(RT.java:540)
	at org.apache.maven.cli.MavenCli.$VRi(MavenCli.java)
	at org.apache.maven.cli.MavenCli.<clinit>(MavenCli.java)
	at sun.reflect.NativeMethodAccessorImpl.invoke0(Native Method)
	at sun.reflect.NativeMethodAccessorImpl.invoke(NativeMethodAccessorImpl.java:39)
	at sun.reflect.DelegatingMethodAccessorImpl.invoke(DelegatingMethodAccessorImpl.java:25)
	at java.lang.reflect.Method.invoke(Method.java:585)
	at org.codehaus.plexus.classworlds.launcher.Launcher.launchEnhanced(Launcher.java:290)
	at org.codehaus.plexus.classworlds.launcher.Launcher.launch(Launcher.java:230)
	at org.codehaus.plexus.classworlds.launcher.Launcher.mainWithExitCode(Launcher.java:409)
	at org.codehaus.plexus.classworlds.launcher.Launcher.main(Launcher.java:352)

	at org.apache.maven.it.Verifier.executeGoals(Verifier.java:1326)
	at org.apache.maven.it.Verifier.executeGoal(Verifier.java:1164)
	at org.apache.maven.it.MavenITmng0553SettingsAuthzEncryptionTest.testitRelocation(MavenITmng0553SettingsAuthzEncryptionTest.java:167)

testit0090(org.apache.maven.it.MavenIT0090EnvVarInterpolationTest)  Time elapsed: 0.389 sec
 <<< ERROR!
org.apache.maven.it.VerificationException: Exit code was non-zero: 1; command line and log
= 
C:\home\hudson\workspace\maven-3.0.x-ITs\jdk\1.5\label\windows\core-integration-tests\target\distro\bin\mvn
-e --batch-mode -Dmaven.repo.local=C:\opt\repos\local-repository validate
EMMA: collecting runtime coverage data ...
java.net.BindException: Address already in use: JVM_Bind
	at java.net.PlainSocketImpl.socketBind(Native Method)
	at java.net.PlainSocketImpl.bind(PlainSocketImpl.java:359)
	at java.net.ServerSocket.bind(ServerSocket.java:319)
	at java.net.ServerSocket.<init>(ServerSocket.java:185)
	at java.net.ServerSocket.<init>(ServerSocket.java:97)
	at com.vladium.emma.rt.RTController.start(RTController.java:99)
	at com.vladium.emma.rt.RT.reset(RT.java:222)
	at com.vladium.emma.rt.RT.<clinit>(RT.java:540)
	at org.apache.maven.cli.MavenCli.$VRi(MavenCli.java)
	at org.apache.maven.cli.MavenCli.<clinit>(MavenCli.java)
	at sun.reflect.NativeMethodAccessorImpl.invoke0(Native Method)
	at sun.reflect.NativeMethodAccessorImpl.invoke(NativeMethodAccessorImpl.java:39)
	at sun.reflect.DelegatingMethodAccessorImpl.invoke(DelegatingMethodAccessorImpl.java:25)
	at java.lang.reflect.Method.invoke(Method.java:585)
	at org.codehaus.plexus.classworlds.launcher.Launcher.launchEnhanced(Launcher.java:290)
	at org.codehaus.plexus.classworlds.launcher.Launcher.launch(Launcher.java:230)
	at org.codehaus.plexus.classworlds.launcher.Launcher.mainWithExitCode(Launcher.java:409)
	at org.codehaus.plexus.classworlds.launcher.Launcher.main(Launcher.java:352)
Exception in thread "main" java.lang.Error: EMMA: runtime controller could not be started,
aborting
	at com.vladium.emma.rt.RT.reset(RT.java:233)
	at com.vladium.emma.rt.RT.<clinit>(RT.java:540)
	at org.apache.maven.cli.MavenCli.$VRi(MavenCli.java)
	at org.apache.maven.cli.MavenCli.<clinit>(MavenCli.java)
	at sun.reflect.NativeMethodAccessorImpl.invoke0(Native Method)
	at sun.reflect.NativeMethodAccessorImpl.invoke(NativeMethodAccessorImpl.java:39)
	at sun.reflect.DelegatingMethodAccessorImpl.invoke(DelegatingMethodAccessorImpl.java:25)
	at java.lang.reflect.Method.invoke(Method.java:585)
	at org.codehaus.plexus.classworlds.launcher.Launcher.launchEnhanced(Launcher.java:290)
	at org.codehaus.plexus.classworlds.launcher.Launcher.launch(Launcher.java:230)
	at org.codehaus.plexus.classworlds.launcher.Launcher.mainWithExitCode(Launcher.java:409)
	at org.codehaus.plexus.classworlds.launcher.Launcher.main(Launcher.java:352)

	at org.apache.maven.it.Verifier.executeGoals(Verifier.java:1326)
	at org.apache.maven.it.Verifier.executeGoal(Verifier.java:1164)
	at org.apache.maven.it.MavenIT0090EnvVarInterpolationTest.testit0090(MavenIT0090EnvVarInterpolationTest.java:52)


Results :

Tests in error: 
  testit(org.apache.maven.it.MavenITmng4379TransitiveSystemPathInterpolatedWithEnvVarTest)
  testitMNG3940(org.apache.maven.it.MavenITmng3940EnvVarInterpolationTest)
  testitRelocation(org.apache.maven.it.MavenITmng0553SettingsAuthzEncryptionTest)
  testit0090(org.apache.maven.it.MavenIT0090EnvVarInterpolationTest)

Tests run: 553, Failures: 0, Errors: 4, Skipped: 0

[INFO] ------------------------------------------------------------------------
[INFO] BUILD FAILURE
[INFO] ------------------------------------------------------------------------
[INFO] Total time: 14:36.622s
[INFO] Finished at: Sun Feb 14 16:04:17 PST 2010
[INFO] Final Memory: 6M/23M
[INFO] ------------------------------------------------------------------------
[ERROR] Failed to execute goal org.apache.maven.plugins:maven-surefire-plugin:2.4.3:test (default-test)
on project core-it-suite: There are test failures.

Please refer to C:\home\hudson\workspace\maven-3.0.x-ITs\jdk\1.5\label\windows\core-integration-tests\target\surefire-reports
for the individual test results.
-> [Help 1]
org.apache.maven.lifecycle.LifecycleExecutionException: Failed to execute goal org.apache.maven.plugins:maven-surefire-plugin:2.4.3:test
(default-test) on project core-it-suite: There are test failures.

Please refer to C:\home\hudson\workspace\maven-3.0.x-ITs\jdk\1.5\label\windows\core-integration-tests\target\surefire-reports
for the individual test results.
	at org.apache.maven.lifecycle.DefaultLifecycleExecutor.execute(DefaultLifecycleExecutor.java:581)
	at org.apache.maven.lifecycle.DefaultLifecycleExecutor.execute(DefaultLifecycleExecutor.java:324)
	at org.apache.maven.DefaultMaven.doExecute(DefaultMaven.java:247)
	at org.apache.maven.DefaultMaven.execute(DefaultMaven.java:104)
	at org.apache.maven.cli.MavenCli.execute(MavenCli.java:427)
	at org.apache.maven.cli.MavenCli.doMain(MavenCli.java:157)
	at org.apache.maven.cli.MavenCli.main(MavenCli.java:121)
	at sun.reflect.NativeMethodAccessorImpl.invoke0(Native Method)
	at sun.reflect.NativeMethodAccessorImpl.invoke(NativeMethodAccessorImpl.java:39)
	at sun.reflect.DelegatingMethodAccessorImpl.invoke(DelegatingMethodAccessorImpl.java:25)
	at java.lang.reflect.Method.invoke(Method.java:585)
	at org.codehaus.plexus.classworlds.launcher.Launcher.launchEnhanced(Launcher.java:290)
	at org.codehaus.plexus.classworlds.launcher.Launcher.launch(Launcher.java:230)
	at org.codehaus.plexus.classworlds.launcher.Launcher.mainWithExitCode(Launcher.java:409)
	at org.codehaus.plexus.classworlds.launcher.Launcher.main(Launcher.java:352)
Caused by: org.apache.maven.plugin.MojoFailureException: There are test failures.

Please refer to C:\home\hudson\workspace\maven-3.0.x-ITs\jdk\1.5\label\windows\core-integration-tests\target\surefire-reports
for the individual test results.
	at org.apache.maven.plugin.surefire.SurefirePlugin.execute(SurefirePlugin.java:575)
	at org.apache.maven.plugin.DefaultBuildPluginManager.executeMojo(DefaultBuildPluginManager.java:105)
	at org.apache.maven.lifecycle.DefaultLifecycleExecutor.execute(DefaultLifecycleExecutor.java:577)
	... 14 more
[ERROR] 
[ERROR] Re-run Maven using the -X switch to enable full debug logging.
[ERROR] 
[ERROR] For more information about the errors and possible solutions, please read the following
articles:
[ERROR] [Help 1] http://cwiki.apache.org/confluence/display/MAVEN/MojoFailureException
Recording Emma reports core-integration-tests/target/site/emma/coverage.xml


Mime
View raw message