maven-notifications mailing list archives

Site index · List index
Message view « Date » · « Thread »
Top « Date » · « Thread »
From Hudson <Hud...@sonatype.org>
Subject Build failed in Hudson: maven-3.0.x-ITs » 1.5,ubuntu #179
Date Mon, 15 Feb 2010 00:05:46 GMT
See <http://grid.sonatype.org/ci/job/maven-3.0.x-ITs/./jdk=1.5,label=ubuntu/179/changes>

Changes:

[Benjamin Bentmann] o Added profile to run ITs using embedded Maven

[Benjamin Bentmann] [MNG-4528] [regression] mvn deploy ignores proxy settings

o Added IT

[Benjamin Bentmann] o Worked around connection/proxy caching by Sun's HTTP client when ITs
run in embedded mode

[Benjamin Bentmann] o Strengthened IT

[Benjamin Bentmann] o Strengthened IT

------------------------------------------
[...truncated 897 lines...]
[ERROR] [Help 1] http://cwiki.apache.org/confluence/display/MAVEN/InternalErrorException
	at org.apache.maven.it.Verifier.executeGoals(Verifier.java:1326)
	at org.apache.maven.it.Verifier.executeGoal(Verifier.java:1164)
	at org.apache.maven.it.Verifier.executeGoal(Verifier.java:1158)
	at org.apache.maven.it.MavenITmng4482ForcePluginSnapshotUpdateTest.testit(MavenITmng4482ForcePluginSnapshotUpdateTest.java:75)
	at sun.reflect.NativeMethodAccessorImpl.invoke0(Native Method)
	at sun.reflect.NativeMethodAccessorImpl.invoke(NativeMethodAccessorImpl.java:39)
	at sun.reflect.DelegatingMethodAccessorImpl.invoke(DelegatingMethodAccessorImpl.java:25)
	at java.lang.reflect.Method.invoke(Method.java:585)
	at junit.framework.TestCase.runTest(TestCase.java:164)
	at org.apache.maven.it.AbstractMavenIntegrationTestCase.runTest(AbstractMavenIntegrationTestCase.java:198)
	at junit.framework.TestCase.runBare(TestCase.java:130)
	at junit.framework.TestResult$1.protect(TestResult.java:106)
	at junit.framework.TestResult.runProtected(TestResult.java:124)
	at junit.framework.TestResult.run(TestResult.java:109)
	at junit.framework.TestCase.run(TestCase.java:120)
	at junit.framework.TestSuite.runTest(TestSuite.java:230)
	at junit.framework.TestSuite.run(TestSuite.java:225)
	at junit.framework.TestSuite.runTest(TestSuite.java:230)
	at junit.framework.TestSuite.run(TestSuite.java:225)
	at sun.reflect.NativeMethodAccessorImpl.invoke0(Native Method)
	at sun.reflect.NativeMethodAccessorImpl.invoke(NativeMethodAccessorImpl.java:39)
	at sun.reflect.DelegatingMethodAccessorImpl.invoke(DelegatingMethodAccessorImpl.java:25)
	at java.lang.reflect.Method.invoke(Method.java:585)
	at org.apache.maven.surefire.junit.JUnitTestSet.execute(JUnitTestSet.java:213)
	at org.apache.maven.surefire.suite.AbstractDirectoryTestSuite.executeTestSet(AbstractDirectoryTestSuite.java:140)
	at org.apache.maven.surefire.suite.AbstractDirectoryTestSuite.execute(AbstractDirectoryTestSuite.java:127)
	at org.apache.maven.surefire.Surefire.run(Surefire.java:177)
	at sun.reflect.NativeMethodAccessorImpl.invoke0(Native Method)
	at sun.reflect.NativeMethodAccessorImpl.invoke(NativeMethodAccessorImpl.java:39)
	at sun.reflect.DelegatingMethodAccessorImpl.invoke(DelegatingMethodAccessorImpl.java:25)
	at java.lang.reflect.Method.invoke(Method.java:585)
	at org.apache.maven.surefire.booter.SurefireBooter.runSuitesInProcess(SurefireBooter.java:345)
	at org.apache.maven.surefire.booter.SurefireBooter.main(SurefireBooter.java:1009)

testit(org.apache.maven.it.MavenITmng4379TransitiveSystemPathInterpolatedWithEnvVarTest) 
Time elapsed: 0.441 sec  <<< ERROR!
org.apache.maven.it.VerificationException: Exit code was non-zero: 1; command line and log
= 
/home/hudson/workspace/maven-3.0.x-ITs/jdk/1.5/label/ubuntu/core-integration-tests/target/distro/bin/mvn
-s settings.xml -e --batch-mode -Dmaven.repo.local=/opt/repos/local-repository validate
EMMA: collecting runtime coverage data ...
java.net.BindException: Address already in use
	at java.net.PlainSocketImpl.socketBind(Native Method)
	at java.net.PlainSocketImpl.bind(PlainSocketImpl.java:359)
	at java.net.ServerSocket.bind(ServerSocket.java:319)
	at java.net.ServerSocket.<init>(ServerSocket.java:185)
	at java.net.ServerSocket.<init>(ServerSocket.java:97)
	at com.vladium.emma.rt.RTController.start(RTController.java:99)
	at com.vladium.emma.rt.RT.reset(RT.java:222)
	at com.vladium.emma.rt.RT.<clinit>(RT.java:540)
	at org.apache.maven.cli.MavenCli.$VRi(MavenCli.java)
	at org.apache.maven.cli.MavenCli.<clinit>(MavenCli.java)
	at sun.reflect.NativeMethodAccessorImpl.invoke0(Native Method)
	at sun.reflect.NativeMethodAccessorImpl.invoke(NativeMethodAccessorImpl.java:39)
	at sun.reflect.DelegatingMethodAccessorImpl.invoke(DelegatingMethodAccessorImpl.java:25)
	at java.lang.reflect.Method.invoke(Method.java:585)
	at org.codehaus.plexus.classworlds.launcher.Launcher.launchEnhanced(Launcher.java:290)
	at org.codehaus.plexus.classworlds.launcher.Launcher.launch(Launcher.java:230)
	at org.codehaus.plexus.classworlds.launcher.Launcher.mainWithExitCode(Launcher.java:409)
	at org.codehaus.plexus.classworlds.launcher.Launcher.main(Launcher.java:352)
Exception in thread "main" java.lang.Error: EMMA: runtime controller could not be started,
aborting
	at com.vladium.emma.rt.RT.reset(RT.java:233)
	at com.vladium.emma.rt.RT.<clinit>(RT.java:540)
	at org.apache.maven.cli.MavenCli.$VRi(MavenCli.java)
	at org.apache.maven.cli.MavenCli.<clinit>(MavenCli.java)
	at sun.reflect.NativeMethodAccessorImpl.invoke0(Native Method)
	at sun.reflect.NativeMethodAccessorImpl.invoke(NativeMethodAccessorImpl.java:39)
	at sun.reflect.DelegatingMethodAccessorImpl.invoke(DelegatingMethodAccessorImpl.java:25)
	at java.lang.reflect.Method.invoke(Method.java:585)
	at org.codehaus.plexus.classworlds.launcher.Launcher.launchEnhanced(Launcher.java:290)
	at org.codehaus.plexus.classworlds.launcher.Launcher.launch(Launcher.java:230)
	at org.codehaus.plexus.classworlds.launcher.Launcher.mainWithExitCode(Launcher.java:409)
	at org.codehaus.plexus.classworlds.launcher.Launcher.main(Launcher.java:352)
	at org.apache.maven.it.Verifier.executeGoals(Verifier.java:1326)
	at org.apache.maven.it.Verifier.executeGoal(Verifier.java:1164)
	at org.apache.maven.it.MavenITmng4379TransitiveSystemPathInterpolatedWithEnvVarTest.testit(MavenITmng4379TransitiveSystemPathInterpolatedWithEnvVarTest.java:59)

testitMNG3940(org.apache.maven.it.MavenITmng3940EnvVarInterpolationTest)  Time elapsed: 0.364
sec  <<< ERROR!
org.apache.maven.it.VerificationException: Exit code was non-zero: 1; command line and log
= 
/home/hudson/workspace/maven-3.0.x-ITs/jdk/1.5/label/ubuntu/core-integration-tests/target/distro/bin/mvn
-e --batch-mode -Dmaven.repo.local=/opt/repos/local-repository validate
EMMA: collecting runtime coverage data ...
java.net.BindException: Address already in use
	at java.net.PlainSocketImpl.socketBind(Native Method)
	at java.net.PlainSocketImpl.bind(PlainSocketImpl.java:359)
	at java.net.ServerSocket.bind(ServerSocket.java:319)
	at java.net.ServerSocket.<init>(ServerSocket.java:185)
	at java.net.ServerSocket.<init>(ServerSocket.java:97)
	at com.vladium.emma.rt.RTController.start(RTController.java:99)
	at com.vladium.emma.rt.RT.reset(RT.java:222)
	at com.vladium.emma.rt.RT.<clinit>(RT.java:540)
	at org.apache.maven.cli.MavenCli.$VRi(MavenCli.java)
	at org.apache.maven.cli.MavenCli.<clinit>(MavenCli.java)
	at sun.reflect.NativeMethodAccessorImpl.invoke0(Native Method)
	at sun.reflect.NativeMethodAccessorImpl.invoke(NativeMethodAccessorImpl.java:39)
	at sun.reflect.DelegatingMethodAccessorImpl.invoke(DelegatingMethodAccessorImpl.java:25)
	at java.lang.reflect.Method.invoke(Method.java:585)
	at org.codehaus.plexus.classworlds.launcher.Launcher.launchEnhanced(Launcher.java:290)
	at org.codehaus.plexus.classworlds.launcher.Launcher.launch(Launcher.java:230)
	at org.codehaus.plexus.classworlds.launcher.Launcher.mainWithExitCode(Launcher.java:409)
	at org.codehaus.plexus.classworlds.launcher.Launcher.main(Launcher.java:352)
Exception in thread "main" java.lang.Error: EMMA: runtime controller could not be started,
aborting
	at com.vladium.emma.rt.RT.reset(RT.java:233)
	at com.vladium.emma.rt.RT.<clinit>(RT.java:540)
	at org.apache.maven.cli.MavenCli.$VRi(MavenCli.java)
	at org.apache.maven.cli.MavenCli.<clinit>(MavenCli.java)
	at sun.reflect.NativeMethodAccessorImpl.invoke0(Native Method)
	at sun.reflect.NativeMethodAccessorImpl.invoke(NativeMethodAccessorImpl.java:39)
	at sun.reflect.DelegatingMethodAccessorImpl.invoke(DelegatingMethodAccessorImpl.java:25)
	at java.lang.reflect.Method.invoke(Method.java:585)
	at org.codehaus.plexus.classworlds.launcher.Launcher.launchEnhanced(Launcher.java:290)
	at org.codehaus.plexus.classworlds.launcher.Launcher.launch(Launcher.java:230)
	at org.codehaus.plexus.classworlds.launcher.Launcher.mainWithExitCode(Launcher.java:409)
	at org.codehaus.plexus.classworlds.launcher.Launcher.main(Launcher.java:352)
	at org.apache.maven.it.Verifier.executeGoals(Verifier.java:1326)
	at org.apache.maven.it.Verifier.executeGoal(Verifier.java:1164)
	at org.apache.maven.it.MavenITmng3940EnvVarInterpolationTest.testitMNG3940(MavenITmng3940EnvVarInterpolationTest.java:72)

testitRelocation(org.apache.maven.it.MavenITmng0553SettingsAuthzEncryptionTest)  Time elapsed:
0.513 sec  <<< ERROR!
org.apache.maven.it.VerificationException: Exit code was non-zero: 1; command line and log
= 
/home/hudson/workspace/maven-3.0.x-ITs/jdk/1.5/label/ubuntu/core-integration-tests/target/distro/bin/mvn
--settings settings.xml -e --batch-mode -Dsettings.security=/home/hudson/workspace/maven-3.0.x-ITs/jdk/1.5/label/ubuntu/core-integration-tests/target/test-classes/mng-0553/test-2/settings~security.xml
-Dmaven.repo.local=/opt/repos/local-repository validate
EMMA: collecting runtime coverage data ...
java.net.BindException: Address already in use
	at java.net.PlainSocketImpl.socketBind(Native Method)
	at java.net.PlainSocketImpl.bind(PlainSocketImpl.java:359)
	at java.net.ServerSocket.bind(ServerSocket.java:319)
	at java.net.ServerSocket.<init>(ServerSocket.java:185)
	at java.net.ServerSocket.<init>(ServerSocket.java:97)
	at com.vladium.emma.rt.RTController.start(RTController.java:99)
	at com.vladium.emma.rt.RT.reset(RT.java:222)
	at com.vladium.emma.rt.RT.<clinit>(RT.java:540)
	at org.apache.maven.cli.MavenCli.$VRi(MavenCli.java)
	at org.apache.maven.cli.MavenCli.<clinit>(MavenCli.java)
	at sun.reflect.NativeMethodAccessorImpl.invoke0(Native Method)
	at sun.reflect.NativeMethodAccessorImpl.invoke(NativeMethodAccessorImpl.java:39)
	at sun.reflect.DelegatingMethodAccessorImpl.invoke(DelegatingMethodAccessorImpl.java:25)
	at java.lang.reflect.Method.invoke(Method.java:585)
	at org.codehaus.plexus.classworlds.launcher.Launcher.launchEnhanced(Launcher.java:290)
	at org.codehaus.plexus.classworlds.launcher.Launcher.launch(Launcher.java:230)
	at org.codehaus.plexus.classworlds.launcher.Launcher.mainWithExitCode(Launcher.java:409)
	at org.codehaus.plexus.classworlds.launcher.Launcher.main(Launcher.java:352)
Exception in thread "main" java.lang.Error: EMMA: runtime controller could not be started,
aborting
	at com.vladium.emma.rt.RT.reset(RT.java:233)
	at com.vladium.emma.rt.RT.<clinit>(RT.java:540)
	at org.apache.maven.cli.MavenCli.$VRi(MavenCli.java)
	at org.apache.maven.cli.MavenCli.<clinit>(MavenCli.java)
	at sun.reflect.NativeMethodAccessorImpl.invoke0(Native Method)
	at sun.reflect.NativeMethodAccessorImpl.invoke(NativeMethodAccessorImpl.java:39)
	at sun.reflect.DelegatingMethodAccessorImpl.invoke(DelegatingMethodAccessorImpl.java:25)
	at java.lang.reflect.Method.invoke(Method.java:585)
	at org.codehaus.plexus.classworlds.launcher.Launcher.launchEnhanced(Launcher.java:290)
	at org.codehaus.plexus.classworlds.launcher.Launcher.launch(Launcher.java:230)
	at org.codehaus.plexus.classworlds.launcher.Launcher.mainWithExitCode(Launcher.java:409)
	at org.codehaus.plexus.classworlds.launcher.Launcher.main(Launcher.java:352)
	at org.apache.maven.it.Verifier.executeGoals(Verifier.java:1326)
	at org.apache.maven.it.Verifier.executeGoal(Verifier.java:1164)
	at org.apache.maven.it.MavenITmng0553SettingsAuthzEncryptionTest.testitRelocation(MavenITmng0553SettingsAuthzEncryptionTest.java:167)

testit0090(org.apache.maven.it.MavenIT0090EnvVarInterpolationTest)  Time elapsed: 4.057 sec
 <<< ERROR!
org.apache.maven.it.VerificationException: Exit code was non-zero: 1; command line and log
= 
/home/hudson/workspace/maven-3.0.x-ITs/jdk/1.5/label/ubuntu/core-integration-tests/target/distro/bin/mvn
-e --batch-mode -Dmaven.repo.local=/opt/repos/local-repository validate
EMMA: collecting runtime coverage data ...
java.net.BindException: Address already in use
	at java.net.PlainSocketImpl.socketBind(Native Method)
	at java.net.PlainSocketImpl.bind(PlainSocketImpl.java:359)
	at java.net.ServerSocket.bind(ServerSocket.java:319)
	at java.net.ServerSocket.<init>(ServerSocket.java:185)
	at java.net.ServerSocket.<init>(ServerSocket.java:97)
	at com.vladium.emma.rt.RTController.start(RTController.java:99)
	at com.vladium.emma.rt.RT.reset(RT.java:222)
	at com.vladium.emma.rt.RT.<clinit>(RT.java:540)
	at org.apache.maven.cli.MavenCli.$VRi(MavenCli.java)
	at org.apache.maven.cli.MavenCli.<clinit>(MavenCli.java)
	at sun.reflect.NativeMethodAccessorImpl.invoke0(Native Method)
	at sun.reflect.NativeMethodAccessorImpl.invoke(NativeMethodAccessorImpl.java:39)
	at sun.reflect.DelegatingMethodAccessorImpl.invoke(DelegatingMethodAccessorImpl.java:25)
	at java.lang.reflect.Method.invoke(Method.java:585)
	at org.codehaus.plexus.classworlds.launcher.Launcher.launchEnhanced(Launcher.java:290)
	at org.codehaus.plexus.classworlds.launcher.Launcher.launch(Launcher.java:230)
	at org.codehaus.plexus.classworlds.launcher.Launcher.mainWithExitCode(Launcher.java:409)
	at org.codehaus.plexus.classworlds.launcher.Launcher.main(Launcher.java:352)
Exception in thread "main" java.lang.Error: EMMA: runtime controller could not be started,
aborting
	at com.vladium.emma.rt.RT.reset(RT.java:233)
	at com.vladium.emma.rt.RT.<clinit>(RT.java:540)
	at org.apache.maven.cli.MavenCli.$VRi(MavenCli.java)
	at org.apache.maven.cli.MavenCli.<clinit>(MavenCli.java)
	at sun.reflect.NativeMethodAccessorImpl.invoke0(Native Method)
	at sun.reflect.NativeMethodAccessorImpl.invoke(NativeMethodAccessorImpl.java:39)
	at sun.reflect.DelegatingMethodAccessorImpl.invoke(DelegatingMethodAccessorImpl.java:25)
	at java.lang.reflect.Method.invoke(Method.java:585)
	at org.codehaus.plexus.classworlds.launcher.Launcher.launchEnhanced(Launcher.java:290)
	at org.codehaus.plexus.classworlds.launcher.Launcher.launch(Launcher.java:230)
	at org.codehaus.plexus.classworlds.launcher.Launcher.mainWithExitCode(Launcher.java:409)
	at org.codehaus.plexus.classworlds.launcher.Launcher.main(Launcher.java:352)
	at org.apache.maven.it.Verifier.executeGoals(Verifier.java:1326)
	at org.apache.maven.it.Verifier.executeGoal(Verifier.java:1164)
	at org.apache.maven.it.MavenIT0090EnvVarInterpolationTest.testit0090(MavenIT0090EnvVarInterpolationTest.java:52)


Results :

Tests in error: 
  testit(org.apache.maven.it.MavenITmng4482ForcePluginSnapshotUpdateTest)
  testit(org.apache.maven.it.MavenITmng4379TransitiveSystemPathInterpolatedWithEnvVarTest)
  testitMNG3940(org.apache.maven.it.MavenITmng3940EnvVarInterpolationTest)
  testitRelocation(org.apache.maven.it.MavenITmng0553SettingsAuthzEncryptionTest)
  testit0090(org.apache.maven.it.MavenIT0090EnvVarInterpolationTest)

Tests run: 553, Failures: 0, Errors: 5, Skipped: 0

[INFO] ------------------------------------------------------------------------
[INFO] BUILD FAILURE
[INFO] ------------------------------------------------------------------------
[INFO] Total time: 16:26.919s
[INFO] Finished at: Sun Feb 14 18:05:35 GMT-06:00 2010
[INFO] Final Memory: 7M/56M
[INFO] ------------------------------------------------------------------------
[ERROR] Failed to execute goal org.apache.maven.plugins:maven-surefire-plugin:2.4.3:test (default-test)
on project core-it-suite: There are test failures.

Please refer to /home/hudson/workspace/maven-3.0.x-ITs/jdk/1.5/label/ubuntu/core-integration-tests/target/surefire-reports
for the individual test results.
-> [Help 1]
org.apache.maven.lifecycle.LifecycleExecutionException: Failed to execute goal org.apache.maven.plugins:maven-surefire-plugin:2.4.3:test
(default-test) on project core-it-suite: There are test failures.

Please refer to /home/hudson/workspace/maven-3.0.x-ITs/jdk/1.5/label/ubuntu/core-integration-tests/target/surefire-reports
for the individual test results.
	at org.apache.maven.lifecycle.DefaultLifecycleExecutor.execute(DefaultLifecycleExecutor.java:581)
	at org.apache.maven.lifecycle.DefaultLifecycleExecutor.execute(DefaultLifecycleExecutor.java:324)
	at org.apache.maven.DefaultMaven.doExecute(DefaultMaven.java:247)
	at org.apache.maven.DefaultMaven.execute(DefaultMaven.java:104)
	at org.apache.maven.cli.MavenCli.execute(MavenCli.java:427)
	at org.apache.maven.cli.MavenCli.doMain(MavenCli.java:157)
	at org.apache.maven.cli.MavenCli.main(MavenCli.java:121)
	at sun.reflect.NativeMethodAccessorImpl.invoke0(Native Method)
	at sun.reflect.NativeMethodAccessorImpl.invoke(NativeMethodAccessorImpl.java:39)
	at sun.reflect.DelegatingMethodAccessorImpl.invoke(DelegatingMethodAccessorImpl.java:25)
	at java.lang.reflect.Method.invoke(Method.java:585)
	at org.codehaus.plexus.classworlds.launcher.Launcher.launchEnhanced(Launcher.java:290)
	at org.codehaus.plexus.classworlds.launcher.Launcher.launch(Launcher.java:230)
	at org.codehaus.plexus.classworlds.launcher.Launcher.mainWithExitCode(Launcher.java:409)
	at org.codehaus.plexus.classworlds.launcher.Launcher.main(Launcher.java:352)
Caused by: org.apache.maven.plugin.MojoFailureException: There are test failures.

Please refer to /home/hudson/workspace/maven-3.0.x-ITs/jdk/1.5/label/ubuntu/core-integration-tests/target/surefire-reports
for the individual test results.
	at org.apache.maven.plugin.surefire.SurefirePlugin.execute(SurefirePlugin.java:575)
	at org.apache.maven.plugin.DefaultBuildPluginManager.executeMojo(DefaultBuildPluginManager.java:105)
	at org.apache.maven.lifecycle.DefaultLifecycleExecutor.execute(DefaultLifecycleExecutor.java:577)
	... 14 more
[ERROR] 
[ERROR] Re-run Maven using the -X switch to enable full debug logging.
[ERROR] 
[ERROR] For more information about the errors and possible solutions, please read the following
articles:
[ERROR] [Help 1] http://cwiki.apache.org/confluence/display/MAVEN/MojoFailureException
Recording Emma reports core-integration-tests/target/site/emma/coverage.xml


Mime
View raw message