maven-notifications mailing list archives

Site index · List index
Message view « Date » · « Thread »
Top « Date » · « Thread »
From Hudson <Hud...@sonatype.org>
Subject Build failed in Hudson: maven-3.0.x-ITs » 1.5,ubuntu #181
Date Mon, 15 Feb 2010 17:43:21 GMT
See <http://grid.sonatype.org/ci/job/maven-3.0.x-ITs/./jdk=1.5,label=ubuntu/181/changes>

Changes:

[Benjamin Bentmann] o Disabled EMMA runtime controller to avoid port conflicts

------------------------------------------
[...truncated 668 lines...]
mng0469ReportConfig(itBuildConfigDominantDuringBuild).......OK (0.5 s)
mng0469ReportConfig(itBuildConfigIrrelevantForReports)......OK (0.6 s)
mng0449PluginVersionResolution(itLifecycleInvocation).......OK (0.5 s)
mng0449PluginVersionResolution(itCliInvocation).............OK (0.5 s)
mng0377PluginLookupFromPrefix(itMNG377).....................OK (0.6 s)
mng0294MergeGlobalAndUserSettings(itMNG294).................OK (0.5 s)
mng0282NonReactorExecWhenProjectIndependent(itMNG282).......OK (4.2 s)
mng0249ResolveDepsFromReactor(itMNG0249)....................OK (0.5 s)
mng0187CollectedProjects(it)................................OK (0.5 s)
mng0095ReactorFailureBehavior(itFailFast)...................OK (0.5 s)
mng0095ReactorFailureBehavior(itFailNever)..................OK (0.5 s)
mng0095ReactorFailureBehavior(itFailAtEnd)..................OK (0.4 s)
0145ReactorWithIncludesExcludes(itDefaultIncludesExcludes)..SKIPPED - version 3.0-SNAPSHOT
not in range [2.0,3.0-alpha-1)
0145ReactorWithIncludesExcludes(itCustomIncludes)...........SKIPPED - version 3.0-SNAPSHOT
not in range [2.0,3.0-alpha-1)
0145ReactorWithIncludesExcludes(itCustomExcludes)...........SKIPPED - version 3.0-SNAPSHOT
not in range [2.0,3.0-alpha-1)
0144LifecycleExecutionOrder(it0144).........................OK (2.9 s)
0143TransitiveDependencyScopes(itCompileScope)..............OK (0.6 s)
0143TransitiveDependencyScopes(itProvidedScope).............OK (0.5 s)
0143TransitiveDependencyScopes(itRuntimeScope)..............OK (0.5 s)
0143TransitiveDependencyScopes(itTestScope).................OK (0.5 s)
0142DirectDependencyScopes(it0142)..........................OK (0.6 s)
0140InterpolationWithPomPrefix(it0140)......................OK (0.4 s)
0139InterpolationWithProjectPrefix(it0139)..................OK (0.4 s)
0138PluginLifecycle(it0138).................................OK (1.4 s)
0137EarLifecycle(it0137)....................................OK (1.5 s)
0136RarLifecycle(it0136)....................................OK (1.4 s)
0135EjbLifecycle(it0135)....................................OK (1.6 s)
0134WarLifecycle(it0134)....................................OK (1.5 s)
0133JarLifecycle(it0133)....................................OK (0.5 s)
0132PomLifecycle(it0132)....................................OK (0.5 s)
0131SiteLifecycle(it0131)...................................OK (0.4 s)
0130CleanLifecycle(it0130)..................................OK (0.4 s)
0113ServerAuthzAvailableToWagonMgrInPlugin(it0113)..........SKIPPED - version 3.0-SNAPSHOT
not in range [2.0,3.0-alpha-1)
0090EnvVarInterpolation(it0090).............................OK (3.8 s)
0087PluginRealmWithProjectLevelDeps(it0087).................OK (0.9 s)
0086PluginRealm(it0086).....................................OK (1.3 s)
0085TransitiveSystemScope(it0085)...........................OK (0.5 s)
0072InterpolationWithDottedProperty(it0072).................OK (0.4 s)
0071PluginConfigWithDottedProperty(it0071)..................OK (0.6 s)
0064MojoConfigViaSetters(it0064)............................OK (1.2 s)
0063SystemScopeDependency(it0063)...........................OK (0.5 s)
0056MultipleGoalExecutions(it0056)..........................OK (0.5 s)
0052ReleaseProfile(it0052)..................................OK (0.6 s)
0051ReleaseProfile(it0051)..................................OK (1.6 s)
0041ArtifactTypeFromPluginExtension(it0041).................OK (0.8 s)
0040PackagingFromPluginExtension(it0040)....................OK (0.5 s)
0039ReleasePomInReactor(it0039).............................SKIPPED - version 3.0-SNAPSHOT
not in range [2.0,3.0-alpha-1)
0038AlternatePomFileDifferentDir(it0038)....................OK (0.5 s)
0037AlternatePomFileSameDir(it0037).........................OK (0.5 s)
0036ReleasePom(it0036)......................................SKIPPED - version 3.0-SNAPSHOT
not in range (2.0,3.0-alpha-1)
0032MavenPrerequisite(it0032)...............................OK (0.5 s)
0030DepPomDepMngtInheritance(it0030)........................OK (1.0 s)
0025MultipleExecutionLevelConfigs(it0025)...................OK (0.5 s)
0024MultipleGoalExecutions(it0024)..........................OK (0.4 s)
0023SettingsProfile(it0023).................................OK (0.5 s)
0021PomProfile(it0021)......................................OK (0.5 s)
0019PluginVersionMngtBySuperPom(it0019).....................OK (0.6 s)
0018DependencyManagement(it0018)............................OK (0.5 s)
0012PomInterpolation(it0012)................................OK (0.6 s)
0011DefaultVersionByDependencyManagement(it0011)............OK (0.5 s)
0010DependencyClosureResolution(it0010).....................OK (2.3 s)
0009GoalConfiguration(it0009)...............................OK (0.5 s)
0008SimplePlugin(it0008)....................................OK (0.5 s)
Tests run: 553, Failures: 0, Errors: 1, Skipped: 0, Time elapsed: 825.156 sec <<<
FAILURE!
testit(org.apache.maven.it.MavenITmng4482ForcePluginSnapshotUpdateTest)  Time elapsed: 0.187
sec  <<< ERROR!
org.apache.maven.it.VerificationException: Exit code was non-zero: 1; command line and log
= 
/home/hudson/workspace/maven-3.0.x-ITs/jdk/1.5/label/ubuntu/core-integration-tests/target/distro/bin/mvn
-s settings.xml -X -U -e --batch-mode -Dmaven.repo.local=/opt/repos/local-repository validate
Apache Maven 3.0-SNAPSHOT (r909961; 2010-02-13 20:20:05-0600)
Java version: 1.5.0_11
Java home: /opt/java/sdk/1.5/jre
Default locale: en_US, platform encoding: UTF-8
OS name: "linux" version: "2.6.24-19-virtual" arch: "i386" Family: "unix"
[INFO] Error stacktraces are turned on.
[DEBUG] Reading user settings from /home/hudson/workspace/maven-3.0.x-ITs/jdk/1.5/label/ubuntu/core-integration-tests/target/test-classes/mng-4482/settings.xml
[DEBUG] Reading global settings from /home/hudson/workspace/maven-3.0.x-ITs/jdk/1.5/label/ubuntu/core-integration-tests/target/distro/conf/settings.xml
[DEBUG] Using local repository at /opt/repos/local-repository
[INFO] Scanning for projects...
[INFO] snapshot org.apache.maven.its.mng4482:extension:0.2-SNAPSHOT: checking for updates
from maven-core-it
[DEBUG] SHA1 not found, trying MD5: File: /home/hudson/workspace/maven-3.0.x-ITs/jdk/1.5/label/ubuntu/core-integration-tests/target/test-classes/mng-4482/repo-2/org/apache/maven/its/mng4482/extension/0.2-SNAPSHOT/maven-metadata.xml.sha1
does not exist
[DEBUG] Reading resolution-state from: /opt/repos/local-repository/org/apache/maven/its/mng4482/extension/0.2-SNAPSHOT/resolver-status.properties
[DEBUG] Writing resolution-state to: /opt/repos/local-repository/org/apache/maven/its/mng4482/extension/0.2-SNAPSHOT/resolver-status.properties
[DEBUG] Skipping update check for snapshot org.apache.maven.its.mng4482:extension:0.2-SNAPSHOT
(/opt/repos/local-repository/org/apache/maven/its/mng4482/extension/0.2-SNAPSHOT/maven-metadata-central.xml)
from central (http://repo1.maven.org/maven2)
[DEBUG] extension: resolved to version 0.2-20091204.195734-2 from repository maven-core-it
[DEBUG] Trying repository maven-core-it for resolution of org.apache.maven.its.mng4482:extension:maven-plugin:0.2-SNAPSHOT
from org/apache/maven/its/mng4482/extension/0.2-SNAPSHOT/extension-0.2-20091204.195734-2.jar
Downloading: file:///home/hudson/workspace/maven-3.0.x-ITs/jdk/1.5/label/ubuntu/core-integration-tests/target/test-classes/mng-4482/repo-2/org/apache/maven/its/mng4482/extension/0.2-SNAPSHOT/extension-0.2-20091204.195734-2.jar
5 KB downloaded
[DEBUG] SHA1 not found, trying MD5: File: /home/hudson/workspace/maven-3.0.x-ITs/jdk/1.5/label/ubuntu/core-integration-tests/target/test-classes/mng-4482/repo-2/org/apache/maven/its/mng4482/extension/0.2-SNAPSHOT/extension-0.2-20091204.195734-2.jar.sha1
does not exist
[DEBUG]   Artifact org.apache.maven.its.mng4482:extension:maven-plugin:0.2-SNAPSHOT resolved
to /opt/repos/local-repository/org/apache/maven/its/mng4482/extension/0.2-SNAPSHOT/extension-0.2-20091204.195734-2.jar
[DEBUG] Trying repository maven-core-it for resolution of org.apache.maven.its.mng4482:extension:pom:0.2-SNAPSHOT
from org/apache/maven/its/mng4482/extension/0.2-SNAPSHOT/extension-0.2-20091204.195734-2.pom
Downloading: file:///home/hudson/workspace/maven-3.0.x-ITs/jdk/1.5/label/ubuntu/core-integration-tests/target/test-classes/mng-4482/repo-2/org/apache/maven/its/mng4482/extension/0.2-SNAPSHOT/extension-0.2-20091204.195734-2.pom
2 KB downloaded at 1775.4 KB/sec
[DEBUG] SHA1 not found, trying MD5: File: /home/hudson/workspace/maven-3.0.x-ITs/jdk/1.5/label/ubuntu/core-integration-tests/target/test-classes/mng-4482/repo-2/org/apache/maven/its/mng4482/extension/0.2-SNAPSHOT/extension-0.2-20091204.195734-2.pom.sha1
does not exist
[DEBUG]   Artifact org.apache.maven.its.mng4482:extension:pom:0.2-SNAPSHOT resolved to /opt/repos/local-repository/org/apache/maven/its/mng4482/extension/0.2-SNAPSHOT/extension-0.2-20091204.195734-2.pom
[DEBUG] Created new class realm extension>org.apache.maven.its.mng4482:extension:0.2-SNAPSHOT--1171721263
[DEBUG] Populating class realm extension>org.apache.maven.its.mng4482:extension:0.2-SNAPSHOT--1171721263
[DEBUG]   Included: org.apache.maven.its.mng4482:extension:maven-plugin:0.2-SNAPSHOT
[DEBUG]   Included: org.codehaus.plexus:plexus-utils:jar:1.1
[ERROR] Internal error: java.lang.IllegalStateException: Failed to discover components in
extension realm extension>org.apache.maven.its.mng4482:extension:0.2-SNAPSHOT--1171721263:
IO error building configuration from: jar:file:/opt/repos/local-repository/org/apache/maven/its/mng4482/extension/0.2-SNAPSHOT/extension-0.2-SNAPSHOT.jar!/META-INF/plexus/components.xml:
Unexpected end of ZLIB input stream -> [Help 1]
org.apache.maven.InternalErrorException: Internal error: java.lang.IllegalStateException:
Failed to discover components in extension realm extension>org.apache.maven.its.mng4482:extension:0.2-SNAPSHOT--1171721263
	at org.apache.maven.DefaultMaven.execute(DefaultMaven.java:116)
	at org.apache.maven.cli.MavenCli.execute(MavenCli.java:427)
	at org.apache.maven.cli.MavenCli.doMain(MavenCli.java:157)
	at org.apache.maven.cli.MavenCli.doMain(MavenCli.java:139)
	at sun.reflect.GeneratedMethodAccessor6.invoke(Unknown Source)
	at sun.reflect.DelegatingMethodAccessorImpl.invoke(DelegatingMethodAccessorImpl.java:25)
	at java.lang.reflect.Method.invoke(Method.java:585)
	at org.apache.maven.it.Embedded3xLauncher.run(Embedded3xLauncher.java:176)
	at org.apache.maven.it.Verifier.executeGoals(Verifier.java:1304)
	at org.apache.maven.it.Verifier.executeGoal(Verifier.java:1164)
	at org.apache.maven.it.Verifier.executeGoal(Verifier.java:1158)
	at org.apache.maven.it.MavenITmng4482ForcePluginSnapshotUpdateTest.testit(MavenITmng4482ForcePluginSnapshotUpdateTest.java:75)
Caused by: java.lang.IllegalStateException: Failed to discover components in extension realm
extension>org.apache.maven.its.mng4482:extension:0.2-SNAPSHOT--1171721263
	at org.apache.maven.project.DefaultProjectBuildingHelper.createProjectRealm(DefaultProjectBuildingHelper.java:231)
	at org.apache.maven.project.DefaultModelBuildingListener.buildExtensionsAssembled(DefaultModelBuildingListener.java:106)
	at org.apache.maven.model.building.ModelBuildingEventCatapult$1.fire(ModelBuildingEventCatapult.java:43)
	at org.apache.maven.model.building.DefaultModelBuilder.fireEvent(DefaultModelBuilder.java:774)
	at org.apache.maven.model.building.DefaultModelBuilder.build(DefaultModelBuilder.java:259)
	at org.apache.maven.model.building.DefaultModelBuilder.build(DefaultModelBuilder.java:242)
	at org.apache.maven.project.DefaultProjectBuilder.build(DefaultProjectBuilder.java:449)
	at org.apache.maven.project.DefaultProjectBuilder.build(DefaultProjectBuilder.java:284)
	at org.apache.maven.DefaultMaven.collectProjects(DefaultMaven.java:402)
	at org.apache.maven.DefaultMaven.getProjectsForMavenReactor(DefaultMaven.java:351)
	at org.apache.maven.DefaultMaven.doExecute(DefaultMaven.java:171)
	at org.apache.maven.DefaultMaven.execute(DefaultMaven.java:104)
	... 40 more
Caused by: org.codehaus.plexus.configuration.PlexusConfigurationException: IO error building
configuration from: jar:file:/opt/repos/local-repository/org/apache/maven/its/mng4482/extension/0.2-SNAPSHOT/extension-0.2-SNAPSHOT.jar!/META-INF/plexus/components.xml
	at org.codehaus.plexus.component.repository.io.PlexusTools.buildConfiguration(PlexusTools.java:59)
	at org.codehaus.plexus.component.discovery.DefaultComponentDiscoverer.createComponentDescriptors(DefaultComponentDiscoverer.java:44)
	at org.codehaus.plexus.component.discovery.AbstractResourceBasedComponentDiscoverer.findComponents(AbstractResourceBasedComponentDiscoverer.java:83)
	at org.codehaus.plexus.DefaultPlexusContainer.discoverComponents(DefaultPlexusContainer.java:953)
	at org.codehaus.plexus.DefaultPlexusContainer.discoverComponents(DefaultPlexusContainer.java:941)
	at org.apache.maven.project.DefaultProjectBuildingHelper.createProjectRealm(DefaultProjectBuildingHelper.java:227)
	... 51 more
Caused by: java.io.EOFException: Unexpected end of ZLIB input stream
	at java.util.zip.ZipFile$2.fill(ZipFile.java:335)
	at java.util.zip.InflaterInputStream.read(InflaterInputStream.java:134)
	at java.io.FilterInputStream.read(FilterInputStream.java:111)
	at java.io.BufferedInputStream.fill(BufferedInputStream.java:218)
	at java.io.BufferedInputStream.read1(BufferedInputStream.java:256)
	at java.io.BufferedInputStream.read(BufferedInputStream.java:313)
	at sun.nio.cs.StreamDecoder$CharsetSD.readBytes(StreamDecoder.java:411)
	at sun.nio.cs.StreamDecoder$CharsetSD.implRead(StreamDecoder.java:453)
	at sun.nio.cs.StreamDecoder.read(StreamDecoder.java:183)
	at sun.nio.cs.StreamDecoder.read0(StreamDecoder.java:132)
	at sun.nio.cs.StreamDecoder.read(StreamDecoder.java:176)
	at java.io.InputStreamReader.read(InputStreamReader.java:167)
	at org.codehaus.plexus.util.xml.XmlReader.read(XmlReader.java:440)
	at java.io.Reader.read(Reader.java:103)
	at org.codehaus.plexus.util.InterpolationFilterReader.read(InterpolationFilterReader.java:211)
	at org.codehaus.plexus.util.InterpolationFilterReader.read(InterpolationFilterReader.java:165)
	at org.codehaus.plexus.util.xml.pull.MXParser.fillBuf(MXParser.java:2994)
	at org.codehaus.plexus.util.xml.pull.MXParser.more(MXParser.java:3048)
	at org.codehaus.plexus.util.xml.pull.MXParser.parseProlog(MXParser.java:1422)
	at org.codehaus.plexus.util.xml.pull.MXParser.nextImpl(MXParser.java:1407)
	at org.codehaus.plexus.util.xml.pull.MXParser.next(MXParser.java:1105)
	at org.codehaus.plexus.util.xml.Xpp3DomBuilder.build(Xpp3DomBuilder.java:179)
	at org.codehaus.plexus.util.xml.Xpp3DomBuilder.build(Xpp3DomBuilder.java:75)
	at org.codehaus.plexus.util.xml.Xpp3DomBuilder.build(Xpp3DomBuilder.java:40)
	at org.codehaus.plexus.configuration.io.XmlPlexusConfigurationReader.read(XmlPlexusConfigurationReader.java:32)
	at org.codehaus.plexus.component.repository.io.PlexusTools.buildConfiguration(PlexusTools.java:49)
	... 56 more
[ERROR] 
[ERROR] 
[ERROR] For more information about the errors and possible solutions, please read the following
articles:
[ERROR] [Help 1] http://cwiki.apache.org/confluence/display/MAVEN/InternalErrorException
	at org.apache.maven.it.Verifier.executeGoals(Verifier.java:1326)
	at org.apache.maven.it.Verifier.executeGoal(Verifier.java:1164)
	at org.apache.maven.it.Verifier.executeGoal(Verifier.java:1158)
	at org.apache.maven.it.MavenITmng4482ForcePluginSnapshotUpdateTest.testit(MavenITmng4482ForcePluginSnapshotUpdateTest.java:75)
	at sun.reflect.NativeMethodAccessorImpl.invoke0(Native Method)
	at sun.reflect.NativeMethodAccessorImpl.invoke(NativeMethodAccessorImpl.java:39)
	at sun.reflect.DelegatingMethodAccessorImpl.invoke(DelegatingMethodAccessorImpl.java:25)
	at java.lang.reflect.Method.invoke(Method.java:585)
	at junit.framework.TestCase.runTest(TestCase.java:164)
	at org.apache.maven.it.AbstractMavenIntegrationTestCase.runTest(AbstractMavenIntegrationTestCase.java:198)
	at junit.framework.TestCase.runBare(TestCase.java:130)
	at junit.framework.TestResult$1.protect(TestResult.java:106)
	at junit.framework.TestResult.runProtected(TestResult.java:124)
	at junit.framework.TestResult.run(TestResult.java:109)
	at junit.framework.TestCase.run(TestCase.java:120)
	at junit.framework.TestSuite.runTest(TestSuite.java:230)
	at junit.framework.TestSuite.run(TestSuite.java:225)
	at junit.framework.TestSuite.runTest(TestSuite.java:230)
	at junit.framework.TestSuite.run(TestSuite.java:225)
	at sun.reflect.NativeMethodAccessorImpl.invoke0(Native Method)
	at sun.reflect.NativeMethodAccessorImpl.invoke(NativeMethodAccessorImpl.java:39)
	at sun.reflect.DelegatingMethodAccessorImpl.invoke(DelegatingMethodAccessorImpl.java:25)
	at java.lang.reflect.Method.invoke(Method.java:585)
	at org.apache.maven.surefire.junit.JUnitTestSet.execute(JUnitTestSet.java:213)
	at org.apache.maven.surefire.suite.AbstractDirectoryTestSuite.executeTestSet(AbstractDirectoryTestSuite.java:140)
	at org.apache.maven.surefire.suite.AbstractDirectoryTestSuite.execute(AbstractDirectoryTestSuite.java:127)
	at org.apache.maven.surefire.Surefire.run(Surefire.java:177)
	at sun.reflect.NativeMethodAccessorImpl.invoke0(Native Method)
	at sun.reflect.NativeMethodAccessorImpl.invoke(NativeMethodAccessorImpl.java:39)
	at sun.reflect.DelegatingMethodAccessorImpl.invoke(DelegatingMethodAccessorImpl.java:25)
	at java.lang.reflect.Method.invoke(Method.java:585)
	at org.apache.maven.surefire.booter.SurefireBooter.runSuitesInProcess(SurefireBooter.java:345)
	at org.apache.maven.surefire.booter.SurefireBooter.main(SurefireBooter.java:1009)


Results :

Tests in error: 
  testit(org.apache.maven.it.MavenITmng4482ForcePluginSnapshotUpdateTest)

Tests run: 553, Failures: 0, Errors: 1, Skipped: 0

[INFO] ------------------------------------------------------------------------
[INFO] BUILD FAILURE
[INFO] ------------------------------------------------------------------------
[INFO] Total time: 18:15.054s
[INFO] Finished at: Mon Feb 15 11:43:21 GMT-06:00 2010
[INFO] Final Memory: 6M/66M
[INFO] ------------------------------------------------------------------------
[ERROR] Failed to execute goal org.apache.maven.plugins:maven-surefire-plugin:2.4.3:test (default-test)
on project core-it-suite: There are test failures.

Please refer to /home/hudson/workspace/maven-3.0.x-ITs/jdk/1.5/label/ubuntu/core-integration-tests/target/surefire-reports
for the individual test results.
-> [Help 1]
org.apache.maven.lifecycle.LifecycleExecutionException: Failed to execute goal org.apache.maven.plugins:maven-surefire-plugin:2.4.3:test
(default-test) on project core-it-suite: There are test failures.

Please refer to /home/hudson/workspace/maven-3.0.x-ITs/jdk/1.5/label/ubuntu/core-integration-tests/target/surefire-reports
for the individual test results.
	at org.apache.maven.lifecycle.DefaultLifecycleExecutor.execute(DefaultLifecycleExecutor.java:581)
	at org.apache.maven.lifecycle.DefaultLifecycleExecutor.execute(DefaultLifecycleExecutor.java:324)
	at org.apache.maven.DefaultMaven.doExecute(DefaultMaven.java:247)
	at org.apache.maven.DefaultMaven.execute(DefaultMaven.java:104)
	at org.apache.maven.cli.MavenCli.execute(MavenCli.java:427)
	at org.apache.maven.cli.MavenCli.doMain(MavenCli.java:157)
	at org.apache.maven.cli.MavenCli.main(MavenCli.java:121)
	at sun.reflect.NativeMethodAccessorImpl.invoke0(Native Method)
	at sun.reflect.NativeMethodAccessorImpl.invoke(NativeMethodAccessorImpl.java:39)
	at sun.reflect.DelegatingMethodAccessorImpl.invoke(DelegatingMethodAccessorImpl.java:25)
	at java.lang.reflect.Method.invoke(Method.java:585)
	at org.codehaus.plexus.classworlds.launcher.Launcher.launchEnhanced(Launcher.java:290)
	at org.codehaus.plexus.classworlds.launcher.Launcher.launch(Launcher.java:230)
	at org.codehaus.plexus.classworlds.launcher.Launcher.mainWithExitCode(Launcher.java:409)
	at org.codehaus.plexus.classworlds.launcher.Launcher.main(Launcher.java:352)
Caused by: org.apache.maven.plugin.MojoFailureException: There are test failures.

Please refer to /home/hudson/workspace/maven-3.0.x-ITs/jdk/1.5/label/ubuntu/core-integration-tests/target/surefire-reports
for the individual test results.
	at org.apache.maven.plugin.surefire.SurefirePlugin.execute(SurefirePlugin.java:575)
	at org.apache.maven.plugin.DefaultBuildPluginManager.executeMojo(DefaultBuildPluginManager.java:105)
	at org.apache.maven.lifecycle.DefaultLifecycleExecutor.execute(DefaultLifecycleExecutor.java:577)
	... 14 more
[ERROR] 
[ERROR] Re-run Maven using the -X switch to enable full debug logging.
[ERROR] 
[ERROR] For more information about the errors and possible solutions, please read the following
articles:
[ERROR] [Help 1] http://cwiki.apache.org/confluence/display/MAVEN/MojoFailureException
Recording Emma reports core-integration-tests/target/site/emma/coverage.xml


Mime
View raw message