maven-notifications mailing list archives

Site index · List index
Message view « Date » · « Thread »
Top « Date » · « Thread »
From Hudson <Hud...@sonatype.org>
Subject Build failed in Hudson: maven-3.0.x-ITs » 1.5,ubuntu #184
Date Fri, 19 Feb 2010 03:53:43 GMT
See <http://grid.sonatype.org/ci/job/maven-3.0.x-ITs/./jdk=1.5,label=ubuntu/184/>

------------------------------------------
[...truncated 4308 lines...]
	at org.apache.maven.plugin.DefaultBuildPluginManager.getMojoDescriptor(DefaultBuildPluginManager.java:194)
	at org.apache.maven.lifecycle.DefaultLifecycleExecutor.calculateExecutionPlan(DefaultLifecycleExecutor.java:825)
	at org.apache.maven.lifecycle.DefaultLifecycleExecutor.execute(DefaultLifecycleExecutor.java:296)
	at org.apache.maven.DefaultMaven.doExecute(DefaultMaven.java:247)
	at org.apache.maven.DefaultMaven.execute(DefaultMaven.java:104)
	at org.apache.maven.cli.MavenCli.execute(MavenCli.java:427)
	at org.apache.maven.cli.MavenCli.doMain(MavenCli.java:157)
	at org.apache.maven.cli.MavenCli.main(MavenCli.java:121)
	at sun.reflect.NativeMethodAccessorImpl.invoke0(Native Method)
	at sun.reflect.NativeMethodAccessorImpl.invoke(NativeMethodAccessorImpl.java:39)
	at sun.reflect.DelegatingMethodAccessorImpl.invoke(DelegatingMethodAccessorImpl.java:25)
	at java.lang.reflect.Method.invoke(Method.java:585)
	at org.codehaus.plexus.classworlds.launcher.Launcher.launchEnhanced(Launcher.java:290)
	at org.codehaus.plexus.classworlds.launcher.Launcher.launch(Launcher.java:230)
	at org.codehaus.plexus.classworlds.launcher.Launcher.mainWithExitCode(Launcher.java:409)
	at org.codehaus.plexus.classworlds.launcher.Launcher.main(Launcher.java:352)
[ERROR] 
[ERROR] Re-run Maven using the -X switch to enable full debug logging.
EMMA: locking coverage output file [/home/hudson/workspace/maven-3.0.x-ITs/jdk/1.5/label/ubuntu/core-integration-tests/target/test-classes/it0038/coverage.ec]
...
EMMA: runtime coverage data merged into [/home/hudson/workspace/maven-3.0.x-ITs/jdk/1.5/label/ubuntu/core-integration-tests/target/test-classes/it0038/coverage.ec]
{in 33 ms}
	at org.apache.maven.it.Verifier.executeGoals(Verifier.java:1326)
	at org.apache.maven.it.Verifier.executeGoal(Verifier.java:1164)
	at org.apache.maven.it.Verifier.executeGoal(Verifier.java:1158)
	at org.apache.maven.it.MavenIT0038AlternatePomFileDifferentDirTest.testit0038(MavenIT0038AlternatePomFileDifferentDirTest.java:54)

testit0037(org.apache.maven.it.MavenIT0037AlternatePomFileSameDirTest)  Time elapsed: 2.143
sec  <<< ERROR!
org.apache.maven.it.VerificationException: Exit code was non-zero: 1; command line and log
= 
/home/hudson/workspace/maven-3.0.x-ITs/jdk/1.5/label/ubuntu/core-integration-tests/target/distro/bin/mvn
-f pom2.xml -e --batch-mode -Dmaven.repo.local=/opt/repos/local-repository validate
EMMA: collecting runtime coverage data ...
EMMA: runtime controller started on port [47653]
[INFO] Error stacktraces are turned on.
[INFO] Scanning for projects...
[INFO]                                                                         
[INFO] ------------------------------------------------------------------------
[INFO] Building Maven Integration Test :: it0037 0.1
[INFO] ------------------------------------------------------------------------
[INFO] snapshot org.apache.maven.its.plugins:maven-it-plugin-log-file:2.1-SNAPSHOT: checking
for updates from Nexus
[INFO] ------------------------------------------------------------------------
[INFO] BUILD FAILURE
[INFO] ------------------------------------------------------------------------
[INFO] Total time: 0.464s
[INFO] Finished at: Thu Feb 18 21:53:01 GMT-06:00 2010
[INFO] Final Memory: 1M/23M
[INFO] ------------------------------------------------------------------------
[ERROR] Negative time
java.lang.IllegalArgumentException: Negative time
	at java.io.File.setLastModified(File.java:1222)
	at org.apache.maven.artifact.resolver.DefaultArtifactResolver.resolve(DefaultArtifactResolver.java:318)
	at org.apache.maven.artifact.resolver.DefaultArtifactResolver.resolve(DefaultArtifactResolver.java:507)
	at org.apache.maven.repository.legacy.LegacyRepositorySystem.resolve(LegacyRepositorySystem.java:325)
	at org.apache.maven.plugin.internal.DefaultPluginDependenciesResolver.resolve(DefaultPluginDependenciesResolver.java:75)
	at org.apache.maven.plugin.internal.DefaultMavenPluginManager.getPluginDescriptor(DefaultMavenPluginManager.java:127)
	at org.apache.maven.plugin.internal.DefaultMavenPluginManager.getMojoDescriptor(DefaultMavenPluginManager.java:241)
	at org.apache.maven.plugin.DefaultBuildPluginManager.getMojoDescriptor(DefaultBuildPluginManager.java:194)
	at org.apache.maven.lifecycle.DefaultLifecycleExecutor.calculateExecutionPlan(DefaultLifecycleExecutor.java:825)
	at org.apache.maven.lifecycle.DefaultLifecycleExecutor.execute(DefaultLifecycleExecutor.java:296)
	at org.apache.maven.DefaultMaven.doExecute(DefaultMaven.java:247)
	at org.apache.maven.DefaultMaven.execute(DefaultMaven.java:104)
	at org.apache.maven.cli.MavenCli.execute(MavenCli.java:427)
	at org.apache.maven.cli.MavenCli.doMain(MavenCli.java:157)
	at org.apache.maven.cli.MavenCli.main(MavenCli.java:121)
	at sun.reflect.NativeMethodAccessorImpl.invoke0(Native Method)
	at sun.reflect.NativeMethodAccessorImpl.invoke(NativeMethodAccessorImpl.java:39)
	at sun.reflect.DelegatingMethodAccessorImpl.invoke(DelegatingMethodAccessorImpl.java:25)
	at java.lang.reflect.Method.invoke(Method.java:585)
	at org.codehaus.plexus.classworlds.launcher.Launcher.launchEnhanced(Launcher.java:290)
	at org.codehaus.plexus.classworlds.launcher.Launcher.launch(Launcher.java:230)
	at org.codehaus.plexus.classworlds.launcher.Launcher.mainWithExitCode(Launcher.java:409)
	at org.codehaus.plexus.classworlds.launcher.Launcher.main(Launcher.java:352)
[ERROR] 
[ERROR] Re-run Maven using the -X switch to enable full debug logging.
EMMA: locking coverage output file [/home/hudson/workspace/maven-3.0.x-ITs/jdk/1.5/label/ubuntu/core-integration-tests/target/test-classes/it0037/coverage.ec]
...
EMMA: runtime coverage data merged into [/home/hudson/workspace/maven-3.0.x-ITs/jdk/1.5/label/ubuntu/core-integration-tests/target/test-classes/it0037/coverage.ec]
{in 107 ms}
	at org.apache.maven.it.Verifier.executeGoals(Verifier.java:1326)
	at org.apache.maven.it.Verifier.executeGoal(Verifier.java:1164)
	at org.apache.maven.it.Verifier.executeGoal(Verifier.java:1158)
	at org.apache.maven.it.MavenIT0037AlternatePomFileSameDirTest.testit0037(MavenIT0037AlternatePomFileSameDirTest.java:54)

testit0024(org.apache.maven.it.MavenIT0024MultipleGoalExecutionsTest)  Time elapsed: 2.269
sec  <<< ERROR!
org.apache.maven.it.VerificationException: Exit code was non-zero: 1; command line and log
= 
/home/hudson/workspace/maven-3.0.x-ITs/jdk/1.5/label/ubuntu/core-integration-tests/target/distro/bin/mvn
-e --batch-mode -Dmaven.repo.local=/opt/repos/local-repository initialize
EMMA: collecting runtime coverage data ...
EMMA: runtime controller started on port [47653]
[INFO] Error stacktraces are turned on.
[INFO] Scanning for projects...
[INFO]                                                                         
[INFO] ------------------------------------------------------------------------
[INFO] Building Maven Integration Test :: it0024 1.0
[INFO] ------------------------------------------------------------------------
[INFO] snapshot org.apache.maven.its.plugins:maven-it-plugin-log-file:2.1-SNAPSHOT: checking
for updates from Nexus
[INFO] ------------------------------------------------------------------------
[INFO] BUILD FAILURE
[INFO] ------------------------------------------------------------------------
[INFO] Total time: 0.390s
[INFO] Finished at: Thu Feb 18 21:53:19 GMT-06:00 2010
[INFO] Final Memory: 1M/14M
[INFO] ------------------------------------------------------------------------
[ERROR] Negative time
java.lang.IllegalArgumentException: Negative time
	at java.io.File.setLastModified(File.java:1222)
	at org.apache.maven.artifact.resolver.DefaultArtifactResolver.resolve(DefaultArtifactResolver.java:318)
	at org.apache.maven.artifact.resolver.DefaultArtifactResolver.resolve(DefaultArtifactResolver.java:507)
	at org.apache.maven.repository.legacy.LegacyRepositorySystem.resolve(LegacyRepositorySystem.java:325)
	at org.apache.maven.plugin.internal.DefaultPluginDependenciesResolver.resolve(DefaultPluginDependenciesResolver.java:75)
	at org.apache.maven.plugin.internal.DefaultMavenPluginManager.getPluginDescriptor(DefaultMavenPluginManager.java:127)
	at org.apache.maven.plugin.internal.DefaultMavenPluginManager.getMojoDescriptor(DefaultMavenPluginManager.java:241)
	at org.apache.maven.plugin.DefaultBuildPluginManager.getMojoDescriptor(DefaultBuildPluginManager.java:194)
	at org.apache.maven.lifecycle.DefaultLifecycleExecutor.calculateExecutionPlan(DefaultLifecycleExecutor.java:825)
	at org.apache.maven.lifecycle.DefaultLifecycleExecutor.execute(DefaultLifecycleExecutor.java:296)
	at org.apache.maven.DefaultMaven.doExecute(DefaultMaven.java:247)
	at org.apache.maven.DefaultMaven.execute(DefaultMaven.java:104)
	at org.apache.maven.cli.MavenCli.execute(MavenCli.java:427)
	at org.apache.maven.cli.MavenCli.doMain(MavenCli.java:157)
	at org.apache.maven.cli.MavenCli.main(MavenCli.java:121)
	at sun.reflect.NativeMethodAccessorImpl.invoke0(Native Method)
	at sun.reflect.NativeMethodAccessorImpl.invoke(NativeMethodAccessorImpl.java:39)
	at sun.reflect.DelegatingMethodAccessorImpl.invoke(DelegatingMethodAccessorImpl.java:25)
	at java.lang.reflect.Method.invoke(Method.java:585)
	at org.codehaus.plexus.classworlds.launcher.Launcher.launchEnhanced(Launcher.java:290)
	at org.codehaus.plexus.classworlds.launcher.Launcher.launch(Launcher.java:230)
	at org.codehaus.plexus.classworlds.launcher.Launcher.mainWithExitCode(Launcher.java:409)
	at org.codehaus.plexus.classworlds.launcher.Launcher.main(Launcher.java:352)
[ERROR] 
[ERROR] Re-run Maven using the -X switch to enable full debug logging.
EMMA: locking coverage output file [/home/hudson/workspace/maven-3.0.x-ITs/jdk/1.5/label/ubuntu/core-integration-tests/target/test-classes/it0024/coverage.ec]
...
EMMA: runtime coverage data merged into [/home/hudson/workspace/maven-3.0.x-ITs/jdk/1.5/label/ubuntu/core-integration-tests/target/test-classes/it0024/coverage.ec]
{in 30 ms}
	at org.apache.maven.it.Verifier.executeGoals(Verifier.java:1326)
	at org.apache.maven.it.Verifier.executeGoal(Verifier.java:1164)
	at org.apache.maven.it.Verifier.executeGoal(Verifier.java:1158)
	at org.apache.maven.it.MavenIT0024MultipleGoalExecutionsTest.testit0024(MavenIT0024MultipleGoalExecutionsTest.java:53)


Results :

Failed tests: 
  testNoClassDefFromMojoLoad(org.apache.maven.it.MavenITmng2690MojoLoadingErrorsTest)
  testNoClassDefFromMojoConfiguration(org.apache.maven.it.MavenITmng2690MojoLoadingErrorsTest)
  testMojoComponentLookupException(org.apache.maven.it.MavenITmng2690MojoLoadingErrorsTest)
  testMojoRequirementComponentLookupException(org.apache.maven.it.MavenITmng2690MojoLoadingErrorsTest)

Tests in error: 
  testit(org.apache.maven.it.MavenITmng4429CompRequirementOnNonDefaultImplTest)
  testit(org.apache.maven.it.MavenITmng4422PluginExecutionPhaseInterpolationTest)
  testit(org.apache.maven.it.MavenITmng4416PluginOrderAfterProfileInjectionTest)
  testit(org.apache.maven.it.MavenITmng4415InheritedPluginOrderTest)
  testit(org.apache.maven.it.MavenITmng4386DebugLoggingTest)
  testit(org.apache.maven.it.MavenITmng4381ExtensionSingletonComponentTest)
  testit(org.apache.maven.it.MavenITmng4345DefaultPluginExecutionOrderTest)
  testit(org.apache.maven.it.MavenITmng4344ManagedPluginExecutionOrderTest)
  testit(org.apache.maven.it.MavenITmng4341PluginExecutionOrderTest)
  testit(org.apache.maven.it.MavenITmng4321CliUsesPluginMgmtConfigTest)
  testit(org.apache.maven.it.MavenITmng4319PluginExecutionGoalInterpolationTest)
  testProjectPackagingUsage(org.apache.maven.it.MavenITmng4270ArtifactHandlersFromPluginDepsTest)
  testitMakeRoot(org.apache.maven.it.MavenITmng4262MakeLikeReactorDottedPathTest)
  testitMakeModule(org.apache.maven.it.MavenITmng4262MakeLikeReactorDottedPathTest)
  testit(org.apache.maven.it.MavenITmng4129PluginExecutionInheritanceTest)
  testitWithoutPluginMngt(org.apache.maven.it.MavenITmng4000MultiPluginExecutionsTest)
  testitWithPluginMngt(org.apache.maven.it.MavenITmng4000MultiPluginExecutionsTest)
  testitMNG3998(org.apache.maven.it.MavenITmng3998PluginExecutionConfigTest)
  testitMNG3943(org.apache.maven.it.MavenITmng3943PluginExecutionInheritanceTest)
  testitWithoutPluginMngt(org.apache.maven.it.MavenITmng3938MergePluginExecutionsTest)
  testitWithPluginMngt(org.apache.maven.it.MavenITmng3938MergePluginExecutionsTest)
  testitWithoutPluginMngt(org.apache.maven.it.MavenITmng3937MergedPluginExecutionGoalsTest)
  testitWithPluginMngt(org.apache.maven.it.MavenITmng3937MergedPluginExecutionGoalsTest)
  testitWithoutPluginMngt(org.apache.maven.it.MavenITmng3925MergedPluginExecutionOrderTest)
  testitWithPluginMngt(org.apache.maven.it.MavenITmng3925MergedPluginExecutionOrderTest)
  testitMNG3916(org.apache.maven.it.MavenITmng3916PluginExecutionInheritanceTest)
  testitWithoutPluginMngt(org.apache.maven.it.MavenITmng3887PluginExecutionOrderTest)
  testitWithPluginMngt(org.apache.maven.it.MavenITmng3887PluginExecutionOrderTest)
  testitWithoutPluginMngt(org.apache.maven.it.MavenITmng3886ExecutionGoalsOrderTest)
  testitWithPluginMngt(org.apache.maven.it.MavenITmng3886ExecutionGoalsOrderTest)
  testitWithoutPluginMngt(org.apache.maven.it.MavenITmng3873MultipleExecutionGoalsTest)
  testitWithPluginMngt(org.apache.maven.it.MavenITmng3873MultipleExecutionGoalsTest)
  testitMNG3719(org.apache.maven.it.MavenITmng3719PomExecutionOrderingTest)
  testitMNG3679(org.apache.maven.it.MavenITmng3679PluginExecIdInterpolationTest)
  testProjectPackagingUsage(org.apache.maven.it.MavenITmng3506ArtifactHandlersFromPluginsTest)
  testitMNG2843(org.apache.maven.it.MavenITmng2843PluginConfigPropertiesInjectionTest)
  testitMakeOnlyList(org.apache.maven.it.MavenITmng2576MakeLikeReactorTest)
  testitMakeUpstream(org.apache.maven.it.MavenITmng2576MakeLikeReactorTest)
  testitMakeDownstream(org.apache.maven.it.MavenITmng2576MakeLikeReactorTest)
  testitMakeBoth(org.apache.maven.it.MavenITmng2576MakeLikeReactorTest)
  testitMatchesByBasedir(org.apache.maven.it.MavenITmng2576MakeLikeReactorTest)
  testitMatchesById(org.apache.maven.it.MavenITmng2576MakeLikeReactorTest)
  testitMatchesByArtifactId(org.apache.maven.it.MavenITmng2576MakeLikeReactorTest)
  testitResumeFrom(org.apache.maven.it.MavenITmng2576MakeLikeReactorTest)
  testit(org.apache.maven.it.MavenITmng2363BasedirAwareFileActivatorTest)
  testitMNG2054(org.apache.maven.it.MavenITmng2054PluginExecutionInheritanceTest)
  testitMNG522(org.apache.maven.it.MavenITmng0522InheritedPluginMgmtConfigTest)
  testitMNG496(org.apache.maven.it.MavenITmng0496IgnoreUnknownPluginParametersTest)
  testitMNG282(org.apache.maven.it.MavenITmng0282NonReactorExecWhenProjectIndependentTest)
  testit0144(org.apache.maven.it.MavenIT0144LifecycleExecutionOrderTest)
  testit0138(org.apache.maven.it.MavenIT0138PluginLifecycleTest)
  testit0137(org.apache.maven.it.MavenIT0137EarLifecycleTest)
  testit0136(org.apache.maven.it.MavenIT0136RarLifecycleTest)
  testit0135(org.apache.maven.it.MavenIT0135EjbLifecycleTest)
  testit0134(org.apache.maven.it.MavenIT0134WarLifecycleTest)
  testit0133(org.apache.maven.it.MavenIT0133JarLifecycleTest)
  testit0132(org.apache.maven.it.MavenIT0132PomLifecycleTest)
  testit0056(org.apache.maven.it.MavenIT0056MultipleGoalExecutionsTest)
  testit0052(org.apache.maven.it.MavenIT0052ReleaseProfileTest)
  testit0051(org.apache.maven.it.MavenIT0051ReleaseProfileTest)
  testit0038(org.apache.maven.it.MavenIT0038AlternatePomFileDifferentDirTest)
  testit0037(org.apache.maven.it.MavenIT0037AlternatePomFileSameDirTest)
  testit0024(org.apache.maven.it.MavenIT0024MultipleGoalExecutionsTest)

Tests run: 553, Failures: 4, Errors: 63, Skipped: 0

[INFO] ------------------------------------------------------------------------
[INFO] BUILD FAILURE
[INFO] ------------------------------------------------------------------------
[INFO] Total time: 1:53:39.360s
[INFO] Finished at: Thu Feb 18 21:53:42 GMT-06:00 2010
[INFO] Final Memory: 7M/53M
[INFO] ------------------------------------------------------------------------
[ERROR] Failed to execute goal org.apache.maven.plugins:maven-surefire-plugin:2.4.3:test (default-test)
on project core-it-suite: There are test failures.

Please refer to /home/hudson/workspace/maven-3.0.x-ITs/jdk/1.5/label/ubuntu/core-integration-tests/target/surefire-reports
for the individual test results.
-> [Help 1]
org.apache.maven.lifecycle.LifecycleExecutionException: Failed to execute goal org.apache.maven.plugins:maven-surefire-plugin:2.4.3:test
(default-test) on project core-it-suite: There are test failures.

Please refer to /home/hudson/workspace/maven-3.0.x-ITs/jdk/1.5/label/ubuntu/core-integration-tests/target/surefire-reports
for the individual test results.
	at org.apache.maven.lifecycle.DefaultLifecycleExecutor.execute(DefaultLifecycleExecutor.java:581)
	at org.apache.maven.lifecycle.DefaultLifecycleExecutor.execute(DefaultLifecycleExecutor.java:324)
	at org.apache.maven.DefaultMaven.doExecute(DefaultMaven.java:247)
	at org.apache.maven.DefaultMaven.execute(DefaultMaven.java:104)
	at org.apache.maven.cli.MavenCli.execute(MavenCli.java:427)
	at org.apache.maven.cli.MavenCli.doMain(MavenCli.java:157)
	at org.apache.maven.cli.MavenCli.main(MavenCli.java:121)
	at sun.reflect.NativeMethodAccessorImpl.invoke0(Native Method)
	at sun.reflect.NativeMethodAccessorImpl.invoke(NativeMethodAccessorImpl.java:39)
	at sun.reflect.DelegatingMethodAccessorImpl.invoke(DelegatingMethodAccessorImpl.java:25)
	at java.lang.reflect.Method.invoke(Method.java:585)
	at org.codehaus.plexus.classworlds.launcher.Launcher.launchEnhanced(Launcher.java:290)
	at org.codehaus.plexus.classworlds.launcher.Launcher.launch(Launcher.java:230)
	at org.codehaus.plexus.classworlds.launcher.Launcher.mainWithExitCode(Launcher.java:409)
	at org.codehaus.plexus.classworlds.launcher.Launcher.main(Launcher.java:352)
Caused by: org.apache.maven.plugin.MojoFailureException: There are test failures.

Please refer to /home/hudson/workspace/maven-3.0.x-ITs/jdk/1.5/label/ubuntu/core-integration-tests/target/surefire-reports
for the individual test results.
	at org.apache.maven.plugin.surefire.SurefirePlugin.execute(SurefirePlugin.java:575)
	at org.apache.maven.plugin.DefaultBuildPluginManager.executeMojo(DefaultBuildPluginManager.java:105)
	at org.apache.maven.lifecycle.DefaultLifecycleExecutor.execute(DefaultLifecycleExecutor.java:577)
	... 14 more
[ERROR] 
[ERROR] Re-run Maven using the -X switch to enable full debug logging.
[ERROR] 
[ERROR] For more information about the errors and possible solutions, please read the following
articles:
[ERROR] [Help 1] http://cwiki.apache.org/confluence/display/MAVEN/MojoFailureException
Recording Emma reports core-integration-tests/target/site/emma/coverage.xml


Mime
View raw message