maven-notifications mailing list archives

Site index · List index
Message view « Date » · « Thread »
Top « Date » · « Thread »
From Hudson <Hud...@sonatype.org>
Subject Build failed in Hudson: maven-core-integration-testing » 1.5,windows #614
Date Thu, 08 Apr 2010 13:11:07 GMT
See <http://grid.sonatype.org/ci/job/maven-core-integration-testing/./jdk=1.5,label=windows/614/changes>

Changes:

[Benjamin Bentmann] [MNG-3092] Version ranges with non-snapshot bounds can contain snapshot
versions

o Added IT

[Benjamin Bentmann] o Used more interesting packaging

[Benjamin Bentmann] [MNG-4629] [regression] POM validation fails upon non-existing system-scope
dependency

o Added IT

------------------------------------------
[...truncated 4575 lines...]
symbol: class ServletException
                throws IOException, ServletException

C:\home\hudson\workspace\maven-core-integration-testing\jdk\1.5\label\windows\maven-its\core-it-suite\src\test\java\org\apache\maven\it\MavenITmng4500NoUpdateOfTimestampedSnapshotsTest.java:[88,14]
cannot find symbol
symbol  : method start()
location: class org.mortbay.jetty.Server

C:\home\hudson\workspace\maven-core-integration-testing\jdk\1.5\label\windows\maven-its\core-it-suite\src\test\java\org\apache\maven\it\MavenITmng4500NoUpdateOfTimestampedSnapshotsTest.java:[125,18]
cannot find symbol
symbol  : method stop()
location: class org.mortbay.jetty.Server

C:\home\hudson\workspace\maven-core-integration-testing\jdk\1.5\label\windows\maven-its\core-it-suite\src\test\java\org\apache\maven\it\MavenITmng4413MirroringOfDependencyRepoTest.java:[87,14]
cannot find symbol
symbol  : method start()
location: class org.mortbay.jetty.Server

C:\home\hudson\workspace\maven-core-integration-testing\jdk\1.5\label\windows\maven-its\core-it-suite\src\test\java\org\apache\maven\it\MavenITmng4413MirroringOfDependencyRepoTest.java:[108,18]
cannot find symbol
symbol  : method stop()
location: class org.mortbay.jetty.Server

C:\home\hudson\workspace\maven-core-integration-testing\jdk\1.5\label\windows\maven-its\core-it-suite\src\test\java\org\apache\maven\it\MavenITmng4428FollowHttpRedirectTest.java:[132,14]
setHandler(org.mortbay.jetty.Handler) in org.mortbay.jetty.handler.HandlerWrapper cannot be
applied to (org.apache.maven.it.MavenITmng4428FollowHttpRedirectTest.RedirectHandler)

C:\home\hudson\workspace\maven-core-integration-testing\jdk\1.5\label\windows\maven-its\core-it-suite\src\test\java\org\apache\maven\it\MavenITmng4428FollowHttpRedirectTest.java:[133,14]
cannot find symbol
symbol  : method start()
location: class org.mortbay.jetty.Server

C:\home\hudson\workspace\maven-core-integration-testing\jdk\1.5\label\windows\maven-its\core-it-suite\src\test\java\org\apache\maven\it\MavenITmng4428FollowHttpRedirectTest.java:[155,18]
cannot find symbol
symbol  : method stop()
location: class org.mortbay.jetty.Server

C:\home\hudson\workspace\maven-core-integration-testing\jdk\1.5\label\windows\maven-its\core-it-suite\src\test\java\org\apache\maven\it\MavenITmng4428FollowHttpRedirectTest.java:[181,12]
non-static variable this cannot be referenced from a static context

C:\home\hudson\workspace\maven-core-integration-testing\jdk\1.5\label\windows\maven-its\core-it-suite\src\test\java\org\apache\maven\it\MavenITmng4428FollowHttpRedirectTest.java:[182,12]
non-static variable this cannot be referenced from a static context

C:\home\hudson\workspace\maven-core-integration-testing\jdk\1.5\label\windows\maven-its\core-it-suite\src\test\java\org\apache\maven\it\MavenITmng4428FollowHttpRedirectTest.java:[202,40]
cannot find symbol
symbol  : variable HttpServletResponse
location: class org.apache.maven.it.MavenITmng4428FollowHttpRedirectTest.RedirectHandler

C:\home\hudson\workspace\maven-core-integration-testing\jdk\1.5\label\windows\maven-its\core-it-suite\src\test\java\org\apache\maven\it\MavenITmng4428FollowHttpRedirectTest.java:[206,40]
cannot find symbol
symbol  : variable HttpServletResponse
location: class org.apache.maven.it.MavenITmng4428FollowHttpRedirectTest.RedirectHandler

C:\home\hudson\workspace\maven-core-integration-testing\jdk\1.5\label\windows\maven-its\core-it-suite\src\test\java\org\apache\maven\it\MavenITmng4428FollowHttpRedirectTest.java:[218,36]
cannot find symbol
symbol  : variable HttpServletResponse
location: class org.apache.maven.it.MavenITmng4428FollowHttpRedirectTest.RedirectHandler

C:\home\hudson\workspace\maven-core-integration-testing\jdk\1.5\label\windows\maven-its\core-it-suite\src\test\java\org\apache\maven\it\MavenITmng4428FollowHttpRedirectTest.java:[223,36]
cannot find symbol
symbol  : variable HttpServletResponse
location: class org.apache.maven.it.MavenITmng4428FollowHttpRedirectTest.RedirectHandler

C:\home\hudson\workspace\maven-core-integration-testing\jdk\1.5\label\windows\maven-its\core-it-suite\src\test\java\org\apache\maven\it\MavenITmng4428FollowHttpRedirectTest.java:[227,36]
cannot find symbol
symbol  : variable HttpServletResponse
location: class org.apache.maven.it.MavenITmng4428FollowHttpRedirectTest.RedirectHandler

C:\home\hudson\workspace\maven-core-integration-testing\jdk\1.5\label\windows\maven-its\core-it-suite\src\test\java\org\apache\maven\it\MavenITmng4554PluginPrefixMappingUpdateTest.java:[71,47]
cannot find symbol
symbol: class HttpServletRequest
            public void handle( String target, HttpServletRequest request, HttpServletResponse
response, int dispatch )

C:\home\hudson\workspace\maven-core-integration-testing\jdk\1.5\label\windows\maven-its\core-it-suite\src\test\java\org\apache\maven\it\MavenITmng4554PluginPrefixMappingUpdateTest.java:[71,75]
cannot find symbol
symbol: class HttpServletResponse
            public void handle( String target, HttpServletRequest request, HttpServletResponse
response, int dispatch )

C:\home\hudson\workspace\maven-core-integration-testing\jdk\1.5\label\windows\maven-its\core-it-suite\src\test\java\org\apache\maven\it\MavenITmng4554PluginPrefixMappingUpdateTest.java:[72,36]
cannot find symbol
symbol: class ServletException
                throws IOException, ServletException

C:\home\hudson\workspace\maven-core-integration-testing\jdk\1.5\label\windows\maven-its\core-it-suite\src\test\java\org\apache\maven\it\MavenITmng4554PluginPrefixMappingUpdateTest.java:[88,14]
cannot find symbol
symbol  : method start()
location: class org.mortbay.jetty.Server

C:\home\hudson\workspace\maven-core-integration-testing\jdk\1.5\label\windows\maven-its\core-it-suite\src\test\java\org\apache\maven\it\MavenITmng4554PluginPrefixMappingUpdateTest.java:[129,18]
cannot find symbol
symbol  : method stop()
location: class org.mortbay.jetty.Server

C:\home\hudson\workspace\maven-core-integration-testing\jdk\1.5\label\windows\maven-its\core-it-suite\src\test\java\org\apache\maven\it\MavenITmng4554PluginPrefixMappingUpdateTest.java:[148,47]
cannot find symbol
symbol: class HttpServletRequest
            public void handle( String target, HttpServletRequest request, HttpServletResponse
response, int dispatch )

C:\home\hudson\workspace\maven-core-integration-testing\jdk\1.5\label\windows\maven-its\core-it-suite\src\test\java\org\apache\maven\it\MavenITmng4554PluginPrefixMappingUpdateTest.java:[148,75]
cannot find symbol
symbol: class HttpServletResponse
            public void handle( String target, HttpServletRequest request, HttpServletResponse
response, int dispatch )

C:\home\hudson\workspace\maven-core-integration-testing\jdk\1.5\label\windows\maven-its\core-it-suite\src\test\java\org\apache\maven\it\MavenITmng4554PluginPrefixMappingUpdateTest.java:[149,36]
cannot find symbol
symbol: class ServletException
                throws IOException, ServletException

C:\home\hudson\workspace\maven-core-integration-testing\jdk\1.5\label\windows\maven-its\core-it-suite\src\test\java\org\apache\maven\it\MavenITmng4554PluginPrefixMappingUpdateTest.java:[165,14]
cannot find symbol
symbol  : method start()
location: class org.mortbay.jetty.Server

C:\home\hudson\workspace\maven-core-integration-testing\jdk\1.5\label\windows\maven-its\core-it-suite\src\test\java\org\apache\maven\it\MavenITmng4554PluginPrefixMappingUpdateTest.java:[207,18]
cannot find symbol
symbol  : method stop()
location: class org.mortbay.jetty.Server

C:\home\hudson\workspace\maven-core-integration-testing\jdk\1.5\label\windows\maven-its\core-it-suite\src\test\java\org\apache\maven\it\MavenITmng4554PluginPrefixMappingUpdateTest.java:[228,47]
cannot find symbol
symbol: class HttpServletRequest
            public void handle( String target, HttpServletRequest request, HttpServletResponse
response, int dispatch )

C:\home\hudson\workspace\maven-core-integration-testing\jdk\1.5\label\windows\maven-its\core-it-suite\src\test\java\org\apache\maven\it\MavenITmng4554PluginPrefixMappingUpdateTest.java:[228,75]
cannot find symbol
symbol: class HttpServletResponse
            public void handle( String target, HttpServletRequest request, HttpServletResponse
response, int dispatch )

C:\home\hudson\workspace\maven-core-integration-testing\jdk\1.5\label\windows\maven-its\core-it-suite\src\test\java\org\apache\maven\it\MavenITmng4554PluginPrefixMappingUpdateTest.java:[229,36]
cannot find symbol
symbol: class ServletException
                throws IOException, ServletException

C:\home\hudson\workspace\maven-core-integration-testing\jdk\1.5\label\windows\maven-its\core-it-suite\src\test\java\org\apache\maven\it\MavenITmng4554PluginPrefixMappingUpdateTest.java:[245,14]
cannot find symbol
symbol  : method start()
location: class org.mortbay.jetty.Server

C:\home\hudson\workspace\maven-core-integration-testing\jdk\1.5\label\windows\maven-its\core-it-suite\src\test\java\org\apache\maven\it\MavenITmng4554PluginPrefixMappingUpdateTest.java:[291,18]
cannot find symbol
symbol  : method stop()
location: class org.mortbay.jetty.Server

C:\home\hudson\workspace\maven-core-integration-testing\jdk\1.5\label\windows\maven-its\core-it-suite\src\test\java\org\apache\maven\it\MavenITmng2305MultipleProxiesTest.java:[77,27]
cannot find symbol
symbol  : constructor RepoHandler()
location: class org.apache.maven.it.MavenITmng2305MultipleProxiesTest.RepoHandler

C:\home\hudson\workspace\maven-core-integration-testing\jdk\1.5\label\windows\maven-its\core-it-suite\src\test\java\org\apache\maven\it\MavenITmng2305MultipleProxiesTest.java:[78,14]
cannot find symbol
symbol  : method start()
location: class org.mortbay.jetty.Server

C:\home\hudson\workspace\maven-core-integration-testing\jdk\1.5\label\windows\maven-its\core-it-suite\src\test\java\org\apache\maven\it\MavenITmng2305MultipleProxiesTest.java:[106,18]
cannot find symbol
symbol  : method stop()
location: class org.mortbay.jetty.Server

C:\home\hudson\workspace\maven-core-integration-testing\jdk\1.5\label\windows\maven-its\core-it-suite\src\test\java\org\apache\maven\it\MavenITmng2305MultipleProxiesTest.java:[137,36]
cannot find symbol
symbol  : variable HttpServletResponse
location: class org.apache.maven.it.MavenITmng2305MultipleProxiesTest.RepoHandler

C:\home\hudson\workspace\maven-core-integration-testing\jdk\1.5\label\windows\maven-its\core-it-suite\src\test\java\org\apache\maven\it\MavenITmng2305MultipleProxiesTest.java:[147,36]
cannot find symbol
symbol  : variable HttpServletResponse
location: class org.apache.maven.it.MavenITmng2305MultipleProxiesTest.RepoHandler

C:\home\hudson\workspace\maven-core-integration-testing\jdk\1.5\label\windows\maven-its\core-it-suite\src\test\java\org\apache\maven\it\MavenITmng2305MultipleProxiesTest.java:[152,36]
cannot find symbol
symbol  : variable HttpServletResponse
location: class org.apache.maven.it.MavenITmng2305MultipleProxiesTest.RepoHandler

C:\home\hudson\workspace\maven-core-integration-testing\jdk\1.5\label\windows\maven-its\core-it-suite\src\test\java\org\apache\maven\it\MavenITmng2305MultipleProxiesTest.java:[156,36]
cannot find symbol
symbol  : variable HttpServletResponse
location: class org.apache.maven.it.MavenITmng2305MultipleProxiesTest.RepoHandler

C:\home\hudson\workspace\maven-core-integration-testing\jdk\1.5\label\windows\maven-its\core-it-suite\src\test\java\org\apache\maven\it\MavenITmng3599useHttpProxyForWebDAVTest.java:[75,47]
cannot find symbol
symbol: class HttpServletRequest
            public void handle( String target, HttpServletRequest request, HttpServletResponse
response, int dispatch )

C:\home\hudson\workspace\maven-core-integration-testing\jdk\1.5\label\windows\maven-its\core-it-suite\src\test\java\org\apache\maven\it\MavenITmng3599useHttpProxyForWebDAVTest.java:[75,75]
cannot find symbol
symbol: class HttpServletResponse
            public void handle( String target, HttpServletRequest request, HttpServletResponse
response, int dispatch )

C:\home\hudson\workspace\maven-core-integration-testing\jdk\1.5\label\windows\maven-its\core-it-suite\src\test\java\org\apache\maven\it\MavenITmng3599useHttpProxyForWebDAVTest.java:[76,36]
cannot find symbol
symbol: class ServletException
                throws IOException, ServletException

C:\home\hudson\workspace\maven-core-integration-testing\jdk\1.5\label\windows\maven-its\core-it-suite\src\test\java\org\apache\maven\it\MavenITmng3599useHttpProxyForWebDAVTest.java:[86,40]
cannot find symbol
symbol: variable HttpServletResponse
                    response.setStatus( HttpServletResponse.SC_OK );

C:\home\hudson\workspace\maven-core-integration-testing\jdk\1.5\label\windows\maven-its\core-it-suite\src\test\java\org\apache\maven\it\MavenITmng3599useHttpProxyForWebDAVTest.java:[102,40]
cannot find symbol
symbol: variable HttpServletResponse
                    response.setStatus( HttpServletResponse.SC_OK );

C:\home\hudson\workspace\maven-core-integration-testing\jdk\1.5\label\windows\maven-its\core-it-suite\src\test\java\org\apache\maven\it\MavenITmng3599useHttpProxyForWebDAVTest.java:[109,40]
cannot find symbol
symbol: variable HttpServletResponse
                    response.setStatus( HttpServletResponse.SC_BAD_REQUEST );

C:\home\hudson\workspace\maven-core-integration-testing\jdk\1.5\label\windows\maven-its\core-it-suite\src\test\java\org\apache\maven\it\MavenITmng3599useHttpProxyForWebDAVTest.java:[120,14]
cannot find symbol
symbol  : method start()
location: class org.mortbay.jetty.Server

C:\home\hudson\workspace\maven-core-integration-testing\jdk\1.5\label\windows\maven-its\core-it-suite\src\test\java\org\apache\maven\it\MavenITmng3599useHttpProxyForWebDAVTest.java:[130,20]
operator != cannot be applied to org.mortbay.jetty.Server,<nulltype>

C:\home\hudson\workspace\maven-core-integration-testing\jdk\1.5\label\windows\maven-its\core-it-suite\src\test\java\org\apache\maven\it\MavenITmng3599useHttpProxyForWebDAVTest.java:[132,18]
cannot find symbol
symbol  : method stop()
location: class org.mortbay.jetty.Server

C:\home\hudson\workspace\maven-core-integration-testing\jdk\1.5\label\windows\maven-its\core-it-suite\src\test\java\org\apache\maven\it\MavenITmng4326LocalSnapshotSuppressesRemoteCheckTest.java:[78,47]
cannot find symbol
symbol: class HttpServletRequest
            public void handle( String target, HttpServletRequest request, HttpServletResponse
response, int dispatch )

C:\home\hudson\workspace\maven-core-integration-testing\jdk\1.5\label\windows\maven-its\core-it-suite\src\test\java\org\apache\maven\it\MavenITmng4326LocalSnapshotSuppressesRemoteCheckTest.java:[78,75]
cannot find symbol
symbol: class HttpServletResponse
            public void handle( String target, HttpServletRequest request, HttpServletResponse
response, int dispatch )

C:\home\hudson\workspace\maven-core-integration-testing\jdk\1.5\label\windows\maven-its\core-it-suite\src\test\java\org\apache\maven\it\MavenITmng4326LocalSnapshotSuppressesRemoteCheckTest.java:[79,36]
cannot find symbol
symbol: class ServletException
                throws IOException, ServletException

C:\home\hudson\workspace\maven-core-integration-testing\jdk\1.5\label\windows\maven-its\core-it-suite\src\test\java\org\apache\maven\it\MavenITmng4326LocalSnapshotSuppressesRemoteCheckTest.java:[97,40]
cannot find symbol
symbol: variable HttpServletResponse
                    response.setStatus( HttpServletResponse.SC_OK );

C:\home\hudson\workspace\maven-core-integration-testing\jdk\1.5\label\windows\maven-its\core-it-suite\src\test\java\org\apache\maven\it\MavenITmng4326LocalSnapshotSuppressesRemoteCheckTest.java:[113,40]
cannot find symbol
symbol: variable HttpServletResponse
                    response.setStatus( HttpServletResponse.SC_OK );

C:\home\hudson\workspace\maven-core-integration-testing\jdk\1.5\label\windows\maven-its\core-it-suite\src\test\java\org\apache\maven\it\MavenITmng4326LocalSnapshotSuppressesRemoteCheckTest.java:[123,40]
cannot find symbol
symbol: variable HttpServletResponse
                    response.setStatus( HttpServletResponse.SC_OK );

C:\home\hudson\workspace\maven-core-integration-testing\jdk\1.5\label\windows\maven-its\core-it-suite\src\test\java\org\apache\maven\it\MavenITmng4326LocalSnapshotSuppressesRemoteCheckTest.java:[128,40]
cannot find symbol
symbol: variable HttpServletResponse
                    response.setStatus( HttpServletResponse.SC_NOT_FOUND );

C:\home\hudson\workspace\maven-core-integration-testing\jdk\1.5\label\windows\maven-its\core-it-suite\src\test\java\org\apache\maven\it\MavenITmng4326LocalSnapshotSuppressesRemoteCheckTest.java:[137,14]
cannot find symbol
symbol  : method start()
location: class org.mortbay.jetty.Server

C:\home\hudson\workspace\maven-core-integration-testing\jdk\1.5\label\windows\maven-its\core-it-suite\src\test\java\org\apache\maven\it\MavenITmng4326LocalSnapshotSuppressesRemoteCheckTest.java:[178,18]
cannot find symbol
symbol  : method stop()
location: class org.mortbay.jetty.Server

C:\home\hudson\workspace\maven-core-integration-testing\jdk\1.5\label\windows\maven-its\core-it-suite\src\test\java\org\apache\maven\it\MavenITmng4360WebDavSupportTest.java:[86,47]
cannot find symbol
symbol: class HttpServletRequest
            public void handle( String target, HttpServletRequest request, HttpServletResponse
response, int dispatch )

C:\home\hudson\workspace\maven-core-integration-testing\jdk\1.5\label\windows\maven-its\core-it-suite\src\test\java\org\apache\maven\it\MavenITmng4360WebDavSupportTest.java:[86,75]
cannot find symbol
symbol: class HttpServletResponse
            public void handle( String target, HttpServletRequest request, HttpServletResponse
response, int dispatch )
-> [Help 1]
org.apache.maven.lifecycle.LifecycleExecutionException: Failed to execute goal org.apache.maven.plugins:maven-compiler-plugin:2.0.2:testCompile
(default-testCompile) on project core-it-suite: Compilation failure
	at org.apache.maven.lifecycle.DefaultLifecycleExecutor.execute(DefaultLifecycleExecutor.java:566)
	at org.apache.maven.lifecycle.DefaultLifecycleExecutor.execute(DefaultLifecycleExecutor.java:317)
	at org.apache.maven.DefaultMaven.doExecute(DefaultMaven.java:247)
	at org.apache.maven.DefaultMaven.execute(DefaultMaven.java:104)
	at org.apache.maven.cli.MavenCli.execute(MavenCli.java:423)
	at org.apache.maven.cli.MavenCli.doMain(MavenCli.java:158)
	at org.apache.maven.cli.MavenCli.main(MavenCli.java:123)
	at sun.reflect.NativeMethodAccessorImpl.invoke0(Native Method)
	at sun.reflect.NativeMethodAccessorImpl.invoke(NativeMethodAccessorImpl.java:39)
	at sun.reflect.DelegatingMethodAccessorImpl.invoke(DelegatingMethodAccessorImpl.java:25)
	at java.lang.reflect.Method.invoke(Method.java:585)
	at org.codehaus.plexus.classworlds.launcher.Launcher.launchEnhanced(Launcher.java:290)
	at org.codehaus.plexus.classworlds.launcher.Launcher.launch(Launcher.java:230)
	at org.codehaus.plexus.classworlds.launcher.Launcher.mainWithExitCode(Launcher.java:409)
	at org.codehaus.plexus.classworlds.launcher.Launcher.main(Launcher.java:352)
Caused by: org.apache.maven.plugin.CompilationFailureException: Compilation failure
	at org.apache.maven.plugin.AbstractCompilerMojo.execute(AbstractCompilerMojo.java:516)
	at org.apache.maven.plugin.TestCompilerMojo.execute(TestCompilerMojo.java:102)
	at org.apache.maven.plugin.DefaultBuildPluginManager.executeMojo(DefaultBuildPluginManager.java:105)
	at org.apache.maven.lifecycle.DefaultLifecycleExecutor.execute(DefaultLifecycleExecutor.java:562)
	... 14 more
[ERROR] 
[ERROR] Re-run Maven using the -X switch to enable full debug logging.
[ERROR] 
[ERROR] For more information about the errors and possible solutions, please read the following
articles:
[ERROR] [Help 1] http://cwiki.apache.org/confluence/display/MAVEN/MojoFailureException
[ERROR] 
[ERROR] After correcting the problems, you can resume the build with the command
[ERROR]   mvn <goals> -rf :core-it-suite


Mime
View raw message