maven-notifications mailing list archives

Site index · List index
Message view « Date » · « Thread »
Top « Date » · « Thread »
From Hudson <Hud...@sonatype.org>
Subject Build failed in Hudson: maven-plugins-ITs » 1.5,ubuntu #417
Date Tue, 13 Apr 2010 22:21:30 GMT
See <http://grid.sonatype.org/ci/job/maven-plugins-ITs/./jdk=1.5,label=ubuntu/417/changes>

Changes:

[John Casey] [MJAVADOC-280] Reinstating invoker.properties-driven ITs for second and fourth
tests of -280, in order to avoid two-stage invoker plugin execution.

------------------------------------------
[...truncated 5456 lines...]
[INFO] Processing war project
[INFO] Copying webapp resources[/home/hudson/workspace/maven-plugins-ITs/jdk/1.5/label/ubuntu/trunk/maven-war-plugin/target/test-classes/unit/warexplodedmojo/test-dir/ExplodedWarWithSourceModificationCheck-test-data/source]
[INFO] Webapp assembled in [13 msecs]
[INFO] Exploding webapp
[INFO] Assembling webapp[maven-war-plugin-test] in [/home/hudson/workspace/maven-plugins-ITs/jdk/1.5/label/ubuntu/trunk/maven-war-plugin/target/test-classes/unit/warexplodedmojo/test-dir/ExplodedWarWithFileNameMapping]
[INFO] Processing war project
[INFO] Copying webapp resources[/home/hudson/workspace/maven-plugins-ITs/jdk/1.5/label/ubuntu/trunk/maven-war-plugin/target/test-classes/unit/warexplodedmojo/test-dir/ExplodedWarWithFileNameMapping-test-data/source]
[INFO] Webapp assembled in [21 msecs]
[INFO] Exploding webapp
[INFO] Assembling webapp[maven-war-plugin-test] in [/home/hudson/workspace/maven-plugins-ITs/jdk/1.5/label/ubuntu/trunk/maven-war-plugin/target/test-classes/unit/warexplodedmojo/test-dir/ExplodedWarWithFileNameMappingAndDuplicateDependencies]
[INFO] Processing war project
[INFO] Copying webapp resources[/home/hudson/workspace/maven-plugins-ITs/jdk/1.5/label/ubuntu/trunk/maven-war-plugin/target/test-classes/unit/warexplodedmojo/test-dir/ExplodedWarWithFileNameMappingAndDuplicateDependencies-test-data/source]
[INFO] Webapp assembled in [5 msecs]
Tests run: 20, Failures: 0, Errors: 0, Skipped: 0, Time elapsed: 1.609 sec
Running org.apache.maven.plugin.war.WarInPlaceMojoTest
[INFO] Generating webapp in source directory[/home/hudson/workspace/maven-plugins-ITs/jdk/1.5/label/ubuntu/trunk/maven-war-plugin/target/test-classes/unit/warexplodedinplacemojo/test-dir/SimpleExplodedInplaceWar-test-data/source]
[INFO] Assembling webapp[maven-war-plugin-test] in [/home/hudson/workspace/maven-plugins-ITs/jdk/1.5/label/ubuntu/trunk/maven-war-plugin/target/test-classes/unit/warexplodedinplacemojo/test-dir/SimpleExplodedInplaceWar-test-data/source]
[INFO] Processing war project
[INFO] Copying webapp webResources[/home/hudson/workspace/maven-plugins-ITs/jdk/1.5/label/ubuntu/trunk/maven-war-plugin/target/test-classes/unit/warexplodedinplacemojo/test-dir/resources]
to[/home/hudson/workspace/maven-plugins-ITs/jdk/1.5/label/ubuntu/trunk/maven-war-plugin/target/test-classes/unit/warexplodedinplacemojo/test-dir/SimpleExplodedInplaceWar-test-data/source]
[INFO] Webapp assembled in [3 msecs]
Tests run: 2, Failures: 0, Errors: 0, Skipped: 0, Time elapsed: 0.08 sec
Running org.apache.maven.plugin.war.WarManifestMojoTest
Tests run: 5, Failures: 0, Errors: 0, Skipped: 0, Time elapsed: 0.205 sec
Running org.apache.maven.plugin.war.util.PathSetTest
Tests run: 5, Failures: 0, Errors: 0, Skipped: 0, Time elapsed: 0.006 sec
Running org.apache.maven.plugin.war.util.WarUtilsTest
Tests run: 1, Failures: 0, Errors: 0, Skipped: 0, Time elapsed: 0.002 sec
Running org.apache.maven.plugin.war.overlay.OverlayManagerTest
Tests run: 6, Failures: 0, Errors: 0, Skipped: 0, Time elapsed: 0.169 sec
Running org.apache.maven.plugin.war.WarDependenciesAnalysisTest
[INFO] Exploding webapp
[INFO] Assembling webapp[maven-war-plugin-test] in [/home/hudson/workspace/maven-plugins-ITs/jdk/1.5/label/ubuntu/trunk/maven-war-plugin/target/test-classes/unit/dependenciesanalysis/test-dir/no-change]
[INFO] Processing war project
[INFO] Copying webapp resources[/home/hudson/workspace/maven-plugins-ITs/jdk/1.5/label/ubuntu/trunk/maven-war-plugin/target/test-classes/unit/dependenciesanalysis/test-dir/no-change-test-data/source]
[INFO] Webapp assembled in [31 msecs]
[INFO] Exploding webapp
[INFO] Assembling webapp[maven-war-plugin-test] in [/home/hudson/workspace/maven-plugins-ITs/jdk/1.5/label/ubuntu/trunk/maven-war-plugin/target/test-classes/unit/dependenciesanalysis/test-dir/no-change]
[INFO] Processing war project
[INFO] Copying webapp resources[/home/hudson/workspace/maven-plugins-ITs/jdk/1.5/label/ubuntu/trunk/maven-war-plugin/target/test-classes/unit/dependenciesanalysis/test-dir/no-change-test-data/source]
[INFO] Webapp assembled in [4 msecs]
[INFO] Exploding webapp
[INFO] Assembling webapp[maven-war-plugin-test] in [/home/hudson/workspace/maven-plugins-ITs/jdk/1.5/label/ubuntu/trunk/maven-war-plugin/target/test-classes/unit/dependenciesanalysis/test-dir/remove-dependency]
[INFO] Processing war project
[INFO] Copying webapp resources[/home/hudson/workspace/maven-plugins-ITs/jdk/1.5/label/ubuntu/trunk/maven-war-plugin/target/test-classes/unit/dependenciesanalysis/test-dir/remove-dependency-test-data/source]
[INFO] Webapp assembled in [31 msecs]
[INFO] Exploding webapp
[INFO] Assembling webapp[maven-war-plugin-test] in [/home/hudson/workspace/maven-plugins-ITs/jdk/1.5/label/ubuntu/trunk/maven-war-plugin/target/test-classes/unit/dependenciesanalysis/test-dir/remove-dependency]
[INFO] Dependency[Dependency {groupId=org.sample.jar, artifactId=lib-test, version=1.0, type=jar}]
has been removed from the project.
[INFO] Processing war project
[INFO] Copying webapp resources[/home/hudson/workspace/maven-plugins-ITs/jdk/1.5/label/ubuntu/trunk/maven-war-plugin/target/test-classes/unit/dependenciesanalysis/test-dir/remove-dependency-test-data/source]
[INFO] Webapp assembled in [3 msecs]
[INFO] Exploding webapp
[INFO] Assembling webapp[maven-war-plugin-test] in [/home/hudson/workspace/maven-plugins-ITs/jdk/1.5/label/ubuntu/trunk/maven-war-plugin/target/test-classes/unit/dependenciesanalysis/test-dir/dependency-update-version]
[INFO] Processing war project
[INFO] Copying webapp resources[/home/hudson/workspace/maven-plugins-ITs/jdk/1.5/label/ubuntu/trunk/maven-war-plugin/target/test-classes/unit/dependenciesanalysis/test-dir/dependency-update-version-test-data/source]
[INFO] Webapp assembled in [6 msecs]
[INFO] Exploding webapp
[INFO] Assembling webapp[maven-war-plugin-test] in [/home/hudson/workspace/maven-plugins-ITs/jdk/1.5/label/ubuntu/trunk/maven-war-plugin/target/test-classes/unit/dependenciesanalysis/test-dir/dependency-update-version]
[INFO] Version of dependency[Dependency {groupId=org.sample.jar, artifactId=lib-test, version=2.0,
type=jar}] has changed (1.0 -> 2.0).
[INFO] Processing war project
[INFO] Copying webapp resources[/home/hudson/workspace/maven-plugins-ITs/jdk/1.5/label/ubuntu/trunk/maven-war-plugin/target/test-classes/unit/dependenciesanalysis/test-dir/dependency-update-version-test-data/source]
[INFO] Webapp assembled in [4 msecs]
[INFO] Exploding webapp
[INFO] Assembling webapp[maven-war-plugin-test] in [/home/hudson/workspace/maven-plugins-ITs/jdk/1.5/label/ubuntu/trunk/maven-war-plugin/target/test-classes/unit/dependenciesanalysis/test-dir/dependency-now-provided]
[INFO] Processing war project
[INFO] Copying webapp resources[/home/hudson/workspace/maven-plugins-ITs/jdk/1.5/label/ubuntu/trunk/maven-war-plugin/target/test-classes/unit/dependenciesanalysis/test-dir/dependency-now-provided-test-data/source]
[INFO] Webapp assembled in [6 msecs]
[INFO] Exploding webapp
[INFO] Assembling webapp[maven-war-plugin-test] in [/home/hudson/workspace/maven-plugins-ITs/jdk/1.5/label/ubuntu/trunk/maven-war-plugin/target/test-classes/unit/dependenciesanalysis/test-dir/dependency-now-provided]
[INFO] Scope of dependency[Dependency {groupId=org.sample.jar, artifactId=lib-test, version=1.0,
type=jar}] has changed (runtime -> provided).
[INFO] Processing war project
[INFO] Copying webapp resources[/home/hudson/workspace/maven-plugins-ITs/jdk/1.5/label/ubuntu/trunk/maven-war-plugin/target/test-classes/unit/dependenciesanalysis/test-dir/dependency-now-provided-test-data/source]
[INFO] Webapp assembled in [3 msecs]
Tests run: 4, Failures: 0, Errors: 0, Skipped: 0, Time elapsed: 0.308 sec

Results :

Tests run: 81, Failures: 0, Errors: 0, Skipped: 0

[INFO] [jar:jar {execution: default-jar}]
[INFO] Building jar: /home/hudson/workspace/maven-plugins-ITs/jdk/1.5/label/ubuntu/trunk/maven-war-plugin/target/maven-war-plugin-2.1-beta-2-SNAPSHOT.jar
[INFO] [plugin:addPluginArtifactMetadata {execution: default-addPluginArtifactMetadata}]
[INFO] [invoker:install {execution: integration-test}]
[INFO] Installing /home/hudson/workspace/maven-plugins-ITs/jdk/1.5/label/ubuntu/trunk/maven-war-plugin/pom.xml
to /home/hudson/workspace/maven-plugins-ITs/jdk/1.5/label/ubuntu/trunk/maven-war-plugin/target/local-repo/org/apache/maven/plugins/maven-war-plugin/2.1-beta-2-SNAPSHOT/maven-war-plugin-2.1-beta-2-SNAPSHOT.pom
[INFO] Installing /home/hudson/workspace/maven-plugins-ITs/jdk/1.5/label/ubuntu/trunk/maven-war-plugin/target/maven-war-plugin-2.1-beta-2-SNAPSHOT.jar
to /home/hudson/workspace/maven-plugins-ITs/jdk/1.5/label/ubuntu/trunk/maven-war-plugin/target/local-repo/org/apache/maven/plugins/maven-war-plugin/2.1-beta-2-SNAPSHOT/maven-war-plugin-2.1-beta-2-SNAPSHOT.jar
[INFO] [invoker:run {execution: integration-test}]
[INFO] Building: web-resources-filtering/pom.xml
[INFO] ..SUCCESS (15.1 s)
[INFO] Building: MWAR-96/pom.xml
[INFO] ..SUCCESS (3.8 s)
[INFO] Building: MWAR-62/pom.xml
[INFO] ..SUCCESS (3.3 s)
[INFO] Building: default/pom.xml
[INFO] ..SUCCESS (6.0 s)
[INFO] Building: simple-war-no-webxml/pom.xml
[INFO] ..SUCCESS (4.5 s)
[INFO] Building: scoped-dependency-same-artifact/pom.xml
[INFO] ..SUCCESS (5.7 s)
[INFO] Building: MWAR-143/pom.xml
[INFO] ..SUCCESS (8.8 s)
[INFO] Building: MWAR-139/pom.xml
[INFO] ..SUCCESS (4.2 s)
[INFO] Building: simple-war-project/pom.xml
[INFO] ..SUCCESS (4.1 s)
[INFO] Building: MWAR-129/pom.xml
[INFO] ..SUCCESS (3.4 s)
[INFO] Building: MWAR-133/pom.xml
[INFO] ..SUCCESS (3.5 s)
[INFO] Building: MWAR-131/pom.xml
[INFO] ..SUCCESS (20.4 s)
[INFO] ---------------------------------------
[INFO] Execution Summary:
[INFO]   Builds Passing: 12
[INFO]   Builds Failing: 0
[INFO]   Builds Skipped: 0
[INFO] ---------------------------------------
[INFO] [install:install {execution: default-install}]
[INFO] Installing /home/hudson/workspace/maven-plugins-ITs/jdk/1.5/label/ubuntu/trunk/maven-war-plugin/target/maven-war-plugin-2.1-beta-2-SNAPSHOT.jar
to /opt/repos/local-repository/org/apache/maven/plugins/maven-war-plugin/2.1-beta-2-SNAPSHOT/maven-war-plugin-2.1-beta-2-SNAPSHOT.jar
[INFO] [deploy:deploy {execution: default-deploy}]
[INFO] Retrieving previous build number from apache.snapshots.https
Uploading: http://repository.sonatype.org:8081/content/repositories/maven.snapshots/org/apache/maven/plugins/maven-war-plugin/2.1-beta-2-SNAPSHOT/maven-war-plugin-2.1-beta-2-20100413.205234-418.jar
74K uploaded  (maven-war-plugin-2.1-beta-2-20100413.205234-418.jar)
[INFO] Retrieving previous metadata from apache.snapshots.https
[INFO] Uploading repository metadata for: 'artifact org.apache.maven.plugins:maven-war-plugin'
[INFO] Retrieving previous metadata from apache.snapshots.https
[INFO] Uploading repository metadata for: 'snapshot org.apache.maven.plugins:maven-war-plugin:2.1-beta-2-SNAPSHOT'
[INFO] Retrieving previous metadata from apache.snapshots.https
[INFO] Uploading repository metadata for: 'org.apache.maven.plugins'
[INFO] Uploading project information for maven-war-plugin 2.1-beta-2-20100413.205234-418
[INFO] 
[INFO] 
[INFO] ------------------------------------------------------------------------
[INFO] Reactor Summary:
[INFO] ------------------------------------------------------------------------
[INFO] Maven Plugins ......................................... SUCCESS [36.541s]
[INFO] Maven Invoker Plugin .................................. SUCCESS [5:02.908s]
[INFO] Maven Ant Plugin ...................................... SUCCESS [2:11.409s]
[INFO] Maven AntRun Plugin ................................... SUCCESS [1:08.172s]
[INFO] Maven Eclipse Plugin .................................. FAILED [26:18.771s]
[INFO] Maven Site Plugin ..................................... SUCCESS [4:04.208s]
[INFO] Maven Changelog Plugin ................................ SUCCESS [48.793s]
[INFO] Maven Changes Report Plugin ........................... SUCCESS [1:17.852s]
[INFO] Maven Checkstyle Plugin ............................... SUCCESS [2:18.459s]
[INFO] Maven Clean Plugin .................................... SUCCESS [26.416s]
[INFO] Maven Compiler Plugin ................................. SUCCESS [41.749s]
[INFO] Maven Dependency Plugin ............................... SUCCESS [4:09.166s]
[INFO] Maven Deploy Plugin ................................... SUCCESS [1:40.866s]
[INFO] Maven DOAP Plugin ..................................... SUCCESS [21.901s]
[INFO] Maven Documentation Checker Plugin .................... SUCCESS [22.013s]
[INFO] Maven EAR Plugin ...................................... SUCCESS [5:50.286s]
[INFO] Maven EJB Plugin ...................................... SUCCESS [1:05.541s]
[INFO] Maven GPG Plugin ...................................... SUCCESS [34.891s]
[INFO] Maven Help Plugin ..................................... SUCCESS [1:15.327s]
[INFO] Maven IDEA Plugin ..................................... SUCCESS [22.989s]
[INFO] Maven Install Plugin .................................. SUCCESS [1:36.024s]
[INFO] Maven JAR Plugin ...................................... SUCCESS [2:05.534s]
[INFO] Maven Jarsigner Plugin ................................ SUCCESS [57.856s]
[INFO] Maven Shade Plugin .................................... SUCCESS [2:52.498s]
[INFO] Maven Javadoc Plugin .................................. FAILED [12:48.610s]
[INFO] Maven Linkcheck Plugin ................................ SUCCESS [9.405s]
[INFO] Maven One Plugin ...................................... SUCCESS [4.243s]
[INFO] Maven Patch Plugin .................................... SUCCESS [24.359s]
[INFO] Maven PDF Plugin ...................................... SUCCESS [45.495s]
[INFO] Maven PMD Plugin ...................................... SUCCESS [49.579s]
[INFO] Maven RAR Plugin ...................................... SUCCESS [17.265s]
[INFO] Maven Reactor Plugin .................................. SUCCESS [7.485s]
[INFO] Maven Repository Plugin ............................... SUCCESS [1:12.248s]
[INFO] Maven Resources Plugin ................................ SUCCESS [1:16.742s]
[INFO] Maven Source Plugin ................................... SUCCESS [44.235s]
[INFO] Maven Stage Plugin .................................... SUCCESS [4.080s]
[INFO] Maven Toolchains Plugin ............................... SUCCESS [4.045s]
[INFO] Maven Verifier Plugin ................................. SUCCESS [17.729s]
[INFO] Maven WAR Plugin ...................................... SUCCESS [1:48.509s]
[INFO] ------------------------------------------------------------------------
[INFO] Error for project: Maven Eclipse Plugin (during deploy)
[INFO] ------------------------------------------------------------------------
[INFO] There are test failures.

Please refer to /home/hudson/workspace/maven-plugins-ITs/jdk/1.5/label/ubuntu/trunk/maven-eclipse-plugin/target/surefire-reports
for the individual test results.
[INFO] ------------------------------------------------------------------------
[INFO] Trace
org.apache.maven.BuildFailureException: There are test failures.

Please refer to /home/hudson/workspace/maven-plugins-ITs/jdk/1.5/label/ubuntu/trunk/maven-eclipse-plugin/target/surefire-reports
for the individual test results.
	at org.apache.maven.lifecycle.DefaultLifecycleExecutor.executeGoals(DefaultLifecycleExecutor.java:715)
	at org.apache.maven.lifecycle.DefaultLifecycleExecutor.executeGoalWithLifecycle(DefaultLifecycleExecutor.java:556)
	at org.apache.maven.lifecycle.DefaultLifecycleExecutor.executeGoal(DefaultLifecycleExecutor.java:535)
	at org.apache.maven.lifecycle.DefaultLifecycleExecutor.executeGoalAndHandleFailures(DefaultLifecycleExecutor.java:387)
	at org.apache.maven.lifecycle.DefaultLifecycleExecutor.executeTaskSegments(DefaultLifecycleExecutor.java:348)
	at org.apache.maven.lifecycle.DefaultLifecycleExecutor.execute(DefaultLifecycleExecutor.java:180)
	at org.apache.maven.DefaultMaven.doExecute(DefaultMaven.java:328)
	at org.apache.maven.DefaultMaven.execute(DefaultMaven.java:138)
	at org.apache.maven.cli.MavenCli.main(MavenCli.java:362)
	at org.apache.maven.cli.compat.CompatibleMain.main(CompatibleMain.java:60)
	at sun.reflect.NativeMethodAccessorImpl.invoke0(Native Method)
	at sun.reflect.NativeMethodAccessorImpl.invoke(NativeMethodAccessorImpl.java:39)
	at sun.reflect.DelegatingMethodAccessorImpl.invoke(DelegatingMethodAccessorImpl.java:25)
	at java.lang.reflect.Method.invoke(Method.java:585)
	at org.codehaus.classworlds.Launcher.launchEnhanced(Launcher.java:315)
	at org.codehaus.classworlds.Launcher.launch(Launcher.java:255)
	at org.codehaus.classworlds.Launcher.mainWithExitCode(Launcher.java:430)
	at org.codehaus.classworlds.Launcher.main(Launcher.java:375)
Caused by: org.apache.maven.plugin.MojoFailureException: There are test failures.

Please refer to /home/hudson/workspace/maven-plugins-ITs/jdk/1.5/label/ubuntu/trunk/maven-eclipse-plugin/target/surefire-reports
for the individual test results.
	at org.apache.maven.plugin.surefire.SurefirePlugin.execute(SurefirePlugin.java:575)
	at org.apache.maven.plugin.DefaultPluginManager.executeMojo(DefaultPluginManager.java:490)
	at org.apache.maven.lifecycle.DefaultLifecycleExecutor.executeGoals(DefaultLifecycleExecutor.java:694)
	... 17 more
[INFO] ------------------------------------------------------------------------
[INFO] Error for project: Maven Javadoc Plugin (during deploy)
[INFO] ------------------------------------------------------------------------
[INFO] : org.apache.maven.plugin.invoker.InvokerSession@13f6e85
1 build failed.
[INFO] ------------------------------------------------------------------------
[INFO] Trace
org.apache.maven.BuildFailureException: 1 build failed.
	at org.apache.maven.lifecycle.DefaultLifecycleExecutor.executeGoals(DefaultLifecycleExecutor.java:715)
	at org.apache.maven.lifecycle.DefaultLifecycleExecutor.executeGoalWithLifecycle(DefaultLifecycleExecutor.java:556)
	at org.apache.maven.lifecycle.DefaultLifecycleExecutor.executeGoal(DefaultLifecycleExecutor.java:535)
	at org.apache.maven.lifecycle.DefaultLifecycleExecutor.executeGoalAndHandleFailures(DefaultLifecycleExecutor.java:387)
	at org.apache.maven.lifecycle.DefaultLifecycleExecutor.executeTaskSegments(DefaultLifecycleExecutor.java:348)
	at org.apache.maven.lifecycle.DefaultLifecycleExecutor.execute(DefaultLifecycleExecutor.java:180)
	at org.apache.maven.DefaultMaven.doExecute(DefaultMaven.java:328)
	at org.apache.maven.DefaultMaven.execute(DefaultMaven.java:138)
	at org.apache.maven.cli.MavenCli.main(MavenCli.java:362)
	at org.apache.maven.cli.compat.CompatibleMain.main(CompatibleMain.java:60)
	at sun.reflect.NativeMethodAccessorImpl.invoke0(Native Method)
	at sun.reflect.NativeMethodAccessorImpl.invoke(NativeMethodAccessorImpl.java:39)
	at sun.reflect.DelegatingMethodAccessorImpl.invoke(DelegatingMethodAccessorImpl.java:25)
	at java.lang.reflect.Method.invoke(Method.java:585)
	at org.codehaus.classworlds.Launcher.launchEnhanced(Launcher.java:315)
	at org.codehaus.classworlds.Launcher.launch(Launcher.java:255)
	at org.codehaus.classworlds.Launcher.mainWithExitCode(Launcher.java:430)
	at org.codehaus.classworlds.Launcher.main(Launcher.java:375)
Caused by: org.apache.maven.plugin.MojoFailureException: 1 build failed.
	at org.apache.maven.plugin.invoker.InvokerSession.handleFailures(InvokerSession.java:263)
	at org.apache.maven.plugin.invoker.InvokerMojo.processResults(InvokerMojo.java:58)
	at org.apache.maven.plugin.invoker.AbstractInvokerMojo.execute(AbstractInvokerMojo.java:620)
	at org.apache.maven.plugin.DefaultPluginManager.executeMojo(DefaultPluginManager.java:490)
	at org.apache.maven.lifecycle.DefaultLifecycleExecutor.executeGoals(DefaultLifecycleExecutor.java:694)
	... 17 more
[INFO] ------------------------------------------------------------------------
[INFO] BUILD ERRORS
[INFO] ------------------------------------------------------------------------
[INFO] Total time: 89 minutes 6 seconds
[INFO] Finished at: Tue Apr 13 16:21:29 GMT-06:00 2010
[INFO] Final Memory: 64M/133M
[INFO] ------------------------------------------------------------------------


Mime
View raw message