maven-notifications mailing list archives

Site index · List index
Message view « Date » · « Thread »
Top « Date » · « Thread »
From Hudson <Hud...@sonatype.org>
Subject Build failed in Hudson: maven-plugins-ITs » 1.5,ubuntu #418
Date Wed, 14 Apr 2010 07:39:55 GMT
See <http://grid.sonatype.org/ci/job/maven-plugins-ITs/./jdk=1.5,label=ubuntu/418/changes>

Changes:

[John Casey] remove commented version from manual testing.

[John Casey] fixing version in IT

------------------------------------------
[...truncated 7803 lines...]
[INFO] Exploding webapp
[INFO] Assembling webapp[maven-war-plugin-test] in [/home/hudson/workspace/maven-plugins-ITs/jdk/1.5/label/ubuntu/trunk/maven-war-plugin/target/test-classes/unit/warexplodedmojo/test-dir/ExplodedWarWithAar]
[INFO] Processing war project
[INFO] Copying webapp resources[/home/hudson/workspace/maven-plugins-ITs/jdk/1.5/label/ubuntu/trunk/maven-war-plugin/target/test-classes/unit/warexplodedmojo/test-dir/ExplodedWarWithAar-test-data/source]
[INFO] Webapp assembled in [8 msecs]
[INFO] Exploding webapp
[INFO] Assembling webapp[maven-war-plugin-test] in [/home/hudson/workspace/maven-plugins-ITs/jdk/1.5/label/ubuntu/trunk/maven-war-plugin/target/test-classes/unit/warexplodedmojo/test-dir/ExplodedWar_WithDuplicateDependencies]
[INFO] Processing war project
[INFO] Copying webapp resources[/home/hudson/workspace/maven-plugins-ITs/jdk/1.5/label/ubuntu/trunk/maven-war-plugin/target/test-classes/unit/warexplodedmojo/test-dir/ExplodedWar_WithDuplicateDependencies-test-data/source]
[INFO] Webapp assembled in [23 msecs]
[INFO] Exploding webapp
[INFO] Assembling webapp[maven-war-plugin-test] in [/home/hudson/workspace/maven-plugins-ITs/jdk/1.5/label/ubuntu/trunk/maven-war-plugin/target/test-classes/unit/warexplodedmojo/test-dir/ExplodedWar_DuplicateWithClassifier]
[INFO] Processing war project
[INFO] Copying webapp resources[/home/hudson/workspace/maven-plugins-ITs/jdk/1.5/label/ubuntu/trunk/maven-war-plugin/target/test-classes/unit/warexplodedmojo/test-dir/ExplodedWar_DuplicateWithClassifier-test-data/source]
[INFO] Webapp assembled in [18 msecs]
[INFO] Exploding webapp
[INFO] Assembling webapp[maven-war-plugin-test] in [/home/hudson/workspace/maven-plugins-ITs/jdk/1.5/label/ubuntu/trunk/maven-war-plugin/target/test-classes/unit/warexplodedmojo/test-dir/ExplodedWar_WithClasses]
[INFO] Processing war project
[INFO] Copying webapp resources[/home/hudson/workspace/maven-plugins-ITs/jdk/1.5/label/ubuntu/trunk/maven-war-plugin/target/test-classes/unit/warexplodedmojo/test-dir/ExplodedWar_WithClasses-test-data/source]
[INFO] Webapp assembled in [20 msecs]
[INFO] Exploding webapp
[INFO] Assembling webapp[maven-war-plugin-test] in [/home/hudson/workspace/maven-plugins-ITs/jdk/1.5/label/ubuntu/trunk/maven-war-plugin/target/test-classes/unit/warexplodedmojo/test-dir/ExplodedWar_WithSourceIncludeExclude]
[INFO] Processing war project
[INFO] Copying webapp resources[/home/hudson/workspace/maven-plugins-ITs/jdk/1.5/label/ubuntu/trunk/maven-war-plugin/target/test-classes/unit/warexplodedmojo/test-dir/ExplodedWar_WithSourceIncludeExclude-test-data/source]
[INFO] Webapp assembled in [5 msecs]
[INFO] Exploding webapp
[INFO] Assembling webapp[maven-war-plugin-test] in [/home/hudson/workspace/maven-plugins-ITs/jdk/1.5/label/ubuntu/trunk/maven-war-plugin/target/test-classes/unit/warexplodedmojo/test-dir/ExplodedWar_WithWarDependencyIncludeExclude]
[INFO] Processing war project
[INFO] Copying webapp resources[/home/hudson/workspace/maven-plugins-ITs/jdk/1.5/label/ubuntu/trunk/maven-war-plugin/target/test-classes/unit/warexplodedmojo/test-dir/ExplodedWar_WithWarDependencyIncludeExclude-test-data/source]
[INFO] Processing overlay[ id wartests:war-include-exclude]
[INFO] Webapp assembled in [21 msecs]
[INFO] Exploding webapp
[INFO] Assembling webapp[maven-war-plugin-test] in [/home/hudson/workspace/maven-plugins-ITs/jdk/1.5/label/ubuntu/trunk/maven-war-plugin/target/test-classes/unit/warexplodedmojo/test-dir/ExplodedWarWithSourceModificationCheck]
[INFO] Processing war project
[INFO] Copying webapp resources[/home/hudson/workspace/maven-plugins-ITs/jdk/1.5/label/ubuntu/trunk/maven-war-plugin/target/test-classes/unit/warexplodedmojo/test-dir/ExplodedWarWithSourceModificationCheck-test-data/source]
[INFO] Webapp assembled in [0 msecs]
[INFO] Exploding webapp
[INFO] Assembling webapp[maven-war-plugin-test] in [/home/hudson/workspace/maven-plugins-ITs/jdk/1.5/label/ubuntu/trunk/maven-war-plugin/target/test-classes/unit/warexplodedmojo/test-dir/ExplodedWarWithFileNameMapping]
[INFO] Processing war project
[INFO] Copying webapp resources[/home/hudson/workspace/maven-plugins-ITs/jdk/1.5/label/ubuntu/trunk/maven-war-plugin/target/test-classes/unit/warexplodedmojo/test-dir/ExplodedWarWithFileNameMapping-test-data/source]
[INFO] Webapp assembled in [4 msecs]
[INFO] Exploding webapp
[INFO] Assembling webapp[maven-war-plugin-test] in [/home/hudson/workspace/maven-plugins-ITs/jdk/1.5/label/ubuntu/trunk/maven-war-plugin/target/test-classes/unit/warexplodedmojo/test-dir/ExplodedWarWithFileNameMappingAndDuplicateDependencies]
[INFO] Processing war project
[INFO] Copying webapp resources[/home/hudson/workspace/maven-plugins-ITs/jdk/1.5/label/ubuntu/trunk/maven-war-plugin/target/test-classes/unit/warexplodedmojo/test-dir/ExplodedWarWithFileNameMappingAndDuplicateDependencies-test-data/source]
[INFO] Webapp assembled in [5 msecs]
Tests run: 20, Failures: 0, Errors: 0, Skipped: 0, Time elapsed: 2.204 sec
Running org.apache.maven.plugin.war.WarInPlaceMojoTest
[INFO] Generating webapp in source directory[/home/hudson/workspace/maven-plugins-ITs/jdk/1.5/label/ubuntu/trunk/maven-war-plugin/target/test-classes/unit/warexplodedinplacemojo/test-dir/SimpleExplodedInplaceWar-test-data/source]
[INFO] Assembling webapp[maven-war-plugin-test] in [/home/hudson/workspace/maven-plugins-ITs/jdk/1.5/label/ubuntu/trunk/maven-war-plugin/target/test-classes/unit/warexplodedinplacemojo/test-dir/SimpleExplodedInplaceWar-test-data/source]
[INFO] Processing war project
[INFO] Copying webapp webResources[/home/hudson/workspace/maven-plugins-ITs/jdk/1.5/label/ubuntu/trunk/maven-war-plugin/target/test-classes/unit/warexplodedinplacemojo/test-dir/resources]
to[/home/hudson/workspace/maven-plugins-ITs/jdk/1.5/label/ubuntu/trunk/maven-war-plugin/target/test-classes/unit/warexplodedinplacemojo/test-dir/SimpleExplodedInplaceWar-test-data/source]
[INFO] Webapp assembled in [2 msecs]
Tests run: 2, Failures: 0, Errors: 0, Skipped: 0, Time elapsed: 0.069 sec
Running org.apache.maven.plugin.war.WarManifestMojoTest
Tests run: 5, Failures: 0, Errors: 0, Skipped: 0, Time elapsed: 0.218 sec
Running org.apache.maven.plugin.war.util.PathSetTest
Tests run: 5, Failures: 0, Errors: 0, Skipped: 0, Time elapsed: 0.005 sec
Running org.apache.maven.plugin.war.util.WarUtilsTest
Tests run: 1, Failures: 0, Errors: 0, Skipped: 0, Time elapsed: 0.002 sec
Running org.apache.maven.plugin.war.overlay.OverlayManagerTest
Tests run: 6, Failures: 0, Errors: 0, Skipped: 0, Time elapsed: 0.188 sec
Running org.apache.maven.plugin.war.WarDependenciesAnalysisTest
[INFO] Exploding webapp
[INFO] Assembling webapp[maven-war-plugin-test] in [/home/hudson/workspace/maven-plugins-ITs/jdk/1.5/label/ubuntu/trunk/maven-war-plugin/target/test-classes/unit/dependenciesanalysis/test-dir/no-change]
[INFO] Processing war project
[INFO] Copying webapp resources[/home/hudson/workspace/maven-plugins-ITs/jdk/1.5/label/ubuntu/trunk/maven-war-plugin/target/test-classes/unit/dependenciesanalysis/test-dir/no-change-test-data/source]
[INFO] Webapp assembled in [8 msecs]
[INFO] Exploding webapp
[INFO] Assembling webapp[maven-war-plugin-test] in [/home/hudson/workspace/maven-plugins-ITs/jdk/1.5/label/ubuntu/trunk/maven-war-plugin/target/test-classes/unit/dependenciesanalysis/test-dir/no-change]
[INFO] Processing war project
[INFO] Copying webapp resources[/home/hudson/workspace/maven-plugins-ITs/jdk/1.5/label/ubuntu/trunk/maven-war-plugin/target/test-classes/unit/dependenciesanalysis/test-dir/no-change-test-data/source]
[INFO] Webapp assembled in [6 msecs]
[INFO] Exploding webapp
[INFO] Assembling webapp[maven-war-plugin-test] in [/home/hudson/workspace/maven-plugins-ITs/jdk/1.5/label/ubuntu/trunk/maven-war-plugin/target/test-classes/unit/dependenciesanalysis/test-dir/remove-dependency]
[INFO] Processing war project
[INFO] Copying webapp resources[/home/hudson/workspace/maven-plugins-ITs/jdk/1.5/label/ubuntu/trunk/maven-war-plugin/target/test-classes/unit/dependenciesanalysis/test-dir/remove-dependency-test-data/source]
[INFO] Webapp assembled in [17 msecs]
[INFO] Exploding webapp
[INFO] Assembling webapp[maven-war-plugin-test] in [/home/hudson/workspace/maven-plugins-ITs/jdk/1.5/label/ubuntu/trunk/maven-war-plugin/target/test-classes/unit/dependenciesanalysis/test-dir/remove-dependency]
[INFO] Dependency[Dependency {groupId=org.sample.jar, artifactId=lib-test, version=1.0, type=jar}]
has been removed from the project.
[INFO] Processing war project
[INFO] Copying webapp resources[/home/hudson/workspace/maven-plugins-ITs/jdk/1.5/label/ubuntu/trunk/maven-war-plugin/target/test-classes/unit/dependenciesanalysis/test-dir/remove-dependency-test-data/source]
[INFO] Webapp assembled in [2 msecs]
[INFO] Exploding webapp
[INFO] Assembling webapp[maven-war-plugin-test] in [/home/hudson/workspace/maven-plugins-ITs/jdk/1.5/label/ubuntu/trunk/maven-war-plugin/target/test-classes/unit/dependenciesanalysis/test-dir/dependency-update-version]
[INFO] Processing war project
[INFO] Copying webapp resources[/home/hudson/workspace/maven-plugins-ITs/jdk/1.5/label/ubuntu/trunk/maven-war-plugin/target/test-classes/unit/dependenciesanalysis/test-dir/dependency-update-version-test-data/source]
[INFO] Webapp assembled in [23 msecs]
[INFO] Exploding webapp
[INFO] Assembling webapp[maven-war-plugin-test] in [/home/hudson/workspace/maven-plugins-ITs/jdk/1.5/label/ubuntu/trunk/maven-war-plugin/target/test-classes/unit/dependenciesanalysis/test-dir/dependency-update-version]
[INFO] Version of dependency[Dependency {groupId=org.sample.jar, artifactId=lib-test, version=2.0,
type=jar}] has changed (1.0 -> 2.0).
[INFO] Processing war project
[INFO] Copying webapp resources[/home/hudson/workspace/maven-plugins-ITs/jdk/1.5/label/ubuntu/trunk/maven-war-plugin/target/test-classes/unit/dependenciesanalysis/test-dir/dependency-update-version-test-data/source]
[INFO] Webapp assembled in [8 msecs]
[INFO] Exploding webapp
[INFO] Assembling webapp[maven-war-plugin-test] in [/home/hudson/workspace/maven-plugins-ITs/jdk/1.5/label/ubuntu/trunk/maven-war-plugin/target/test-classes/unit/dependenciesanalysis/test-dir/dependency-now-provided]
[INFO] Processing war project
[INFO] Copying webapp resources[/home/hudson/workspace/maven-plugins-ITs/jdk/1.5/label/ubuntu/trunk/maven-war-plugin/target/test-classes/unit/dependenciesanalysis/test-dir/dependency-now-provided-test-data/source]
[INFO] Webapp assembled in [39 msecs]
[INFO] Exploding webapp
[INFO] Assembling webapp[maven-war-plugin-test] in [/home/hudson/workspace/maven-plugins-ITs/jdk/1.5/label/ubuntu/trunk/maven-war-plugin/target/test-classes/unit/dependenciesanalysis/test-dir/dependency-now-provided]
[INFO] Scope of dependency[Dependency {groupId=org.sample.jar, artifactId=lib-test, version=1.0,
type=jar}] has changed (runtime -> provided).
[INFO] Processing war project
[INFO] Copying webapp resources[/home/hudson/workspace/maven-plugins-ITs/jdk/1.5/label/ubuntu/trunk/maven-war-plugin/target/test-classes/unit/dependenciesanalysis/test-dir/dependency-now-provided-test-data/source]
[INFO] Webapp assembled in [8 msecs]
Tests run: 4, Failures: 0, Errors: 0, Skipped: 0, Time elapsed: 0.293 sec

Results :

Tests run: 81, Failures: 0, Errors: 0, Skipped: 0

[INFO] [jar:jar {execution: default-jar}]
[INFO] Building jar: /home/hudson/workspace/maven-plugins-ITs/jdk/1.5/label/ubuntu/trunk/maven-war-plugin/target/maven-war-plugin-2.1-beta-2-SNAPSHOT.jar
[INFO] [plugin:addPluginArtifactMetadata {execution: default-addPluginArtifactMetadata}]
[INFO] [invoker:install {execution: integration-test}]
[INFO] Installing /home/hudson/workspace/maven-plugins-ITs/jdk/1.5/label/ubuntu/trunk/maven-war-plugin/pom.xml
to /home/hudson/workspace/maven-plugins-ITs/jdk/1.5/label/ubuntu/trunk/maven-war-plugin/target/local-repo/org/apache/maven/plugins/maven-war-plugin/2.1-beta-2-SNAPSHOT/maven-war-plugin-2.1-beta-2-SNAPSHOT.pom
[INFO] Installing /home/hudson/workspace/maven-plugins-ITs/jdk/1.5/label/ubuntu/trunk/maven-war-plugin/target/maven-war-plugin-2.1-beta-2-SNAPSHOT.jar
to /home/hudson/workspace/maven-plugins-ITs/jdk/1.5/label/ubuntu/trunk/maven-war-plugin/target/local-repo/org/apache/maven/plugins/maven-war-plugin/2.1-beta-2-SNAPSHOT/maven-war-plugin-2.1-beta-2-SNAPSHOT.jar
[INFO] [invoker:run {execution: integration-test}]
[INFO] Building: web-resources-filtering/pom.xml
[INFO] ..SUCCESS (15.9 s)
[INFO] Building: MWAR-96/pom.xml
[INFO] ..SUCCESS (4.1 s)
[INFO] Building: MWAR-62/pom.xml
[INFO] ..SUCCESS (3.5 s)
[INFO] Building: default/pom.xml
[INFO] ..SUCCESS (6.2 s)
[INFO] Building: simple-war-no-webxml/pom.xml
[INFO] ..SUCCESS (4.7 s)
[INFO] Building: scoped-dependency-same-artifact/pom.xml
[INFO] ..SUCCESS (5.3 s)
[INFO] Building: MWAR-143/pom.xml
[INFO] ..SUCCESS (9.1 s)
[INFO] Building: MWAR-139/pom.xml
[INFO] ..SUCCESS (4.4 s)
[INFO] Building: simple-war-project/pom.xml
[INFO] ..SUCCESS (4.2 s)
[INFO] Building: MWAR-129/pom.xml
[INFO] ..SUCCESS (3.3 s)
[INFO] Building: MWAR-133/pom.xml
[INFO] ..SUCCESS (3.0 s)
[INFO] Building: MWAR-131/pom.xml
[INFO] ..SUCCESS (20.9 s)
[INFO] ---------------------------------------
[INFO] Execution Summary:
[INFO]   Builds Passing: 12
[INFO]   Builds Failing: 0
[INFO]   Builds Skipped: 0
[INFO] ---------------------------------------
[INFO] [install:install {execution: default-install}]
[INFO] Installing /home/hudson/workspace/maven-plugins-ITs/jdk/1.5/label/ubuntu/trunk/maven-war-plugin/target/maven-war-plugin-2.1-beta-2-SNAPSHOT.jar
to /opt/repos/local-repository/org/apache/maven/plugins/maven-war-plugin/2.1-beta-2-SNAPSHOT/maven-war-plugin-2.1-beta-2-SNAPSHOT.jar
[INFO] [deploy:deploy {execution: default-deploy}]
[INFO] Retrieving previous build number from apache.snapshots.https
Uploading: http://repository.sonatype.org:8081/content/repositories/maven.snapshots/org/apache/maven/plugins/maven-war-plugin/2.1-beta-2-SNAPSHOT/maven-war-plugin-2.1-beta-2-20100414.061000-419.jar
74K uploaded  (maven-war-plugin-2.1-beta-2-20100414.061000-419.jar)
[INFO] Retrieving previous metadata from apache.snapshots.https
[INFO] Uploading repository metadata for: 'artifact org.apache.maven.plugins:maven-war-plugin'
[INFO] Retrieving previous metadata from apache.snapshots.https
[INFO] Uploading repository metadata for: 'snapshot org.apache.maven.plugins:maven-war-plugin:2.1-beta-2-SNAPSHOT'
[INFO] Retrieving previous metadata from apache.snapshots.https
[INFO] Uploading repository metadata for: 'org.apache.maven.plugins'
[INFO] Uploading project information for maven-war-plugin 2.1-beta-2-20100414.061000-419
[INFO] 
[INFO] 
[INFO] ------------------------------------------------------------------------
[INFO] Reactor Summary:
[INFO] ------------------------------------------------------------------------
[INFO] Maven Plugins ......................................... SUCCESS [1:19.319s]
[INFO] Maven Invoker Plugin .................................. SUCCESS [9:54.670s]
[INFO] Maven Ant Plugin ...................................... SUCCESS [3:15.377s]
[INFO] Maven AntRun Plugin ................................... SUCCESS [1:10.053s]
[INFO] Maven Eclipse Plugin .................................. FAILED [13:08.271s]
[INFO] Maven Site Plugin ..................................... SUCCESS [5:34.571s]
[INFO] Maven Changelog Plugin ................................ SUCCESS [46.858s]
[INFO] Maven Changes Report Plugin ........................... SUCCESS [1:32.122s]
[INFO] Maven Checkstyle Plugin ............................... SUCCESS [3:06.803s]
[INFO] Maven Clean Plugin .................................... SUCCESS [29.208s]
[INFO] Maven Compiler Plugin ................................. SUCCESS [58.372s]
[INFO] Maven Dependency Plugin ............................... SUCCESS [4:32.950s]
[INFO] Maven Deploy Plugin ................................... SUCCESS [2:00.098s]
[INFO] Maven DOAP Plugin ..................................... SUCCESS [29.977s]
[INFO] Maven Documentation Checker Plugin .................... SUCCESS [29.082s]
[INFO] Maven EAR Plugin ...................................... SUCCESS [4:46.382s]
[INFO] Maven EJB Plugin ...................................... SUCCESS [1:55.859s]
[INFO] Maven GPG Plugin ...................................... SUCCESS [44.697s]
[INFO] Maven Help Plugin ..................................... SUCCESS [1:34.506s]
[INFO] Maven IDEA Plugin ..................................... SUCCESS [23.621s]
[INFO] Maven Install Plugin .................................. SUCCESS [1:58.475s]
[INFO] Maven JAR Plugin ...................................... SUCCESS [2:32.557s]
[INFO] Maven Jarsigner Plugin ................................ SUCCESS [58.627s]
[INFO] Maven Shade Plugin .................................... SUCCESS [3:25.399s]
[INFO] Maven Javadoc Plugin .................................. SUCCESS [14:24.894s]
[INFO] Maven Linkcheck Plugin ................................ SUCCESS [7.680s]
[INFO] Maven One Plugin ...................................... SUCCESS [5.785s]
[INFO] Maven Patch Plugin .................................... SUCCESS [28.769s]
[INFO] Maven PDF Plugin ...................................... SUCCESS [1:02.872s]
[INFO] Maven PMD Plugin ...................................... SUCCESS [1:22.645s]
[INFO] Maven RAR Plugin ...................................... SUCCESS [15.272s]
[INFO] Maven Reactor Plugin .................................. SUCCESS [16.940s]
[INFO] Maven Repository Plugin ............................... SUCCESS [1:33.553s]
[INFO] Maven Resources Plugin ................................ SUCCESS [1:17.052s]
[INFO] Maven Source Plugin ................................... SUCCESS [48.651s]
[INFO] Maven Stage Plugin .................................... SUCCESS [4.796s]
[INFO] Maven Toolchains Plugin ............................... SUCCESS [4.186s]
[INFO] Maven Verifier Plugin ................................. SUCCESS [16.190s]
[INFO] Maven WAR Plugin ...................................... SUCCESS [1:52.465s]
[INFO] ------------------------------------------------------------------------
[INFO] Error for project: Maven Eclipse Plugin (during deploy)
[INFO] ------------------------------------------------------------------------
[INFO] There are test failures.

Please refer to /home/hudson/workspace/maven-plugins-ITs/jdk/1.5/label/ubuntu/trunk/maven-eclipse-plugin/target/surefire-reports
for the individual test results.
[INFO] ------------------------------------------------------------------------
[INFO] Trace
org.apache.maven.BuildFailureException: There are test failures.

Please refer to /home/hudson/workspace/maven-plugins-ITs/jdk/1.5/label/ubuntu/trunk/maven-eclipse-plugin/target/surefire-reports
for the individual test results.
	at org.apache.maven.lifecycle.DefaultLifecycleExecutor.executeGoals(DefaultLifecycleExecutor.java:715)
	at org.apache.maven.lifecycle.DefaultLifecycleExecutor.executeGoalWithLifecycle(DefaultLifecycleExecutor.java:556)
	at org.apache.maven.lifecycle.DefaultLifecycleExecutor.executeGoal(DefaultLifecycleExecutor.java:535)
	at org.apache.maven.lifecycle.DefaultLifecycleExecutor.executeGoalAndHandleFailures(DefaultLifecycleExecutor.java:387)
	at org.apache.maven.lifecycle.DefaultLifecycleExecutor.executeTaskSegments(DefaultLifecycleExecutor.java:348)
	at org.apache.maven.lifecycle.DefaultLifecycleExecutor.execute(DefaultLifecycleExecutor.java:180)
	at org.apache.maven.DefaultMaven.doExecute(DefaultMaven.java:328)
	at org.apache.maven.DefaultMaven.execute(DefaultMaven.java:138)
	at org.apache.maven.cli.MavenCli.main(MavenCli.java:362)
	at org.apache.maven.cli.compat.CompatibleMain.main(CompatibleMain.java:60)
	at sun.reflect.NativeMethodAccessorImpl.invoke0(Native Method)
	at sun.reflect.NativeMethodAccessorImpl.invoke(NativeMethodAccessorImpl.java:39)
	at sun.reflect.DelegatingMethodAccessorImpl.invoke(DelegatingMethodAccessorImpl.java:25)
	at java.lang.reflect.Method.invoke(Method.java:585)
	at org.codehaus.classworlds.Launcher.launchEnhanced(Launcher.java:315)
	at org.codehaus.classworlds.Launcher.launch(Launcher.java:255)
	at org.codehaus.classworlds.Launcher.mainWithExitCode(Launcher.java:430)
	at org.codehaus.classworlds.Launcher.main(Launcher.java:375)
Caused by: org.apache.maven.plugin.MojoFailureException: There are test failures.

Please refer to /home/hudson/workspace/maven-plugins-ITs/jdk/1.5/label/ubuntu/trunk/maven-eclipse-plugin/target/surefire-reports
for the individual test results.
	at org.apache.maven.plugin.surefire.SurefirePlugin.execute(SurefirePlugin.java:575)
	at org.apache.maven.plugin.DefaultPluginManager.executeMojo(DefaultPluginManager.java:490)
	at org.apache.maven.lifecycle.DefaultLifecycleExecutor.executeGoals(DefaultLifecycleExecutor.java:694)
	... 17 more
[INFO] ------------------------------------------------------------------------
[INFO] BUILD ERRORS
[INFO] ------------------------------------------------------------------------
[INFO] Total time: 91 minutes 19 seconds
[INFO] Finished at: Wed Apr 14 01:39:53 GMT-06:00 2010
[INFO] Final Memory: 62M/129M
[INFO] ------------------------------------------------------------------------


Mime
View raw message