maven-notifications mailing list archives

Site index · List index
Message view « Date » · « Thread »
Top « Date » · « Thread »
From Hudson <Hud...@sonatype.org>
Subject Build failed in Hudson: maven-plugins-ITs » 1.5,windows #417
Date Tue, 13 Apr 2010 22:07:26 GMT
See <http://grid.sonatype.org/ci/job/maven-plugins-ITs/./jdk=1.5,label=windows/417/changes>

Changes:

[John Casey] [MJAVADOC-280] Reinstating invoker.properties-driven ITs for second and fourth
tests of -280, in order to avoid two-stage invoker plugin execution.

------------------------------------------
[...truncated 5441 lines...]
[INFO] Processing war project
[INFO] Copying webapp resources[C:\home\hudson\workspace\maven-plugins-ITs\jdk\1.5\label\windows\trunk\maven-war-plugin\target\test-classes\unit\warexplodedmojo\test-dir\ExplodedWarWithSourceModificationCheck-test-data\source]
[INFO] Webapp assembled in [18 msecs]
[INFO] Exploding webapp
[INFO] Assembling webapp[maven-war-plugin-test] in [C:\home\hudson\workspace\maven-plugins-ITs\jdk\1.5\label\windows\trunk\maven-war-plugin\target\test-classes\unit\warexplodedmojo\test-dir\ExplodedWarWithFileNameMapping]
[INFO] Processing war project
[INFO] Copying webapp resources[C:\home\hudson\workspace\maven-plugins-ITs\jdk\1.5\label\windows\trunk\maven-war-plugin\target\test-classes\unit\warexplodedmojo\test-dir\ExplodedWarWithFileNameMapping-test-data\source]
[INFO] Webapp assembled in [22 msecs]
[INFO] Exploding webapp
[INFO] Assembling webapp[maven-war-plugin-test] in [C:\home\hudson\workspace\maven-plugins-ITs\jdk\1.5\label\windows\trunk\maven-war-plugin\target\test-classes\unit\warexplodedmojo\test-dir\ExplodedWarWithFileNameMappingAndDuplicateDependencies]
[INFO] Processing war project
[INFO] Copying webapp resources[C:\home\hudson\workspace\maven-plugins-ITs\jdk\1.5\label\windows\trunk\maven-war-plugin\target\test-classes\unit\warexplodedmojo\test-dir\ExplodedWarWithFileNameMappingAndDuplicateDependencies-test-data\source]
[INFO] Webapp assembled in [23 msecs]
Tests run: 20, Failures: 0, Errors: 0, Skipped: 0, Time elapsed: 1.999 sec
Running org.apache.maven.plugin.war.WarInPlaceMojoTest
[INFO] Generating webapp in source directory[C:\home\hudson\workspace\maven-plugins-ITs\jdk\1.5\label\windows\trunk\maven-war-plugin\target\test-classes\unit\warexplodedinplacemojo\test-dir\SimpleExplodedInplaceWar-test-data\source]
[INFO] Assembling webapp[maven-war-plugin-test] in [C:\home\hudson\workspace\maven-plugins-ITs\jdk\1.5\label\windows\trunk\maven-war-plugin\target\test-classes\unit\warexplodedinplacemojo\test-dir\SimpleExplodedInplaceWar-test-data\source]
[INFO] Processing war project
[INFO] Copying webapp webResources[C:\home\hudson\workspace\maven-plugins-ITs\jdk\1.5\label\windows\trunk\maven-war-plugin\target\test-classes\unit\warexplodedinplacemojo\test-dir\resources]
to[C:\home\hudson\workspace\maven-plugins-ITs\jdk\1.5\label\windows\trunk\maven-war-plugin\target\test-classes\unit\warexplodedinplacemojo\test-dir\SimpleExplodedInplaceWar-test-data\source]
[INFO] Webapp assembled in [9 msecs]
Tests run: 2, Failures: 0, Errors: 0, Skipped: 0, Time elapsed: 0.129 sec
Running org.apache.maven.plugin.war.WarManifestMojoTest
Tests run: 5, Failures: 0, Errors: 0, Skipped: 0, Time elapsed: 0.379 sec
Running org.apache.maven.plugin.war.util.PathSetTest
Tests run: 5, Failures: 0, Errors: 0, Skipped: 0, Time elapsed: 0.015 sec
Running org.apache.maven.plugin.war.util.WarUtilsTest
Tests run: 1, Failures: 0, Errors: 0, Skipped: 0, Time elapsed: 0.003 sec
Running org.apache.maven.plugin.war.overlay.OverlayManagerTest
Tests run: 6, Failures: 0, Errors: 0, Skipped: 0, Time elapsed: 0.255 sec
Running org.apache.maven.plugin.war.WarDependenciesAnalysisTest
[INFO] Exploding webapp
[INFO] Assembling webapp[maven-war-plugin-test] in [C:\home\hudson\workspace\maven-plugins-ITs\jdk\1.5\label\windows\trunk\maven-war-plugin\target\test-classes\unit\dependenciesanalysis\test-dir\no-change]
[INFO] Processing war project
[INFO] Copying webapp resources[C:\home\hudson\workspace\maven-plugins-ITs\jdk\1.5\label\windows\trunk\maven-war-plugin\target\test-classes\unit\dependenciesanalysis\test-dir\no-change-test-data\source]
[INFO] Webapp assembled in [23 msecs]
[INFO] Exploding webapp
[INFO] Assembling webapp[maven-war-plugin-test] in [C:\home\hudson\workspace\maven-plugins-ITs\jdk\1.5\label\windows\trunk\maven-war-plugin\target\test-classes\unit\dependenciesanalysis\test-dir\no-change]
[INFO] Processing war project
[INFO] Copying webapp resources[C:\home\hudson\workspace\maven-plugins-ITs\jdk\1.5\label\windows\trunk\maven-war-plugin\target\test-classes\unit\dependenciesanalysis\test-dir\no-change-test-data\source]
[INFO] Webapp assembled in [8 msecs]
[INFO] Exploding webapp
[INFO] Assembling webapp[maven-war-plugin-test] in [C:\home\hudson\workspace\maven-plugins-ITs\jdk\1.5\label\windows\trunk\maven-war-plugin\target\test-classes\unit\dependenciesanalysis\test-dir\remove-dependency]
[INFO] Processing war project
[INFO] Copying webapp resources[C:\home\hudson\workspace\maven-plugins-ITs\jdk\1.5\label\windows\trunk\maven-war-plugin\target\test-classes\unit\dependenciesanalysis\test-dir\remove-dependency-test-data\source]
[INFO] Webapp assembled in [24 msecs]
[INFO] Exploding webapp
[INFO] Assembling webapp[maven-war-plugin-test] in [C:\home\hudson\workspace\maven-plugins-ITs\jdk\1.5\label\windows\trunk\maven-war-plugin\target\test-classes\unit\dependenciesanalysis\test-dir\remove-dependency]
[INFO] Dependency[Dependency {groupId=org.sample.jar, artifactId=lib-test, version=1.0, type=jar}]
has been removed from the project.
[INFO] Processing war project
[INFO] Copying webapp resources[C:\home\hudson\workspace\maven-plugins-ITs\jdk\1.5\label\windows\trunk\maven-war-plugin\target\test-classes\unit\dependenciesanalysis\test-dir\remove-dependency-test-data\source]
[INFO] Webapp assembled in [12 msecs]
[INFO] Exploding webapp
[INFO] Assembling webapp[maven-war-plugin-test] in [C:\home\hudson\workspace\maven-plugins-ITs\jdk\1.5\label\windows\trunk\maven-war-plugin\target\test-classes\unit\dependenciesanalysis\test-dir\dependency-update-version]
[INFO] Processing war project
[INFO] Copying webapp resources[C:\home\hudson\workspace\maven-plugins-ITs\jdk\1.5\label\windows\trunk\maven-war-plugin\target\test-classes\unit\dependenciesanalysis\test-dir\dependency-update-version-test-data\source]
[INFO] Webapp assembled in [24 msecs]
[INFO] Exploding webapp
[INFO] Assembling webapp[maven-war-plugin-test] in [C:\home\hudson\workspace\maven-plugins-ITs\jdk\1.5\label\windows\trunk\maven-war-plugin\target\test-classes\unit\dependenciesanalysis\test-dir\dependency-update-version]
[INFO] Version of dependency[Dependency {groupId=org.sample.jar, artifactId=lib-test, version=2.0,
type=jar}] has changed (1.0 -> 2.0).
[INFO] Processing war project
[INFO] Copying webapp resources[C:\home\hudson\workspace\maven-plugins-ITs\jdk\1.5\label\windows\trunk\maven-war-plugin\target\test-classes\unit\dependenciesanalysis\test-dir\dependency-update-version-test-data\source]
[INFO] Webapp assembled in [18 msecs]
[INFO] Exploding webapp
[INFO] Assembling webapp[maven-war-plugin-test] in [C:\home\hudson\workspace\maven-plugins-ITs\jdk\1.5\label\windows\trunk\maven-war-plugin\target\test-classes\unit\dependenciesanalysis\test-dir\dependency-now-provided]
[INFO] Processing war project
[INFO] Copying webapp resources[C:\home\hudson\workspace\maven-plugins-ITs\jdk\1.5\label\windows\trunk\maven-war-plugin\target\test-classes\unit\dependenciesanalysis\test-dir\dependency-now-provided-test-data\source]
[INFO] Webapp assembled in [23 msecs]
[INFO] Exploding webapp
[INFO] Assembling webapp[maven-war-plugin-test] in [C:\home\hudson\workspace\maven-plugins-ITs\jdk\1.5\label\windows\trunk\maven-war-plugin\target\test-classes\unit\dependenciesanalysis\test-dir\dependency-now-provided]
[INFO] Scope of dependency[Dependency {groupId=org.sample.jar, artifactId=lib-test, version=1.0,
type=jar}] has changed (runtime -> provided).
[INFO] Processing war project
[INFO] Copying webapp resources[C:\home\hudson\workspace\maven-plugins-ITs\jdk\1.5\label\windows\trunk\maven-war-plugin\target\test-classes\unit\dependenciesanalysis\test-dir\dependency-now-provided-test-data\source]
[INFO] Webapp assembled in [15 msecs]
Tests run: 4, Failures: 0, Errors: 0, Skipped: 0, Time elapsed: 0.461 sec

Results :

Tests run: 81, Failures: 0, Errors: 0, Skipped: 0

[INFO] [jar:jar {execution: default-jar}]
[INFO] Building jar: C:\home\hudson\workspace\maven-plugins-ITs\jdk\1.5\label\windows\trunk\maven-war-plugin\target\maven-war-plugin-2.1-beta-2-SNAPSHOT.jar
[INFO] [plugin:addPluginArtifactMetadata {execution: default-addPluginArtifactMetadata}]
[INFO] [invoker:install {execution: integration-test}]
[INFO] Installing C:\home\hudson\workspace\maven-plugins-ITs\jdk\1.5\label\windows\trunk\maven-war-plugin\pom.xml
to C:\home\hudson\workspace\maven-plugins-ITs\jdk\1.5\label\windows\trunk\maven-war-plugin\target\local-repo\org\apache\maven\plugins\maven-war-plugin\2.1-beta-2-SNAPSHOT\maven-war-plugin-2.1-beta-2-SNAPSHOT.pom
[INFO] Installing C:\home\hudson\workspace\maven-plugins-ITs\jdk\1.5\label\windows\trunk\maven-war-plugin\target\maven-war-plugin-2.1-beta-2-SNAPSHOT.jar
to C:\home\hudson\workspace\maven-plugins-ITs\jdk\1.5\label\windows\trunk\maven-war-plugin\target\local-repo\org\apache\maven\plugins\maven-war-plugin\2.1-beta-2-SNAPSHOT\maven-war-plugin-2.1-beta-2-SNAPSHOT.jar
[INFO] [invoker:run {execution: integration-test}]
[INFO] Building: default\pom.xml
[INFO] ..SUCCESS (10.1 s)
[INFO] Building: MWAR-129\pom.xml
[INFO] ..SUCCESS (2.7 s)
[INFO] Building: MWAR-131\pom.xml
[INFO] ..SUCCESS (35.9 s)
[INFO] Building: MWAR-133\pom.xml
[INFO] ..SUCCESS (2.7 s)
[INFO] Building: MWAR-139\pom.xml
[INFO] ..SUCCESS (3.6 s)
[INFO] Building: MWAR-143\pom.xml
[INFO] ..SUCCESS (10.6 s)
[INFO] Building: MWAR-62\pom.xml
[INFO] ..SUCCESS (2.6 s)
[INFO] Building: MWAR-96\pom.xml
[INFO] ..SUCCESS (3.5 s)
[INFO] Building: scoped-dependency-same-artifact\pom.xml
[INFO] ..SUCCESS (5.4 s)
[INFO] Building: simple-war-no-webxml\pom.xml
[INFO] ..SUCCESS (3.4 s)
[INFO] Building: simple-war-project\pom.xml
[INFO] ..SUCCESS (4.1 s)
[INFO] Building: web-resources-filtering\pom.xml
[INFO] ..SUCCESS (5.0 s)
[INFO] ---------------------------------------
[INFO] Execution Summary:
[INFO]   Builds Passing: 12
[INFO]   Builds Failing: 0
[INFO]   Builds Skipped: 0
[INFO] ---------------------------------------
[INFO] [install:install {execution: default-install}]
[INFO] Installing C:\home\hudson\workspace\maven-plugins-ITs\jdk\1.5\label\windows\trunk\maven-war-plugin\target\maven-war-plugin-2.1-beta-2-SNAPSHOT.jar
to C:\opt\repos\local-repository\org\apache\maven\plugins\maven-war-plugin\2.1-beta-2-SNAPSHOT\maven-war-plugin-2.1-beta-2-SNAPSHOT.jar
[INFO] [deploy:deploy {execution: default-deploy}]
[INFO] Retrieving previous build number from apache.snapshots.https
Uploading: file:/opt/repos/deploy-junk/org/apache/maven/plugins/maven-war-plugin/2.1-beta-2-SNAPSHOT/maven-war-plugin-2.1-beta-2-20100413.205433-2.jar
74K uploaded  (maven-war-plugin-2.1-beta-2-20100413.205433-2.jar)
[INFO] Retrieving previous metadata from apache.snapshots.https
[INFO] Uploading repository metadata for: 'artifact org.apache.maven.plugins:maven-war-plugin'
[INFO] Retrieving previous metadata from apache.snapshots.https
[INFO] Uploading repository metadata for: 'snapshot org.apache.maven.plugins:maven-war-plugin:2.1-beta-2-SNAPSHOT'
[INFO] Retrieving previous metadata from apache.snapshots.https
[INFO] Uploading repository metadata for: 'org.apache.maven.plugins'
[INFO] Uploading project information for maven-war-plugin 2.1-beta-2-20100413.205433-2
[INFO] 
[INFO] 
[INFO] ------------------------------------------------------------------------
[INFO] Reactor Summary:
[INFO] ------------------------------------------------------------------------
[INFO] Maven Plugins ......................................... SUCCESS [5.913s]
[INFO] Maven Invoker Plugin .................................. SUCCESS [5:18.426s]
[INFO] Maven Ant Plugin ...................................... SUCCESS [2:20.412s]
[INFO] Maven AntRun Plugin ................................... SUCCESS [1:08.770s]
[INFO] Maven Eclipse Plugin .................................. FAILED [15:06.705s]
[INFO] Maven Site Plugin ..................................... SUCCESS [5:03.725s]
[INFO] Maven Changelog Plugin ................................ SUCCESS [38.957s]
[INFO] Maven Changes Report Plugin ........................... SUCCESS [1:20.283s]
[INFO] Maven Checkstyle Plugin ............................... SUCCESS [2:14.896s]
[INFO] Maven Clean Plugin .................................... SUCCESS [17.827s]
[INFO] Maven Compiler Plugin ................................. SUCCESS [29.851s]
[INFO] Maven Dependency Plugin ............................... SUCCESS [2:51.224s]
[INFO] Maven Deploy Plugin ................................... SUCCESS [1:33.288s]
[INFO] Maven DOAP Plugin ..................................... SUCCESS [18.592s]
[INFO] Maven Documentation Checker Plugin .................... SUCCESS [18.571s]
[INFO] Maven EAR Plugin ...................................... SUCCESS [3:46.618s]
[INFO] Maven EJB Plugin ...................................... SUCCESS [36.710s]
[INFO] Maven GPG Plugin ...................................... SUCCESS [28.257s]
[INFO] Maven Help Plugin ..................................... SUCCESS [37.298s]
[INFO] Maven IDEA Plugin ..................................... SUCCESS [10.257s]
[INFO] Maven Install Plugin .................................. SUCCESS [1:24.445s]
[INFO] Maven JAR Plugin ...................................... SUCCESS [1:48.022s]
[INFO] Maven Jarsigner Plugin ................................ SUCCESS [53.246s]
[INFO] Maven Shade Plugin .................................... SUCCESS [2:40.658s]
[INFO] Maven Javadoc Plugin .................................. FAILED [13:01.684s]
[INFO] Maven Linkcheck Plugin ................................ SUCCESS [8.447s]
[INFO] Maven One Plugin ...................................... SUCCESS [3.475s]
[INFO] Maven Patch Plugin .................................... SUCCESS [20.724s]
[INFO] Maven PDF Plugin ...................................... SUCCESS [38.850s]
[INFO] Maven PMD Plugin ...................................... SUCCESS [53.813s]
[INFO] Maven RAR Plugin ...................................... SUCCESS [16.197s]
[INFO] Maven Reactor Plugin .................................. SUCCESS [3.792s]
[INFO] Maven Repository Plugin ............................... SUCCESS [1:27.791s]
[INFO] Maven Resources Plugin ................................ SUCCESS [1:08.660s]
[INFO] Maven Source Plugin ................................... SUCCESS [46.608s]
[INFO] Maven Stage Plugin .................................... SUCCESS [2.612s]
[INFO] Maven Toolchains Plugin ............................... SUCCESS [3.413s]
[INFO] Maven Verifier Plugin ................................. SUCCESS [18.261s]
[INFO] Maven WAR Plugin ...................................... SUCCESS [2:08.898s]
[INFO] ------------------------------------------------------------------------
[INFO] Error for project: Maven Eclipse Plugin (during deploy)
[INFO] ------------------------------------------------------------------------
[INFO] There are test failures.

Please refer to C:\home\hudson\workspace\maven-plugins-ITs\jdk\1.5\label\windows\trunk\maven-eclipse-plugin\target\surefire-reports
for the individual test results.
[INFO] ------------------------------------------------------------------------
[INFO] Trace
org.apache.maven.BuildFailureException: There are test failures.

Please refer to C:\home\hudson\workspace\maven-plugins-ITs\jdk\1.5\label\windows\trunk\maven-eclipse-plugin\target\surefire-reports
for the individual test results.
	at org.apache.maven.lifecycle.DefaultLifecycleExecutor.executeGoals(DefaultLifecycleExecutor.java:715)
	at org.apache.maven.lifecycle.DefaultLifecycleExecutor.executeGoalWithLifecycle(DefaultLifecycleExecutor.java:556)
	at org.apache.maven.lifecycle.DefaultLifecycleExecutor.executeGoal(DefaultLifecycleExecutor.java:535)
	at org.apache.maven.lifecycle.DefaultLifecycleExecutor.executeGoalAndHandleFailures(DefaultLifecycleExecutor.java:387)
	at org.apache.maven.lifecycle.DefaultLifecycleExecutor.executeTaskSegments(DefaultLifecycleExecutor.java:348)
	at org.apache.maven.lifecycle.DefaultLifecycleExecutor.execute(DefaultLifecycleExecutor.java:180)
	at org.apache.maven.DefaultMaven.doExecute(DefaultMaven.java:328)
	at org.apache.maven.DefaultMaven.execute(DefaultMaven.java:138)
	at org.apache.maven.cli.MavenCli.main(MavenCli.java:362)
	at org.apache.maven.cli.compat.CompatibleMain.main(CompatibleMain.java:60)
	at sun.reflect.NativeMethodAccessorImpl.invoke0(Native Method)
	at sun.reflect.NativeMethodAccessorImpl.invoke(NativeMethodAccessorImpl.java:39)
	at sun.reflect.DelegatingMethodAccessorImpl.invoke(DelegatingMethodAccessorImpl.java:25)
	at java.lang.reflect.Method.invoke(Method.java:585)
	at org.codehaus.classworlds.Launcher.launchEnhanced(Launcher.java:315)
	at org.codehaus.classworlds.Launcher.launch(Launcher.java:255)
	at org.codehaus.classworlds.Launcher.mainWithExitCode(Launcher.java:430)
	at org.codehaus.classworlds.Launcher.main(Launcher.java:375)
Caused by: org.apache.maven.plugin.MojoFailureException: There are test failures.

Please refer to C:\home\hudson\workspace\maven-plugins-ITs\jdk\1.5\label\windows\trunk\maven-eclipse-plugin\target\surefire-reports
for the individual test results.
	at org.apache.maven.plugin.surefire.SurefirePlugin.execute(SurefirePlugin.java:575)
	at org.apache.maven.plugin.DefaultPluginManager.executeMojo(DefaultPluginManager.java:490)
	at org.apache.maven.lifecycle.DefaultLifecycleExecutor.executeGoals(DefaultLifecycleExecutor.java:694)
	... 17 more
[INFO] ------------------------------------------------------------------------
[INFO] Error for project: Maven Javadoc Plugin (during deploy)
[INFO] ------------------------------------------------------------------------
[INFO] : org.apache.maven.plugin.invoker.InvokerSession@b47341
1 build failed.
[INFO] ------------------------------------------------------------------------
[INFO] Trace
org.apache.maven.BuildFailureException: 1 build failed.
	at org.apache.maven.lifecycle.DefaultLifecycleExecutor.executeGoals(DefaultLifecycleExecutor.java:715)
	at org.apache.maven.lifecycle.DefaultLifecycleExecutor.executeGoalWithLifecycle(DefaultLifecycleExecutor.java:556)
	at org.apache.maven.lifecycle.DefaultLifecycleExecutor.executeGoal(DefaultLifecycleExecutor.java:535)
	at org.apache.maven.lifecycle.DefaultLifecycleExecutor.executeGoalAndHandleFailures(DefaultLifecycleExecutor.java:387)
	at org.apache.maven.lifecycle.DefaultLifecycleExecutor.executeTaskSegments(DefaultLifecycleExecutor.java:348)
	at org.apache.maven.lifecycle.DefaultLifecycleExecutor.execute(DefaultLifecycleExecutor.java:180)
	at org.apache.maven.DefaultMaven.doExecute(DefaultMaven.java:328)
	at org.apache.maven.DefaultMaven.execute(DefaultMaven.java:138)
	at org.apache.maven.cli.MavenCli.main(MavenCli.java:362)
	at org.apache.maven.cli.compat.CompatibleMain.main(CompatibleMain.java:60)
	at sun.reflect.NativeMethodAccessorImpl.invoke0(Native Method)
	at sun.reflect.NativeMethodAccessorImpl.invoke(NativeMethodAccessorImpl.java:39)
	at sun.reflect.DelegatingMethodAccessorImpl.invoke(DelegatingMethodAccessorImpl.java:25)
	at java.lang.reflect.Method.invoke(Method.java:585)
	at org.codehaus.classworlds.Launcher.launchEnhanced(Launcher.java:315)
	at org.codehaus.classworlds.Launcher.launch(Launcher.java:255)
	at org.codehaus.classworlds.Launcher.mainWithExitCode(Launcher.java:430)
	at org.codehaus.classworlds.Launcher.main(Launcher.java:375)
Caused by: org.apache.maven.plugin.MojoFailureException: 1 build failed.
	at org.apache.maven.plugin.invoker.InvokerSession.handleFailures(InvokerSession.java:263)
	at org.apache.maven.plugin.invoker.InvokerMojo.processResults(InvokerMojo.java:58)
	at org.apache.maven.plugin.invoker.AbstractInvokerMojo.execute(AbstractInvokerMojo.java:620)
	at org.apache.maven.plugin.DefaultPluginManager.executeMojo(DefaultPluginManager.java:490)
	at org.apache.maven.lifecycle.DefaultLifecycleExecutor.executeGoals(DefaultLifecycleExecutor.java:694)
	... 17 more
[INFO] ------------------------------------------------------------------------
[INFO] BUILD ERRORS
[INFO] ------------------------------------------------------------------------
[INFO] Total time: 72 minutes 57 seconds
[INFO] Finished at: Tue Apr 13 15:07:24 PDT 2010
[INFO] Final Memory: 60M/172M
[INFO] ------------------------------------------------------------------------


Mime
View raw message