maven-notifications mailing list archives

Site index · List index
Message view « Date » · « Thread »
Top « Date » · « Thread »
From Hudson <Hud...@sonatype.org>
Subject Build failed in Hudson: maven-plugins-ITs » 1.5,ubuntu #419
Date Thu, 15 Apr 2010 07:39:19 GMT
See <http://grid.sonatype.org/ci/job/maven-plugins-ITs/./jdk=1.5,label=ubuntu/419/changes>

Changes:

[Fabrizio Giustina] MECLIPSE-548 Classpath container entries should come before 3rd party
jars in .classpath - reverting the path that swapped the order in the past and added a new
property to switch to the non-standard behaviour if needed. All the tests results have been
updated and chacked after the change.

------------------------------------------
[...truncated 8212 lines...]
[INFO] Processing war project
[INFO] Copying webapp resources[/home/hudson/workspace/maven-plugins-ITs/jdk/1.5/label/ubuntu/trunk/maven-war-plugin/target/test-classes/unit/warexplodedmojo/test-dir/ExplodedWarWithSourceModificationCheck-test-data/source]
[INFO] Webapp assembled in [8 msecs]
[INFO] Exploding webapp
[INFO] Assembling webapp[maven-war-plugin-test] in [/home/hudson/workspace/maven-plugins-ITs/jdk/1.5/label/ubuntu/trunk/maven-war-plugin/target/test-classes/unit/warexplodedmojo/test-dir/ExplodedWarWithFileNameMapping]
[INFO] Processing war project
[INFO] Copying webapp resources[/home/hudson/workspace/maven-plugins-ITs/jdk/1.5/label/ubuntu/trunk/maven-war-plugin/target/test-classes/unit/warexplodedmojo/test-dir/ExplodedWarWithFileNameMapping-test-data/source]
[INFO] Webapp assembled in [13 msecs]
[INFO] Exploding webapp
[INFO] Assembling webapp[maven-war-plugin-test] in [/home/hudson/workspace/maven-plugins-ITs/jdk/1.5/label/ubuntu/trunk/maven-war-plugin/target/test-classes/unit/warexplodedmojo/test-dir/ExplodedWarWithFileNameMappingAndDuplicateDependencies]
[INFO] Processing war project
[INFO] Copying webapp resources[/home/hudson/workspace/maven-plugins-ITs/jdk/1.5/label/ubuntu/trunk/maven-war-plugin/target/test-classes/unit/warexplodedmojo/test-dir/ExplodedWarWithFileNameMappingAndDuplicateDependencies-test-data/source]
[INFO] Webapp assembled in [14 msecs]
Tests run: 20, Failures: 0, Errors: 0, Skipped: 0, Time elapsed: 2.32 sec
Running org.apache.maven.plugin.war.WarInPlaceMojoTest
[INFO] Generating webapp in source directory[/home/hudson/workspace/maven-plugins-ITs/jdk/1.5/label/ubuntu/trunk/maven-war-plugin/target/test-classes/unit/warexplodedinplacemojo/test-dir/SimpleExplodedInplaceWar-test-data/source]
[INFO] Assembling webapp[maven-war-plugin-test] in [/home/hudson/workspace/maven-plugins-ITs/jdk/1.5/label/ubuntu/trunk/maven-war-plugin/target/test-classes/unit/warexplodedinplacemojo/test-dir/SimpleExplodedInplaceWar-test-data/source]
[INFO] Processing war project
[INFO] Copying webapp webResources[/home/hudson/workspace/maven-plugins-ITs/jdk/1.5/label/ubuntu/trunk/maven-war-plugin/target/test-classes/unit/warexplodedinplacemojo/test-dir/resources]
to[/home/hudson/workspace/maven-plugins-ITs/jdk/1.5/label/ubuntu/trunk/maven-war-plugin/target/test-classes/unit/warexplodedinplacemojo/test-dir/SimpleExplodedInplaceWar-test-data/source]
[INFO] Webapp assembled in [2 msecs]
Tests run: 2, Failures: 0, Errors: 0, Skipped: 0, Time elapsed: 0.088 sec
Running org.apache.maven.plugin.war.WarManifestMojoTest
Tests run: 5, Failures: 0, Errors: 0, Skipped: 0, Time elapsed: 0.203 sec
Running org.apache.maven.plugin.war.util.PathSetTest
Tests run: 5, Failures: 0, Errors: 0, Skipped: 0, Time elapsed: 0.008 sec
Running org.apache.maven.plugin.war.util.WarUtilsTest
Tests run: 1, Failures: 0, Errors: 0, Skipped: 0, Time elapsed: 0.002 sec
Running org.apache.maven.plugin.war.overlay.OverlayManagerTest
Tests run: 6, Failures: 0, Errors: 0, Skipped: 0, Time elapsed: 0.163 sec
Running org.apache.maven.plugin.war.WarDependenciesAnalysisTest
[INFO] Exploding webapp
[INFO] Assembling webapp[maven-war-plugin-test] in [/home/hudson/workspace/maven-plugins-ITs/jdk/1.5/label/ubuntu/trunk/maven-war-plugin/target/test-classes/unit/dependenciesanalysis/test-dir/no-change]
[INFO] Processing war project
[INFO] Copying webapp resources[/home/hudson/workspace/maven-plugins-ITs/jdk/1.5/label/ubuntu/trunk/maven-war-plugin/target/test-classes/unit/dependenciesanalysis/test-dir/no-change-test-data/source]
[INFO] Webapp assembled in [19 msecs]
[INFO] Exploding webapp
[INFO] Assembling webapp[maven-war-plugin-test] in [/home/hudson/workspace/maven-plugins-ITs/jdk/1.5/label/ubuntu/trunk/maven-war-plugin/target/test-classes/unit/dependenciesanalysis/test-dir/no-change]
[INFO] Processing war project
[INFO] Copying webapp resources[/home/hudson/workspace/maven-plugins-ITs/jdk/1.5/label/ubuntu/trunk/maven-war-plugin/target/test-classes/unit/dependenciesanalysis/test-dir/no-change-test-data/source]
[INFO] Webapp assembled in [3 msecs]
[INFO] Exploding webapp
[INFO] Assembling webapp[maven-war-plugin-test] in [/home/hudson/workspace/maven-plugins-ITs/jdk/1.5/label/ubuntu/trunk/maven-war-plugin/target/test-classes/unit/dependenciesanalysis/test-dir/remove-dependency]
[INFO] Processing war project
[INFO] Copying webapp resources[/home/hudson/workspace/maven-plugins-ITs/jdk/1.5/label/ubuntu/trunk/maven-war-plugin/target/test-classes/unit/dependenciesanalysis/test-dir/remove-dependency-test-data/source]
[INFO] Webapp assembled in [13 msecs]
[INFO] Exploding webapp
[INFO] Assembling webapp[maven-war-plugin-test] in [/home/hudson/workspace/maven-plugins-ITs/jdk/1.5/label/ubuntu/trunk/maven-war-plugin/target/test-classes/unit/dependenciesanalysis/test-dir/remove-dependency]
[INFO] Dependency[Dependency {groupId=org.sample.jar, artifactId=lib-test, version=1.0, type=jar}]
has been removed from the project.
[INFO] Processing war project
[INFO] Copying webapp resources[/home/hudson/workspace/maven-plugins-ITs/jdk/1.5/label/ubuntu/trunk/maven-war-plugin/target/test-classes/unit/dependenciesanalysis/test-dir/remove-dependency-test-data/source]
[INFO] Webapp assembled in [2 msecs]
[INFO] Exploding webapp
[INFO] Assembling webapp[maven-war-plugin-test] in [/home/hudson/workspace/maven-plugins-ITs/jdk/1.5/label/ubuntu/trunk/maven-war-plugin/target/test-classes/unit/dependenciesanalysis/test-dir/dependency-update-version]
[INFO] Processing war project
[INFO] Copying webapp resources[/home/hudson/workspace/maven-plugins-ITs/jdk/1.5/label/ubuntu/trunk/maven-war-plugin/target/test-classes/unit/dependenciesanalysis/test-dir/dependency-update-version-test-data/source]
[INFO] Webapp assembled in [24 msecs]
[INFO] Exploding webapp
[INFO] Assembling webapp[maven-war-plugin-test] in [/home/hudson/workspace/maven-plugins-ITs/jdk/1.5/label/ubuntu/trunk/maven-war-plugin/target/test-classes/unit/dependenciesanalysis/test-dir/dependency-update-version]
[INFO] Version of dependency[Dependency {groupId=org.sample.jar, artifactId=lib-test, version=2.0,
type=jar}] has changed (1.0 -> 2.0).
[INFO] Processing war project
[INFO] Copying webapp resources[/home/hudson/workspace/maven-plugins-ITs/jdk/1.5/label/ubuntu/trunk/maven-war-plugin/target/test-classes/unit/dependenciesanalysis/test-dir/dependency-update-version-test-data/source]
[INFO] Webapp assembled in [4 msecs]
[INFO] Exploding webapp
[INFO] Assembling webapp[maven-war-plugin-test] in [/home/hudson/workspace/maven-plugins-ITs/jdk/1.5/label/ubuntu/trunk/maven-war-plugin/target/test-classes/unit/dependenciesanalysis/test-dir/dependency-now-provided]
[INFO] Processing war project
[INFO] Copying webapp resources[/home/hudson/workspace/maven-plugins-ITs/jdk/1.5/label/ubuntu/trunk/maven-war-plugin/target/test-classes/unit/dependenciesanalysis/test-dir/dependency-now-provided-test-data/source]
[INFO] Webapp assembled in [15 msecs]
[INFO] Exploding webapp
[INFO] Assembling webapp[maven-war-plugin-test] in [/home/hudson/workspace/maven-plugins-ITs/jdk/1.5/label/ubuntu/trunk/maven-war-plugin/target/test-classes/unit/dependenciesanalysis/test-dir/dependency-now-provided]
[INFO] Scope of dependency[Dependency {groupId=org.sample.jar, artifactId=lib-test, version=1.0,
type=jar}] has changed (runtime -> provided).
[INFO] Processing war project
[INFO] Copying webapp resources[/home/hudson/workspace/maven-plugins-ITs/jdk/1.5/label/ubuntu/trunk/maven-war-plugin/target/test-classes/unit/dependenciesanalysis/test-dir/dependency-now-provided-test-data/source]
[INFO] Webapp assembled in [4 msecs]
Tests run: 4, Failures: 0, Errors: 0, Skipped: 0, Time elapsed: 0.276 sec

Results :

Tests run: 81, Failures: 0, Errors: 0, Skipped: 0

[INFO] [jar:jar {execution: default-jar}]
[INFO] Building jar: /home/hudson/workspace/maven-plugins-ITs/jdk/1.5/label/ubuntu/trunk/maven-war-plugin/target/maven-war-plugin-2.1-beta-2-SNAPSHOT.jar
[INFO] [plugin:addPluginArtifactMetadata {execution: default-addPluginArtifactMetadata}]
[INFO] [invoker:install {execution: integration-test}]
[INFO] Installing /home/hudson/workspace/maven-plugins-ITs/jdk/1.5/label/ubuntu/trunk/maven-war-plugin/pom.xml
to /home/hudson/workspace/maven-plugins-ITs/jdk/1.5/label/ubuntu/trunk/maven-war-plugin/target/local-repo/org/apache/maven/plugins/maven-war-plugin/2.1-beta-2-SNAPSHOT/maven-war-plugin-2.1-beta-2-SNAPSHOT.pom
[INFO] Installing /home/hudson/workspace/maven-plugins-ITs/jdk/1.5/label/ubuntu/trunk/maven-war-plugin/target/maven-war-plugin-2.1-beta-2-SNAPSHOT.jar
to /home/hudson/workspace/maven-plugins-ITs/jdk/1.5/label/ubuntu/trunk/maven-war-plugin/target/local-repo/org/apache/maven/plugins/maven-war-plugin/2.1-beta-2-SNAPSHOT/maven-war-plugin-2.1-beta-2-SNAPSHOT.jar
[INFO] [invoker:run {execution: integration-test}]
[INFO] Building: web-resources-filtering/pom.xml
[INFO] ..SUCCESS (21.1 s)
[INFO] Building: MWAR-96/pom.xml
[INFO] ..SUCCESS (4.1 s)
[INFO] Building: MWAR-62/pom.xml
[INFO] ..SUCCESS (3.0 s)
[INFO] Building: default/pom.xml
[INFO] ..SUCCESS (5.7 s)
[INFO] Building: simple-war-no-webxml/pom.xml
[INFO] ..SUCCESS (4.8 s)
[INFO] Building: scoped-dependency-same-artifact/pom.xml
[INFO] ..SUCCESS (5.4 s)
[INFO] Building: MWAR-143/pom.xml
[INFO] ..SUCCESS (9.0 s)
[INFO] Building: MWAR-139/pom.xml
[INFO] ..SUCCESS (4.3 s)
[INFO] Building: simple-war-project/pom.xml
[INFO] ..SUCCESS (4.3 s)
[INFO] Building: MWAR-129/pom.xml
[INFO] ..SUCCESS (3.3 s)
[INFO] Building: MWAR-133/pom.xml
[INFO] ..SUCCESS (3.3 s)
[INFO] Building: MWAR-131/pom.xml
[INFO] ..SUCCESS (19.6 s)
[INFO] ---------------------------------------
[INFO] Execution Summary:
[INFO]   Builds Passing: 12
[INFO]   Builds Failing: 0
[INFO]   Builds Skipped: 0
[INFO] ---------------------------------------
[INFO] [install:install {execution: default-install}]
[INFO] Installing /home/hudson/workspace/maven-plugins-ITs/jdk/1.5/label/ubuntu/trunk/maven-war-plugin/target/maven-war-plugin-2.1-beta-2-SNAPSHOT.jar
to /opt/repos/local-repository/org/apache/maven/plugins/maven-war-plugin/2.1-beta-2-SNAPSHOT/maven-war-plugin-2.1-beta-2-SNAPSHOT.jar
[INFO] [deploy:deploy {execution: default-deploy}]
[INFO] Retrieving previous build number from apache.snapshots.https
Uploading: http://repository.sonatype.org:8081/content/repositories/maven.snapshots/org/apache/maven/plugins/maven-war-plugin/2.1-beta-2-SNAPSHOT/maven-war-plugin-2.1-beta-2-20100415.060841-420.jar
74K uploaded  (maven-war-plugin-2.1-beta-2-20100415.060841-420.jar)
[INFO] Retrieving previous metadata from apache.snapshots.https
[INFO] Uploading repository metadata for: 'artifact org.apache.maven.plugins:maven-war-plugin'
[INFO] Retrieving previous metadata from apache.snapshots.https
[INFO] Uploading repository metadata for: 'snapshot org.apache.maven.plugins:maven-war-plugin:2.1-beta-2-SNAPSHOT'
[INFO] Retrieving previous metadata from apache.snapshots.https
[INFO] Uploading repository metadata for: 'org.apache.maven.plugins'
[INFO] Uploading project information for maven-war-plugin 2.1-beta-2-20100415.060841-420
[INFO] 
[INFO] 
[INFO] ------------------------------------------------------------------------
[INFO] Reactor Summary:
[INFO] ------------------------------------------------------------------------
[INFO] Maven Plugins ......................................... SUCCESS [1:50.752s]
[INFO] Maven Invoker Plugin .................................. SUCCESS [9:03.495s]
[INFO] Maven Ant Plugin ...................................... SUCCESS [2:55.266s]
[INFO] Maven AntRun Plugin ................................... SUCCESS [1:08.435s]
[INFO] Maven Eclipse Plugin .................................. FAILED [17:17.027s]
[INFO] Maven Site Plugin ..................................... SUCCESS [5:11.752s]
[INFO] Maven Changelog Plugin ................................ SUCCESS [43.402s]
[INFO] Maven Changes Report Plugin ........................... SUCCESS [1:26.092s]
[INFO] Maven Checkstyle Plugin ............................... SUCCESS [2:51.398s]
[INFO] Maven Clean Plugin .................................... SUCCESS [25.684s]
[INFO] Maven Compiler Plugin ................................. SUCCESS [38.801s]
[INFO] Maven Dependency Plugin ............................... SUCCESS [4:02.714s]
[INFO] Maven Deploy Plugin ................................... SUCCESS [2:00.063s]
[INFO] Maven DOAP Plugin ..................................... SUCCESS [25.348s]
[INFO] Maven Documentation Checker Plugin .................... FAILED [22.924s]
[INFO] Maven EAR Plugin ...................................... SUCCESS [5:06.101s]
[INFO] Maven EJB Plugin ...................................... SUCCESS [59.426s]
[INFO] Maven GPG Plugin ...................................... SUCCESS [38.130s]
[INFO] Maven Help Plugin ..................................... SUCCESS [1:13.726s]
[INFO] Maven IDEA Plugin ..................................... SUCCESS [28.040s]
[INFO] Maven Install Plugin .................................. SUCCESS [1:49.981s]
[INFO] Maven JAR Plugin ...................................... SUCCESS [2:21.019s]
[INFO] Maven Jarsigner Plugin ................................ SUCCESS [1:09.109s]
[INFO] Maven Shade Plugin .................................... SUCCESS [3:10.326s]
[INFO] Maven Javadoc Plugin .................................. SUCCESS [14:30.905s]
[INFO] Maven Linkcheck Plugin ................................ SUCCESS [7.228s]
[INFO] Maven One Plugin ...................................... SUCCESS [7.184s]
[INFO] Maven Patch Plugin .................................... SUCCESS [26.254s]
[INFO] Maven PDF Plugin ...................................... SUCCESS [1:20.129s]
[INFO] Maven PMD Plugin ...................................... SUCCESS [1:43.913s]
[INFO] Maven RAR Plugin ...................................... SUCCESS [25.198s]
[INFO] Maven Reactor Plugin .................................. SUCCESS [13.659s]
[INFO] Maven Repository Plugin ............................... SUCCESS [1:43.154s]
[INFO] Maven Resources Plugin ................................ SUCCESS [1:06.485s]
[INFO] Maven Source Plugin ................................... SUCCESS [41.561s]
[INFO] Maven Stage Plugin .................................... SUCCESS [5.569s]
[INFO] Maven Toolchains Plugin ............................... SUCCESS [4.235s]
[INFO] Maven Verifier Plugin ................................. SUCCESS [27.711s]
[INFO] Maven WAR Plugin ...................................... SUCCESS [1:52.406s]
[INFO] ------------------------------------------------------------------------
[INFO] Error for project: Maven Eclipse Plugin (during deploy)
[INFO] ------------------------------------------------------------------------
[INFO] There are test failures.

Please refer to /home/hudson/workspace/maven-plugins-ITs/jdk/1.5/label/ubuntu/trunk/maven-eclipse-plugin/target/surefire-reports
for the individual test results.
[INFO] ------------------------------------------------------------------------
[INFO] Trace
org.apache.maven.BuildFailureException: There are test failures.

Please refer to /home/hudson/workspace/maven-plugins-ITs/jdk/1.5/label/ubuntu/trunk/maven-eclipse-plugin/target/surefire-reports
for the individual test results.
	at org.apache.maven.lifecycle.DefaultLifecycleExecutor.executeGoals(DefaultLifecycleExecutor.java:715)
	at org.apache.maven.lifecycle.DefaultLifecycleExecutor.executeGoalWithLifecycle(DefaultLifecycleExecutor.java:556)
	at org.apache.maven.lifecycle.DefaultLifecycleExecutor.executeGoal(DefaultLifecycleExecutor.java:535)
	at org.apache.maven.lifecycle.DefaultLifecycleExecutor.executeGoalAndHandleFailures(DefaultLifecycleExecutor.java:387)
	at org.apache.maven.lifecycle.DefaultLifecycleExecutor.executeTaskSegments(DefaultLifecycleExecutor.java:348)
	at org.apache.maven.lifecycle.DefaultLifecycleExecutor.execute(DefaultLifecycleExecutor.java:180)
	at org.apache.maven.DefaultMaven.doExecute(DefaultMaven.java:328)
	at org.apache.maven.DefaultMaven.execute(DefaultMaven.java:138)
	at org.apache.maven.cli.MavenCli.main(MavenCli.java:362)
	at org.apache.maven.cli.compat.CompatibleMain.main(CompatibleMain.java:60)
	at sun.reflect.NativeMethodAccessorImpl.invoke0(Native Method)
	at sun.reflect.NativeMethodAccessorImpl.invoke(NativeMethodAccessorImpl.java:39)
	at sun.reflect.DelegatingMethodAccessorImpl.invoke(DelegatingMethodAccessorImpl.java:25)
	at java.lang.reflect.Method.invoke(Method.java:585)
	at org.codehaus.classworlds.Launcher.launchEnhanced(Launcher.java:315)
	at org.codehaus.classworlds.Launcher.launch(Launcher.java:255)
	at org.codehaus.classworlds.Launcher.mainWithExitCode(Launcher.java:430)
	at org.codehaus.classworlds.Launcher.main(Launcher.java:375)
Caused by: org.apache.maven.plugin.MojoFailureException: There are test failures.

Please refer to /home/hudson/workspace/maven-plugins-ITs/jdk/1.5/label/ubuntu/trunk/maven-eclipse-plugin/target/surefire-reports
for the individual test results.
	at org.apache.maven.plugin.surefire.SurefirePlugin.execute(SurefirePlugin.java:575)
	at org.apache.maven.plugin.DefaultPluginManager.executeMojo(DefaultPluginManager.java:490)
	at org.apache.maven.lifecycle.DefaultLifecycleExecutor.executeGoals(DefaultLifecycleExecutor.java:694)
	... 17 more
[INFO] ------------------------------------------------------------------------
[INFO] Error for project: Maven Documentation Checker Plugin (during deploy)
[INFO] ------------------------------------------------------------------------
[INFO] : org.apache.maven.plugin.invoker.InvokerSession@1280234
1 build failed.
[INFO] ------------------------------------------------------------------------
[INFO] Trace
org.apache.maven.BuildFailureException: 1 build failed.
	at org.apache.maven.lifecycle.DefaultLifecycleExecutor.executeGoals(DefaultLifecycleExecutor.java:715)
	at org.apache.maven.lifecycle.DefaultLifecycleExecutor.executeGoalWithLifecycle(DefaultLifecycleExecutor.java:556)
	at org.apache.maven.lifecycle.DefaultLifecycleExecutor.executeGoal(DefaultLifecycleExecutor.java:535)
	at org.apache.maven.lifecycle.DefaultLifecycleExecutor.executeGoalAndHandleFailures(DefaultLifecycleExecutor.java:387)
	at org.apache.maven.lifecycle.DefaultLifecycleExecutor.executeTaskSegments(DefaultLifecycleExecutor.java:348)
	at org.apache.maven.lifecycle.DefaultLifecycleExecutor.execute(DefaultLifecycleExecutor.java:180)
	at org.apache.maven.DefaultMaven.doExecute(DefaultMaven.java:328)
	at org.apache.maven.DefaultMaven.execute(DefaultMaven.java:138)
	at org.apache.maven.cli.MavenCli.main(MavenCli.java:362)
	at org.apache.maven.cli.compat.CompatibleMain.main(CompatibleMain.java:60)
	at sun.reflect.NativeMethodAccessorImpl.invoke0(Native Method)
	at sun.reflect.NativeMethodAccessorImpl.invoke(NativeMethodAccessorImpl.java:39)
	at sun.reflect.DelegatingMethodAccessorImpl.invoke(DelegatingMethodAccessorImpl.java:25)
	at java.lang.reflect.Method.invoke(Method.java:585)
	at org.codehaus.classworlds.Launcher.launchEnhanced(Launcher.java:315)
	at org.codehaus.classworlds.Launcher.launch(Launcher.java:255)
	at org.codehaus.classworlds.Launcher.mainWithExitCode(Launcher.java:430)
	at org.codehaus.classworlds.Launcher.main(Launcher.java:375)
Caused by: org.apache.maven.plugin.MojoFailureException: 1 build failed.
	at org.apache.maven.plugin.invoker.InvokerSession.handleFailures(InvokerSession.java:244)
	at org.apache.maven.plugin.invoker.InvokerMojo.processResults(InvokerMojo.java:58)
	at org.apache.maven.plugin.invoker.AbstractInvokerMojo.execute(AbstractInvokerMojo.java:601)
	at org.apache.maven.plugin.DefaultPluginManager.executeMojo(DefaultPluginManager.java:490)
	at org.apache.maven.lifecycle.DefaultLifecycleExecutor.executeGoals(DefaultLifecycleExecutor.java:694)
	... 17 more
[INFO] ------------------------------------------------------------------------
[INFO] BUILD ERRORS
[INFO] ------------------------------------------------------------------------
[INFO] Total time: 92 minutes 23 seconds
[INFO] Finished at: Thu Apr 15 01:39:17 GMT-06:00 2010
[INFO] Final Memory: 59M/115M
[INFO] ------------------------------------------------------------------------


Mime
View raw message