maven-notifications mailing list archives

Site index · List index
Message view « Date » · « Thread »
Top « Date » · « Thread »
From Hudson <Hud...@sonatype.org>
Subject Build failed in Hudson: maven-3.0.x-ITs » 1.5,windows #226
Date Sun, 11 Apr 2010 22:09:10 GMT
See <http://grid.sonatype.org/ci/job/maven-3.0.x-ITs/./jdk=1.5,label=windows/226/>

------------------------------------------
[...truncated 730 lines...]
0145ReactorWithIncludesExcludes(itCustomIncludes)...........SKIPPED - version 3.0-SNAPSHOT
not in range [2.0,3.0-alpha-1)
0145ReactorWithIncludesExcludes(itCustomExcludes)...........SKIPPED - version 3.0-SNAPSHOT
not in range [2.0,3.0-alpha-1)
0144LifecycleExecutionOrder(it0144).........................OK (6.4 s)
0143TransitiveDependencyScopes(itCompileScope)..............OK (0.6 s)
0143TransitiveDependencyScopes(itProvidedScope).............OK (0.6 s)
0143TransitiveDependencyScopes(itRuntimeScope)..............OK (0.6 s)
0143TransitiveDependencyScopes(itTestScope).................OK (0.6 s)
0142DirectDependencyScopes(it0142)..........................OK (0.6 s)
0140InterpolationWithPomPrefix(it0140)......................OK (0.5 s)
0139InterpolationWithProjectPrefix(it0139)..................OK (0.6 s)
0138PluginLifecycle(it0138).................................OK (2.0 s)
0137EarLifecycle(it0137)....................................OK (1.8 s)
0136RarLifecycle(it0136)....................................OK (1.8 s)
0135EjbLifecycle(it0135)....................................OK (6.0 s)
0134WarLifecycle(it0134)....................................OK (1.3 s)
0133JarLifecycle(it0133)....................................OK (0.6 s)
0132PomLifecycle(it0132)....................................OK (0.6 s)
0131SiteLifecycle(it0131)...................................OK (0.5 s)
0130CleanLifecycle(it0130)..................................OK (0.5 s)
0113ServerAuthzAvailableToWagonMgrInPlugin(it0113)..........OK (0.6 s)
0090EnvVarInterpolation(it0090).............................OK (3.4 s)
0087PluginRealmWithProjectLevelDeps(it0087).................OK (0.7 s)
0086PluginRealm(it0086).....................................OK (0.8 s)
0085TransitiveSystemScope(it0085)...........................OK (0.6 s)
0072InterpolationWithDottedProperty(it0072).................OK (0.6 s)
0071PluginConfigWithDottedProperty(it0071)..................OK (0.7 s)
0064MojoConfigViaSetters(it0064)............................OK (8.0 s)
0063SystemScopeDependency(it0063)...........................OK (0.6 s)
0056MultipleGoalExecutions(it0056)..........................OK (0.6 s)
0052ReleaseProfile(it0052)..................................OK (1.2 s)
0051ReleaseProfile(it0051)..................................OK (4.0 s)
0041ArtifactTypeFromPluginExtension(it0041).................OK (1.3 s)
0040PackagingFromPluginExtension(it0040)....................OK (0.6 s)
0039ReleasePomInReactor(it0039).............................SKIPPED - version 3.0-SNAPSHOT
not in range [2.0,3.0-alpha-1)
0038AlternatePomFileDifferentDir(it0038)....................OK (0.6 s)
0037AlternatePomFileSameDir(it0037).........................OK (0.6 s)
0036ReleasePom(it0036)......................................SKIPPED - version 3.0-SNAPSHOT
not in range (2.0,3.0-alpha-1)
0032MavenPrerequisite(it0032)...............................OK (0.5 s)
0030DepPomDepMngtInheritance(it0030)........................OK (3.6 s)
0025MultipleExecutionLevelConfigs(it0025)...................OK (0.5 s)
0024MultipleGoalExecutions(it0024)..........................OK (0.5 s)
0023SettingsProfile(it0023).................................OK (0.5 s)
0021PomProfile(it0021)......................................OK (0.6 s)
0019PluginVersionMngtBySuperPom(it0019).....................OK (0.5 s)
0018DependencyManagement(it0018)............................OK (0.5 s)
0012PomInterpolation(it0012)................................OK (0.5 s)
0011DefaultVersionByDependencyManagement(it0011)............OK (0.6 s)
0010DependencyClosureResolution(it0010).....................OK (0.5 s)
0009GoalConfiguration(it0009)...............................OK (0.5 s)
0008SimplePlugin(it0008)....................................OK (1.0 s)
Tests run: 598, Failures: 0, Errors: 1, Skipped: 0, Time elapsed: 749.106 sec <<<
FAILURE!
testmng4189(org.apache.maven.it.MavenITmng4189UniqueVersionSnapshotTest)  Time elapsed: 0.167
sec  <<< ERROR!
org.apache.maven.it.VerificationException: Exit code was non-zero: 1; command line and log
= 
C:\home\hudson\workspace\maven-3.0.x-ITs\jdk\1.5\label\windows\core-integration-tests\target\distro\bin\mvn
--settings settings.xml -e --batch-mode -Dmaven.repo.local=C:\opt\repos\local-repository compile
[INFO] Error stacktraces are turned on.
[INFO] Scanning for projects...
[INFO]                                                                         
[INFO] ------------------------------------------------------------------------
[INFO] Building consumer of 1.0-20090608.090416-1 1.0-SNAPSHOT
[INFO] ------------------------------------------------------------------------
[INFO] ------------------------------------------------------------------------
[INFO] BUILD FAILURE
[INFO] ------------------------------------------------------------------------
[INFO] Total time: 0.009s
[INFO] Finished at: Sun Apr 11 15:01:31 PDT 2010
[INFO] Final Memory: 26M/49M
[INFO] ------------------------------------------------------------------------
[ERROR] Plugin org.apache.maven.plugins:maven-compiler-plugin:2.3 or one of its dependencies
could not be resolved: Missing:
----------
1) org.apache.maven.plugins:maven-compiler-plugin:maven-plugin:2.3

  Try downloading the file manually from the project website.

  Then, install it using the command: 
      mvn install:install-file -DgroupId=org.apache.maven.plugins -DartifactId=maven-compiler-plugin
-Dversion=2.3 -Dpackaging=maven-plugin -Dfile=/path/to/file

  Alternatively, if you host your own repository you can deploy the file there: 
      mvn deploy:deploy-file -DgroupId=org.apache.maven.plugins -DartifactId=maven-compiler-plugin
-Dversion=2.3 -Dpackaging=maven-plugin -Dfile=/path/to/file -Durl=[url] -DrepositoryId=[id]

----------
1 required artifact is missing.
for artifact: 
  org.apache.maven.plugins:maven-compiler-plugin:maven-plugin:2.3

from the specified remote repositories:
  central (http://repo1.maven.org/maven2, releases=true, snapshots=false)
-> [Help 1]
org.apache.maven.plugin.PluginResolutionException: Plugin org.apache.maven.plugins:maven-compiler-plugin:2.3
or one of its dependencies could not be resolved: Missing:
----------
1) org.apache.maven.plugins:maven-compiler-plugin:maven-plugin:2.3

  Try downloading the file manually from the project website.

  Then, install it using the command: 
      mvn install:install-file -DgroupId=org.apache.maven.plugins -DartifactId=maven-compiler-plugin
-Dversion=2.3 -Dpackaging=maven-plugin -Dfile=/path/to/file

  Alternatively, if you host your own repository you can deploy the file there: 
      mvn deploy:deploy-file -DgroupId=org.apache.maven.plugins -DartifactId=maven-compiler-plugin
-Dversion=2.3 -Dpackaging=maven-plugin -Dfile=/path/to/file -Durl=[url] -DrepositoryId=[id]

----------
1 required artifact is missing.
for artifact: 
  org.apache.maven.plugins:maven-compiler-plugin:maven-plugin:2.3

from the specified remote repositories:
  central (http://repo1.maven.org/maven2, releases=true, snapshots=false)

	at org.apache.maven.plugin.internal.DefaultPluginDependenciesResolver.resolve(DefaultPluginDependenciesResolver.java:83)
	at org.apache.maven.plugin.internal.DefaultMavenPluginManager.getPluginDescriptor(DefaultMavenPluginManager.java:127)
	at org.apache.maven.plugin.internal.DefaultMavenPluginManager.getMojoDescriptor(DefaultMavenPluginManager.java:241)
	at org.apache.maven.plugin.DefaultBuildPluginManager.getMojoDescriptor(DefaultBuildPluginManager.java:194)
	at org.apache.maven.lifecycle.internal.LifecycleExecutionPlanCalculatorImpl.calculateExecutionPlan(LifecycleExecutionPlanCalculatorImpl.java:148)
	at org.apache.maven.lifecycle.internal.LifecycleExecutionPlanCalculatorImpl.calculateExecutionPlan(LifecycleExecutionPlanCalculatorImpl.java:89)
	at org.apache.maven.lifecycle.internal.BuilderCommon.resolveBuildPlan(BuilderCommon.java:72)
	at org.apache.maven.lifecycle.internal.LifecycleModuleBuilder.buildProject(LifecycleModuleBuilder.java:75)
	at org.apache.maven.lifecycle.internal.LifecycleModuleBuilder.buildProject(LifecycleModuleBuilder.java:51)
	at org.apache.maven.lifecycle.DefaultLifecycleExecutor.singleThreadedBuild(DefaultLifecycleExecutor.java:218)
	at org.apache.maven.lifecycle.DefaultLifecycleExecutor.execute(DefaultLifecycleExecutor.java:190)
	at org.apache.maven.DefaultMaven.doExecute(DefaultMaven.java:246)
	at org.apache.maven.DefaultMaven.execute(DefaultMaven.java:95)
	at org.apache.maven.cli.MavenCli.execute(MavenCli.java:430)
	at org.apache.maven.cli.MavenCli.doMain(MavenCli.java:160)
	at org.apache.maven.cli.MavenCli.doMain(MavenCli.java:142)
	at sun.reflect.GeneratedMethodAccessor5.invoke(Unknown Source)
	at sun.reflect.DelegatingMethodAccessorImpl.invoke(DelegatingMethodAccessorImpl.java:25)
	at java.lang.reflect.Method.invoke(Method.java:585)
	at org.apache.maven.it.Embedded3xLauncher.run(Embedded3xLauncher.java:176)
	at org.apache.maven.it.Verifier.executeGoals(Verifier.java:1301)
	at org.apache.maven.it.Verifier.executeGoal(Verifier.java:1166)
	at org.apache.maven.it.Verifier.executeGoal(Verifier.java:1160)
	at org.apache.maven.it.MavenITmng4189UniqueVersionSnapshotTest.testmng4189(MavenITmng4189UniqueVersionSnapshotTest.java:56)
Caused by: org.apache.maven.artifact.resolver.MultipleArtifactsNotFoundException: Missing:
----------
1) org.apache.maven.plugins:maven-compiler-plugin:maven-plugin:2.3

  Try downloading the file manually from the project website.

  Then, install it using the command: 
      mvn install:install-file -DgroupId=org.apache.maven.plugins -DartifactId=maven-compiler-plugin
-Dversion=2.3 -Dpackaging=maven-plugin -Dfile=/path/to/file

  Alternatively, if you host your own repository you can deploy the file there: 
      mvn deploy:deploy-file -DgroupId=org.apache.maven.plugins -DartifactId=maven-compiler-plugin
-Dversion=2.3 -Dpackaging=maven-plugin -Dfile=/path/to/file -Durl=[url] -DrepositoryId=[id]

----------
1 required artifact is missing.
for artifact: 
  org.apache.maven.plugins:maven-compiler-plugin:maven-plugin:2.3

from the specified remote repositories:
  central (http://repo1.maven.org/maven2, releases=true, snapshots=false)

	at org.apache.maven.artifact.resolver.DefaultResolutionErrorHandler.throwErrors(DefaultResolutionErrorHandler.java:71)
	at org.apache.maven.plugin.internal.DefaultPluginDependenciesResolver.resolve(DefaultPluginDependenciesResolver.java:79)
	... 52 more
[ERROR] 
[ERROR] Re-run Maven using the -X switch to enable full debug logging.
[ERROR] 
[ERROR] For more information about the errors and possible solutions, please read the following
articles:
[ERROR] [Help 1] http://cwiki.apache.org/confluence/display/MAVEN/PluginResolutionException

	at org.apache.maven.it.Verifier.executeGoals(Verifier.java:1323)
	at org.apache.maven.it.Verifier.executeGoal(Verifier.java:1166)
	at org.apache.maven.it.Verifier.executeGoal(Verifier.java:1160)
	at org.apache.maven.it.MavenITmng4189UniqueVersionSnapshotTest.testmng4189(MavenITmng4189UniqueVersionSnapshotTest.java:56)
	at sun.reflect.NativeMethodAccessorImpl.invoke0(Native Method)
	at sun.reflect.NativeMethodAccessorImpl.invoke(NativeMethodAccessorImpl.java:39)
	at sun.reflect.DelegatingMethodAccessorImpl.invoke(DelegatingMethodAccessorImpl.java:25)
	at java.lang.reflect.Method.invoke(Method.java:585)
	at junit.framework.TestCase.runTest(TestCase.java:164)
	at org.apache.maven.it.AbstractMavenIntegrationTestCase.runTest(AbstractMavenIntegrationTestCase.java:198)
	at junit.framework.TestCase.runBare(TestCase.java:130)
	at junit.framework.TestResult$1.protect(TestResult.java:106)
	at junit.framework.TestResult.runProtected(TestResult.java:124)
	at junit.framework.TestResult.run(TestResult.java:109)
	at junit.framework.TestCase.run(TestCase.java:120)
	at junit.framework.TestSuite.runTest(TestSuite.java:230)
	at junit.framework.TestSuite.run(TestSuite.java:225)
	at junit.framework.TestSuite.runTest(TestSuite.java:230)
	at junit.framework.TestSuite.run(TestSuite.java:225)
	at sun.reflect.NativeMethodAccessorImpl.invoke0(Native Method)
	at sun.reflect.NativeMethodAccessorImpl.invoke(NativeMethodAccessorImpl.java:39)
	at sun.reflect.DelegatingMethodAccessorImpl.invoke(DelegatingMethodAccessorImpl.java:25)
	at java.lang.reflect.Method.invoke(Method.java:585)
	at org.apache.maven.surefire.junit.JUnitTestSet.execute(JUnitTestSet.java:213)
	at org.apache.maven.surefire.suite.AbstractDirectoryTestSuite.executeTestSet(AbstractDirectoryTestSuite.java:140)
	at org.apache.maven.surefire.suite.AbstractDirectoryTestSuite.execute(AbstractDirectoryTestSuite.java:127)
	at org.apache.maven.surefire.Surefire.run(Surefire.java:177)
	at sun.reflect.NativeMethodAccessorImpl.invoke0(Native Method)
	at sun.reflect.NativeMethodAccessorImpl.invoke(NativeMethodAccessorImpl.java:39)
	at sun.reflect.DelegatingMethodAccessorImpl.invoke(DelegatingMethodAccessorImpl.java:25)
	at java.lang.reflect.Method.invoke(Method.java:585)
	at org.apache.maven.surefire.booter.SurefireBooter.runSuitesInProcess(SurefireBooter.java:345)
	at org.apache.maven.surefire.booter.SurefireBooter.main(SurefireBooter.java:1009)


Results :

Tests in error: 
  testmng4189(org.apache.maven.it.MavenITmng4189UniqueVersionSnapshotTest)

Tests run: 598, Failures: 0, Errors: 1, Skipped: 0

[INFO] ------------------------------------------------------------------------
[INFO] BUILD FAILURE
[INFO] ------------------------------------------------------------------------
[INFO] Total time: 15:40.311s
[INFO] Finished at: Sun Apr 11 15:09:09 PDT 2010
[INFO] Final Memory: 6M/31M
[INFO] ------------------------------------------------------------------------
[ERROR] Failed to execute goal org.apache.maven.plugins:maven-surefire-plugin:2.4.3:test (default-test)
on project core-it-suite: There are test failures.

Please refer to C:\home\hudson\workspace\maven-3.0.x-ITs\jdk\1.5\label\windows\core-integration-tests\target\surefire-reports
for the individual test results.
-> [Help 1]
org.apache.maven.lifecycle.LifecycleExecutionException: Failed to execute goal org.apache.maven.plugins:maven-surefire-plugin:2.4.3:test
(default-test) on project core-it-suite: There are test failures.

Please refer to C:\home\hudson\workspace\maven-3.0.x-ITs\jdk\1.5\label\windows\core-integration-tests\target\surefire-reports
for the individual test results.
	at org.apache.maven.lifecycle.internal.MojoExecutor.execute(MojoExecutor.java:138)
	at org.apache.maven.lifecycle.internal.MojoExecutor.execute(MojoExecutor.java:78)
	at org.apache.maven.lifecycle.internal.MojoExecutor.execute(MojoExecutor.java:69)
	at org.apache.maven.lifecycle.internal.LifecycleModuleBuilder.buildProject(LifecycleModuleBuilder.java:78)
	at org.apache.maven.lifecycle.internal.LifecycleModuleBuilder.buildProject(LifecycleModuleBuilder.java:51)
	at org.apache.maven.lifecycle.DefaultLifecycleExecutor.singleThreadedBuild(DefaultLifecycleExecutor.java:218)
	at org.apache.maven.lifecycle.DefaultLifecycleExecutor.execute(DefaultLifecycleExecutor.java:190)
	at org.apache.maven.DefaultMaven.doExecute(DefaultMaven.java:246)
	at org.apache.maven.DefaultMaven.execute(DefaultMaven.java:95)
	at org.apache.maven.cli.MavenCli.execute(MavenCli.java:430)
	at org.apache.maven.cli.MavenCli.doMain(MavenCli.java:160)
	at org.apache.maven.cli.MavenCli.main(MavenCli.java:124)
	at sun.reflect.NativeMethodAccessorImpl.invoke0(Native Method)
	at sun.reflect.NativeMethodAccessorImpl.invoke(NativeMethodAccessorImpl.java:39)
	at sun.reflect.DelegatingMethodAccessorImpl.invoke(DelegatingMethodAccessorImpl.java:25)
	at java.lang.reflect.Method.invoke(Method.java:585)
	at org.codehaus.plexus.classworlds.launcher.Launcher.launchEnhanced(Launcher.java:290)
	at org.codehaus.plexus.classworlds.launcher.Launcher.launch(Launcher.java:230)
	at org.codehaus.plexus.classworlds.launcher.Launcher.mainWithExitCode(Launcher.java:409)
	at org.codehaus.plexus.classworlds.launcher.Launcher.main(Launcher.java:352)
Caused by: org.apache.maven.plugin.MojoFailureException: There are test failures.

Please refer to C:\home\hudson\workspace\maven-3.0.x-ITs\jdk\1.5\label\windows\core-integration-tests\target\surefire-reports
for the individual test results.
	at org.apache.maven.plugin.surefire.SurefirePlugin.execute(SurefirePlugin.java:575)
	at org.apache.maven.plugin.DefaultBuildPluginManager.executeMojo(DefaultBuildPluginManager.java:105)
	at org.apache.maven.lifecycle.internal.MojoExecutor.execute(MojoExecutor.java:134)
	... 19 more
[ERROR] 
[ERROR] Re-run Maven using the -X switch to enable full debug logging.
[ERROR] 
[ERROR] For more information about the errors and possible solutions, please read the following
articles:
[ERROR] [Help 1] http://cwiki.apache.org/confluence/display/MAVEN/MojoFailureException
Recording Emma reports core-integration-tests/target/site/emma/coverage.xml


Mime
View raw message