maven-notifications mailing list archives

Site index · List index
Message view « Date » · « Thread »
Top « Date » · « Thread »
From Hudson <Hud...@sonatype.org>
Subject Build failed in Hudson: maven-3.0.x-ITs » 1.5,ubuntu #219
Date Thu, 08 Apr 2010 12:02:22 GMT
See <http://grid.sonatype.org/ci/job/maven-3.0.x-ITs/./jdk=1.5,label=ubuntu/219/changes>

Changes:

[Benjamin Bentmann] o Used more interesting packaging

[Benjamin Bentmann] [MNG-4629] [regression] POM validation fails upon non-existing system-scope
dependency

o Added IT

------------------------------------------
Started by upstream project "maven-3.0.x-ITs" build number 219
Building remotely on jeos1
Updating http://svn.apache.org/repos/asf/maven/core-integration-testing/trunk/core-it-suite
AU        src/test/java/org/apache/maven/it/MavenITmng4629NoPomValidationErrorUponMissingSystemDepTest.java
U         src/test/java/org/apache/maven/it/IntegrationTestSuite.java
A         src/test/resources/mng-4629
AU        src/test/resources/mng-4629/pom.xml
At revision 931872
Checking last modified date for http://master.grid.sonatype.com:8080/ci/job/maven-3.0.x-bootstrap/jdk=1.5,label=ubuntu/lastSuccessfulBuild/artifact/trunk/apache-maven/target/apache-maven-3.0-SNAPSHOT-bin.zip
Maven install at http://master.grid.sonatype.com:8080/ci/job/maven-3.0.x-bootstrap/jdk=1.5,label=ubuntu/lastSuccessfulBuild/artifact/trunk/apache-maven/target/apache-maven-3.0-SNAPSHOT-bin.zip
already downloaded
Installing Maven - Unzipping /home/hudson/.hudson/maven-install/3.0.x/maven.zip to /home/hudson//maven-it/3.0.x
Apache Maven 3.0-SNAPSHOT (r931869; 2010-04-08 04:53:43-0600)
Java version: 1.5.0_11
Java home: /opt/java/sdk/1.5/jre
Default locale: en_US, platform encoding: UTF-8
OS name: "linux" version: "2.6.24-19-virtual" arch: "i386" Family: "unix"
[INFO] Error stacktraces are turned on.
[INFO] Scanning for projects...
[INFO] snapshot org.apache.maven.its:core-integration-testing-parent:2.1-SNAPSHOT: checking
for updates from Nexus
Downloading: http://repository.sonatype.org:8081/content/groups/sonatype-public-grid/org/apache/maven/its/core-integration-testing-parent/2.1-SNAPSHOT/core-integration-testing-parent-2.1-20100407.160134-671.pom
Downloaded: http://repository.sonatype.org:8081/content/groups/sonatype-public-grid/org/apache/maven/its/core-integration-testing-parent/2.1-SNAPSHOT/core-integration-testing-parent-2.1-20100407.160134-671.pom
(2 KB at 8.9 KB/sec)
[INFO]                                                                         
[INFO] ------------------------------------------------------------------------
[INFO] Building Maven Integration Tests 2.1-SNAPSHOT
[INFO] ------------------------------------------------------------------------
Downloading: http://repository.sonatype.org:8081/content/groups/sonatype-public-grid/org/apache/maven/plugins/maven-dependency-plugin/2.0/maven-dependency-plugin-2.0.jar
Downloaded: http://repository.sonatype.org:8081/content/groups/sonatype-public-grid/org/apache/maven/plugins/maven-dependency-plugin/2.0/maven-dependency-plugin-2.0.jar
(88 KB at 121.1 KB/sec)
Downloading: http://repository.sonatype.org:8081/content/groups/sonatype-public-grid/org/sonatype/maven/plugin/emma4it-maven-plugin/1.2/emma4it-maven-plugin-1.2.jar
Downloaded: http://repository.sonatype.org:8081/content/groups/sonatype-public-grid/org/sonatype/maven/plugin/emma4it-maven-plugin/1.2/emma4it-maven-plugin-1.2.jar
(25 KB at 75.0 KB/sec)
[INFO] snapshot org.apache.maven.its:maven-it-helper:2.1-SNAPSHOT: checking for updates from
Nexus
[WARNING] repository metadata for: 'snapshot org.apache.maven.its:maven-it-helper:2.1-SNAPSHOT'
could not be retrieved from repository: Nexus due to an error: Error transferring file: Connection
refused
Downloading: http://repository.sonatype.org:8081/content/groups/sonatype-public-grid/org/apache/maven/its/maven-it-helper/2.1-SNAPSHOT/maven-it-helper-2.1-SNAPSHOT.pom
[WARNING] Unable to get artifact org.apache.maven.its:maven-it-helper:pom:2.1-SNAPSHOT from
repository Nexus (http://repository.sonatype.org:8081/content/groups/sonatype-public-grid):
Error transferring file: Connection refused
[INFO] snapshot org.apache.maven.shared:maven-verifier:1.3-SNAPSHOT: checking for updates
from Nexus
[WARNING] repository metadata for: 'snapshot org.apache.maven.shared:maven-verifier:1.3-SNAPSHOT'
could not be retrieved from repository: Nexus due to an error: Error transferring file: Connection
refused
Downloading: http://repository.sonatype.org:8081/content/groups/sonatype-public-grid/org/apache/maven/shared/maven-verifier/1.3-SNAPSHOT/maven-verifier-1.3-SNAPSHOT.pom
[WARNING] Unable to get artifact org.apache.maven.shared:maven-verifier:pom:1.3-SNAPSHOT from
repository Nexus (http://repository.sonatype.org:8081/content/groups/sonatype-public-grid):
Error transferring file: Connection refused
Downloading: http://repository.sonatype.org:8081/content/groups/sonatype-public-grid/org/mortbay/jetty/jetty/6.1.14/jetty-6.1.14.pom
[WARNING] Unable to get artifact org.mortbay.jetty:jetty:pom:6.1.14 from repository Nexus
(http://repository.sonatype.org:8081/content/groups/sonatype-public-grid): Error transferring
file: Connection refused
[INFO] ------------------------------------------------------------------------
[INFO] BUILD FAILURE
[INFO] ------------------------------------------------------------------------
[INFO] Total time: 1:01:53.040s
[INFO] Finished at: Thu Apr 08 06:02:21 GMT-06:00 2010
[INFO] Final Memory: 2M/29M
[INFO] ------------------------------------------------------------------------
[ERROR] Failed to execute goal on project core-it-suite: Unable to get dependency information
for org.apache.maven.its:maven-it-helper:jar:2.1-SNAPSHOT: Failed to retrieve POM for org.apache.maven.its:maven-it-helper:jar:2.1-SNAPSHOT:
Error transferring file: Connection refused
  org.apache.maven.its:maven-it-helper:pom:2.1-SNAPSHOT

from the specified remote repositories:
  Nexus (http://repository.sonatype.org:8081/content/groups/sonatype-public-grid, releases=true,
snapshots=true)
-> [Help 1]
org.apache.maven.lifecycle.LifecycleExecutionException: Failed to execute goal on project
core-it-suite: Unable to get dependency information for org.apache.maven.its:maven-it-helper:jar:2.1-SNAPSHOT:
Failed to retrieve POM for org.apache.maven.its:maven-it-helper:jar:2.1-SNAPSHOT: Error transferring
file: Connection refused
  org.apache.maven.its:maven-it-helper:pom:2.1-SNAPSHOT

from the specified remote repositories:
  Nexus (http://repository.sonatype.org:8081/content/groups/sonatype-public-grid, releases=true,
snapshots=true)

	at org.apache.maven.lifecycle.DefaultLifecycleExecutor.resolveProjectDependencies(DefaultLifecycleExecutor.java:428)
	at org.apache.maven.lifecycle.DefaultLifecycleExecutor.execute(DefaultLifecycleExecutor.java:329)
	at org.apache.maven.DefaultMaven.doExecute(DefaultMaven.java:254)
	at org.apache.maven.DefaultMaven.execute(DefaultMaven.java:104)
	at org.apache.maven.cli.MavenCli.execute(MavenCli.java:427)
	at org.apache.maven.cli.MavenCli.doMain(MavenCli.java:157)
	at org.apache.maven.cli.MavenCli.main(MavenCli.java:121)
	at sun.reflect.NativeMethodAccessorImpl.invoke0(Native Method)
	at sun.reflect.NativeMethodAccessorImpl.invoke(NativeMethodAccessorImpl.java:39)
	at sun.reflect.DelegatingMethodAccessorImpl.invoke(DelegatingMethodAccessorImpl.java:25)
	at java.lang.reflect.Method.invoke(Method.java:585)
	at org.codehaus.plexus.classworlds.launcher.Launcher.launchEnhanced(Launcher.java:290)
	at org.codehaus.plexus.classworlds.launcher.Launcher.launch(Launcher.java:230)
	at org.codehaus.plexus.classworlds.launcher.Launcher.mainWithExitCode(Launcher.java:409)
	at org.codehaus.plexus.classworlds.launcher.Launcher.main(Launcher.java:352)
Caused by: org.apache.maven.artifact.resolver.ArtifactResolutionException: Unable to get dependency
information for org.apache.maven.its:maven-it-helper:jar:2.1-SNAPSHOT: Failed to retrieve
POM for org.apache.maven.its:maven-it-helper:jar:2.1-SNAPSHOT: Error transferring file: Connection
refused
  org.apache.maven.its:maven-it-helper:pom:2.1-SNAPSHOT

from the specified remote repositories:
  Nexus (http://repository.sonatype.org:8081/content/groups/sonatype-public-grid, releases=true,
snapshots=true)

	at org.apache.maven.repository.legacy.resolver.DefaultLegacyArtifactCollector.recurse(DefaultLegacyArtifactCollector.java:586)
	at org.apache.maven.repository.legacy.resolver.DefaultLegacyArtifactCollector.collect(DefaultLegacyArtifactCollector.java:150)
	at org.apache.maven.artifact.resolver.DefaultArtifactResolver.resolve(DefaultArtifactResolver.java:590)
	at org.apache.maven.repository.legacy.LegacyRepositorySystem.resolve(LegacyRepositorySystem.java:325)
	at org.apache.maven.DefaultProjectDependenciesResolver.resolve(DefaultProjectDependenciesResolver.java:152)
	at org.apache.maven.DefaultProjectDependenciesResolver.resolve(DefaultProjectDependenciesResolver.java:66)
	at org.apache.maven.lifecycle.DefaultLifecycleExecutor.resolveProjectDependencies(DefaultLifecycleExecutor.java:397)
	... 14 more
Caused by: org.apache.maven.artifact.metadata.ArtifactMetadataRetrievalException: Failed to
retrieve POM for org.apache.maven.its:maven-it-helper:jar:2.1-SNAPSHOT: Error transferring
file: Connection refused
  org.apache.maven.its:maven-it-helper:pom:2.1-SNAPSHOT

from the specified remote repositories:
  Nexus (http://repository.sonatype.org:8081/content/groups/sonatype-public-grid, releases=true,
snapshots=true)

	at org.apache.maven.project.artifact.MavenMetadataSource.retrieveRelocatedProject(MavenMetadataSource.java:597)
	at org.apache.maven.project.artifact.MavenMetadataSource.retrieve(MavenMetadataSource.java:189)
	at org.apache.maven.repository.legacy.resolver.DefaultLegacyArtifactCollector.recurse(DefaultLegacyArtifactCollector.java:533)
	... 20 more
Caused by: org.apache.maven.artifact.resolver.ArtifactResolutionException: Error transferring
file: Connection refused
  org.apache.maven.its:maven-it-helper:pom:2.1-SNAPSHOT

from the specified remote repositories:
  Nexus (http://repository.sonatype.org:8081/content/groups/sonatype-public-grid, releases=true,
snapshots=true)

	at org.apache.maven.artifact.resolver.DefaultArtifactResolver.resolve(DefaultArtifactResolver.java:268)
	at org.apache.maven.artifact.resolver.DefaultArtifactResolver.resolve(DefaultArtifactResolver.java:507)
	at org.apache.maven.repository.legacy.LegacyRepositorySystem.resolve(LegacyRepositorySystem.java:325)
	at org.apache.maven.project.DefaultProjectBuilder.build(DefaultProjectBuilder.java:224)
	at org.apache.maven.project.DefaultProjectBuilder.build(DefaultProjectBuilder.java:204)
	at org.apache.maven.project.artifact.MavenMetadataSource.retrieveRelocatedProject(MavenMetadataSource.java:576)
	... 22 more
Caused by: org.apache.maven.wagon.TransferFailedException: Error transferring file: Connection
refused
	at org.apache.maven.wagon.providers.http.LightweightHttpWagon.fillInputData(LightweightHttpWagon.java:143)
	at org.apache.maven.wagon.StreamWagon.getInputStream(StreamWagon.java:116)
	at org.apache.maven.wagon.StreamWagon.getIfNewer(StreamWagon.java:88)
	at org.apache.maven.wagon.StreamWagon.get(StreamWagon.java:61)
	at org.apache.maven.repository.legacy.DefaultWagonManager.getRemoteFile(DefaultWagonManager.java:345)
	at org.apache.maven.repository.legacy.DefaultWagonManager.getArtifact(DefaultWagonManager.java:99)
	at org.apache.maven.repository.legacy.DefaultWagonManager.getArtifact(DefaultWagonManager.java:150)
	at org.apache.maven.artifact.resolver.DefaultArtifactResolver.resolve(DefaultArtifactResolver.java:251)
	... 27 more
Caused by: java.net.ConnectException: Connection refused
	at java.net.PlainSocketImpl.socketConnect(Native Method)
	at java.net.PlainSocketImpl.doConnect(PlainSocketImpl.java:333)
	at java.net.PlainSocketImpl.connectToAddress(PlainSocketImpl.java:195)
	at java.net.PlainSocketImpl.connect(PlainSocketImpl.java:182)
	at java.net.Socket.connect(Socket.java:519)
	at java.net.Socket.connect(Socket.java:469)
	at sun.net.NetworkClient.doConnect(NetworkClient.java:157)
	at sun.net.www.http.HttpClient.openServer(HttpClient.java:382)
	at sun.net.www.http.HttpClient.openServer(HttpClient.java:509)
	at sun.net.www.http.HttpClient.<init>(HttpClient.java:231)
	at sun.net.www.http.HttpClient.New(HttpClient.java:304)
	at sun.net.www.http.HttpClient.New(HttpClient.java:316)
	at sun.net.www.protocol.http.HttpURLConnection.getNewHttpClient(HttpURLConnection.java:817)
	at sun.net.www.protocol.http.HttpURLConnection.plainConnect(HttpURLConnection.java:769)
	at sun.net.www.protocol.http.HttpURLConnection.connect(HttpURLConnection.java:694)
	at sun.net.www.protocol.http.HttpURLConnection.getInputStream(HttpURLConnection.java:938)
	at java.net.HttpURLConnection.getResponseCode(HttpURLConnection.java:367)
	at org.apache.maven.wagon.providers.http.LightweightHttpWagon.fillInputData(LightweightHttpWagon.java:115)
	... 34 more
[ERROR] 
[ERROR] Re-run Maven using the -X switch to enable full debug logging.
[ERROR] 
[ERROR] For more information about the errors and possible solutions, please read the following
articles:
[ERROR] [Help 1] http://cwiki.apache.org/confluence/display/MAVEN/ArtifactResolutionException
Recording Emma reports core-integration-tests/target/site/emma/coverage.xml


Mime
View raw message