maven-notifications mailing list archives

Site index · List index
Message view « Date » · « Thread »
Top « Date » · « Thread »
From Hudson <Hud...@sonatype.org>
Subject Build failed in Hudson: maven-3.0.x-ITs » 1.5,windows #241
Date Mon, 26 Apr 2010 18:42:33 GMT
See <http://grid.sonatype.org/ci/job/maven-3.0.x-ITs/./jdk=1.5,label=windows/241/changes>

Changes:

[Benjamin Bentmann] [MNG-4644] Misplaced text contents in root element of POM is not rejected
by parser

o Added IT

------------------------------------------
[...truncated 6832 lines...]
	at org.apache.maven.lifecycle.internal.LifecycleDependencyResolver.resolveDependencies(LifecycleDependencyResolver.java:70)
	at org.apache.maven.lifecycle.internal.BuilderCommon.resolveBuildPlan(BuilderCommon.java:88)
	at org.apache.maven.lifecycle.internal.LifecycleModuleBuilder.buildProject(LifecycleModuleBuilder.java:78)
	at org.apache.maven.lifecycle.internal.LifecycleModuleBuilder.buildProject(LifecycleModuleBuilder.java:54)
	at org.apache.maven.lifecycle.DefaultLifecycleExecutor.singleThreadedBuild(DefaultLifecycleExecutor.java:218)
	at org.apache.maven.lifecycle.DefaultLifecycleExecutor.execute(DefaultLifecycleExecutor.java:190)
	at org.apache.maven.DefaultMaven.doExecute(DefaultMaven.java:246)
	at org.apache.maven.DefaultMaven.execute(DefaultMaven.java:95)
	at org.apache.maven.cli.MavenCli.execute(MavenCli.java:430)
	at org.apache.maven.cli.MavenCli.doMain(MavenCli.java:160)
	at org.apache.maven.cli.MavenCli.main(MavenCli.java:124)
	at sun.reflect.NativeMethodAccessorImpl.invoke0(Native Method)
	at sun.reflect.NativeMethodAccessorImpl.invoke(NativeMethodAccessorImpl.java:39)
	at sun.reflect.DelegatingMethodAccessorImpl.invoke(DelegatingMethodAccessorImpl.java:25)
	at java.lang.reflect.Method.invoke(Method.java:585)
	at org.codehaus.plexus.classworlds.launcher.Launcher.launchEnhanced(Launcher.java:290)
	at org.codehaus.plexus.classworlds.launcher.Launcher.launch(Launcher.java:230)
	at org.codehaus.plexus.classworlds.launcher.Launcher.mainWithExitCode(Launcher.java:409)
	at org.codehaus.plexus.classworlds.launcher.Launcher.main(Launcher.java:352)
Caused by: org.apache.maven.artifact.resolver.ArtifactResolutionException: Error transferring
file: http.mngit
  org.apache.maven.its.mng2305:http:jar:0.1

from the specified remote repositories:
  maven-core-it-http (http://http.mngit/repo/, releases=true, snapshots=false),
  maven-core-it-https (https://https.mngit/repo/, releases=true, snapshots=false),
  central (http://repo1.maven.org/maven2, releases=true, snapshots=false)
Path to dependency: 
	1) org.apache.maven.its.mng2305:test:pom:0.1-SNAPSHOT
	2) org.apache.maven.its.mng2305:http:jar:0.1


	at org.apache.maven.artifact.resolver.DefaultArtifactResolver.resolve(DefaultArtifactResolver.java:268)
	at org.apache.maven.artifact.resolver.DefaultArtifactResolver.access$000(DefaultArtifactResolver.java:73)
	at org.apache.maven.artifact.resolver.DefaultArtifactResolver$ResolveTask.run(DefaultArtifactResolver.java:689)
	at java.util.concurrent.ThreadPoolExecutor$Worker.runTask(ThreadPoolExecutor.java:650)
	at java.util.concurrent.ThreadPoolExecutor$Worker.run(ThreadPoolExecutor.java:675)
	at java.lang.Thread.run(Thread.java:595)
Caused by: org.apache.maven.wagon.TransferFailedException: Error transferring file: http.mngit
	at org.apache.maven.wagon.providers.http.LightweightHttpWagon.fillInputData(LightweightHttpWagon.java:143)
	at org.apache.maven.wagon.StreamWagon.getInputStream(StreamWagon.java:116)
	at org.apache.maven.wagon.StreamWagon.getIfNewer(StreamWagon.java:88)
	at org.apache.maven.wagon.StreamWagon.get(StreamWagon.java:61)
	at org.apache.maven.repository.legacy.DefaultWagonManager.verifyChecksum(DefaultWagonManager.java:661)
	at org.apache.maven.repository.legacy.DefaultWagonManager.getRemoteFile(DefaultWagonManager.java:392)
	at org.apache.maven.repository.legacy.DefaultWagonManager.getArtifact(DefaultWagonManager.java:99)
	at org.apache.maven.repository.legacy.DefaultWagonManager.getArtifact(DefaultWagonManager.java:150)
	at org.apache.maven.artifact.resolver.DefaultArtifactResolver.resolve(DefaultArtifactResolver.java:251)
	... 5 more
Caused by: java.net.UnknownHostException: http.mngit
	at java.net.PlainSocketImpl.connect(PlainSocketImpl.java:177)
	at java.net.Socket.connect(Socket.java:520)
	at java.net.Socket.connect(Socket.java:470)
	at sun.net.NetworkClient.doConnect(NetworkClient.java:157)
	at sun.net.www.http.HttpClient.openServer(HttpClient.java:388)
	at sun.net.www.http.HttpClient.openServer(HttpClient.java:523)
	at sun.net.www.http.HttpClient.<init>(HttpClient.java:231)
	at sun.net.www.http.HttpClient.New(HttpClient.java:304)
	at sun.net.www.http.HttpClient.New(HttpClient.java:321)
	at sun.net.www.protocol.http.HttpURLConnection.getNewHttpClient(HttpURLConnection.java:813)
	at sun.net.www.protocol.http.HttpURLConnection.plainConnect(HttpURLConnection.java:765)
	at sun.net.www.protocol.http.HttpURLConnection.connect(HttpURLConnection.java:690)
	at sun.net.www.protocol.http.HttpURLConnection.getInputStream(HttpURLConnection.java:934)
	at java.net.HttpURLConnection.getResponseCode(HttpURLConnection.java:367)
	at org.apache.maven.wagon.providers.http.LightweightHttpWagon.fillInputData(LightweightHttpWagon.java:115)
	... 13 more
[ERROR] 
[ERROR] Re-run Maven using the -X switch to enable full debug logging.
[ERROR] 
[ERROR] For more information about the errors and possible solutions, please read the following
articles:
[ERROR] [Help 1] http://cwiki.apache.org/confluence/display/MAVEN/ArtifactResolutionException
EMMA: locking coverage output file [C:\home\hudson\workspace\maven-3.0.x-ITs\jdk\1.5\label\windows\core-integration-tests\target\test-classes\mng-2305\coverage.ec]
...
EMMA: runtime coverage data merged into [C:\home\hudson\workspace\maven-3.0.x-ITs\jdk\1.5\label\windows\core-integration-tests\target\test-classes\mng-2305\coverage.ec]
{in 18 ms}

	at org.apache.maven.it.Verifier.executeGoals(Verifier.java:1323)
	at org.apache.maven.it.Verifier.executeGoal(Verifier.java:1166)
	at org.apache.maven.it.Verifier.executeGoal(Verifier.java:1160)
	at org.apache.maven.it.MavenITmng2305MultipleProxiesTest.testit(MavenITmng2305MultipleProxiesTest.java:99)
	at sun.reflect.NativeMethodAccessorImpl.invoke0(Native Method)
	at sun.reflect.NativeMethodAccessorImpl.invoke(NativeMethodAccessorImpl.java:39)
	at sun.reflect.DelegatingMethodAccessorImpl.invoke(DelegatingMethodAccessorImpl.java:25)
	at java.lang.reflect.Method.invoke(Method.java:585)
	at junit.framework.TestCase.runTest(TestCase.java:164)
	at org.apache.maven.it.AbstractMavenIntegrationTestCase.runTest(AbstractMavenIntegrationTestCase.java:198)
	at junit.framework.TestCase.runBare(TestCase.java:130)
	at junit.framework.TestResult$1.protect(TestResult.java:106)
	at junit.framework.TestResult.runProtected(TestResult.java:124)
	at junit.framework.TestResult.run(TestResult.java:109)
	at junit.framework.TestCase.run(TestCase.java:120)
	at junit.framework.TestSuite.runTest(TestSuite.java:230)
	at junit.framework.TestSuite.run(TestSuite.java:225)
	at junit.framework.TestSuite.runTest(TestSuite.java:230)
	at junit.framework.TestSuite.run(TestSuite.java:225)
	at sun.reflect.NativeMethodAccessorImpl.invoke0(Native Method)
	at sun.reflect.NativeMethodAccessorImpl.invoke(NativeMethodAccessorImpl.java:39)
	at sun.reflect.DelegatingMethodAccessorImpl.invoke(DelegatingMethodAccessorImpl.java:25)
	at java.lang.reflect.Method.invoke(Method.java:585)
	at org.apache.maven.surefire.junit.JUnitTestSet.execute(JUnitTestSet.java:213)
	at org.apache.maven.surefire.suite.AbstractDirectoryTestSuite.executeTestSet(AbstractDirectoryTestSuite.java:140)
	at org.apache.maven.surefire.suite.AbstractDirectoryTestSuite.execute(AbstractDirectoryTestSuite.java:127)
	at org.apache.maven.surefire.Surefire.run(Surefire.java:177)
	at sun.reflect.NativeMethodAccessorImpl.invoke0(Native Method)
	at sun.reflect.NativeMethodAccessorImpl.invoke(NativeMethodAccessorImpl.java:39)
	at sun.reflect.DelegatingMethodAccessorImpl.invoke(DelegatingMethodAccessorImpl.java:25)
	at java.lang.reflect.Method.invoke(Method.java:585)
	at org.apache.maven.surefire.booter.SurefireBooter.runSuitesInProcess(SurefireBooter.java:345)
	at org.apache.maven.surefire.booter.SurefireBooter.main(SurefireBooter.java:1009)
Caused by: org.apache.maven.artifact.resolver.ArtifactResolutionException: Error transferring
file: http.mngit
  org.apache.maven.its.mng2305:http:jar:0.1

from the specified remote repositories:
  maven-core-it-http (http://http.mngit/repo/, releases=true, snapshots=false),
  maven-core-it-https (https://https.mngit/repo/, releases=true, snapshots=false),
  central (http://repo1.maven.org/maven2, releases=true, snapshots=false)
Path to dependency: 
	1) org.apache.maven.its.mng2305:test:pom:0.1-SNAPSHOT
	2) org.apache.maven.its.mng2305:http:jar:0.1


	at org.apache.maven.artifact.resolver.DefaultArtifactResolver.resolve(DefaultArtifactResolver.java:268)
	at org.apache.maven.artifact.resolver.DefaultArtifactResolver.access$000(DefaultArtifactResolver.java:73)
	at org.apache.maven.artifact.resolver.DefaultArtifactResolver$ResolveTask.run(DefaultArtifactResolver.java:689)
	at java.util.concurrent.ThreadPoolExecutor$Worker.runTask(ThreadPoolExecutor.java:650)
	at java.util.concurrent.ThreadPoolExecutor$Worker.run(ThreadPoolExecutor.java:675)
	at java.lang.Thread.run(Thread.java:595)
Caused by: org.apache.maven.wagon.TransferFailedException: Error transferring file: http.mngit
	at org.apache.maven.wagon.providers.http.LightweightHttpWagon.fillInputData(LightweightHttpWagon.java:143)
	at org.apache.maven.wagon.StreamWagon.getInputStream(StreamWagon.java:116)
	at org.apache.maven.wagon.StreamWagon.getIfNewer(StreamWagon.java:88)
	at org.apache.maven.wagon.StreamWagon.get(StreamWagon.java:61)
	at org.apache.maven.repository.legacy.DefaultWagonManager.verifyChecksum(DefaultWagonManager.java:661)
	at org.apache.maven.repository.legacy.DefaultWagonManager.getRemoteFile(DefaultWagonManager.java:392)
	at org.apache.maven.repository.legacy.DefaultWagonManager.getArtifact(DefaultWagonManager.java:99)
	at org.apache.maven.repository.legacy.DefaultWagonManager.getArtifact(DefaultWagonManager.java:150)
	at org.apache.maven.artifact.resolver.DefaultArtifactResolver.resolve(DefaultArtifactResolver.java:251)
	... 5 more
Caused by: java.net.UnknownHostException: http.mngit
	at java.net.PlainSocketImpl.connect(PlainSocketImpl.java:177)
	at java.net.Socket.connect(Socket.java:520)
	at java.net.Socket.connect(Socket.java:470)
	at sun.net.NetworkClient.doConnect(NetworkClient.java:157)
	at sun.net.www.http.HttpClient.openServer(HttpClient.java:388)
	at sun.net.www.http.HttpClient.openServer(HttpClient.java:523)
	at sun.net.www.http.HttpClient.<init>(HttpClient.java:231)
	at sun.net.www.http.HttpClient.New(HttpClient.java:304)
	at sun.net.www.http.HttpClient.New(HttpClient.java:321)
	at sun.net.www.protocol.http.HttpURLConnection.getNewHttpClient(HttpURLConnection.java:813)
	at sun.net.www.protocol.http.HttpURLConnection.plainConnect(HttpURLConnection.java:765)
	at sun.net.www.protocol.http.HttpURLConnection.connect(HttpURLConnection.java:690)
	at sun.net.www.protocol.http.HttpURLConnection.getInputStream(HttpURLConnection.java:934)
	at java.net.HttpURLConnection.getResponseCode(HttpURLConnection.java:367)
	at org.apache.maven.wagon.providers.http.LightweightHttpWagon.fillInputData(LightweightHttpWagon.java:115)
	... 13 more
[ERROR] 
[ERROR] Re-run Maven using the -X switch to enable full debug logging.
[ERROR] 
[ERROR] For more information about the errors and possible solutions, please read the following
articles:
[ERROR] [Help 1] http://cwiki.apache.org/confluence/display/MAVEN/ArtifactResolutionException
EMMA: locking coverage output file [C:\home\hudson\workspace\maven-3.0.x-ITs\jdk\1.5\label\windows\core-integration-tests\target\test-classes\mng-2305\coverage.ec]
...
EMMA: runtime coverage data merged into [C:\home\hudson\workspace\maven-3.0.x-ITs\jdk\1.5\label\windows\core-integration-tests\target\test-classes\mng-2305\coverage.ec]
{in 18 ms}

	at org.apache.maven.it.Verifier.executeGoals(Verifier.java:1323)
	at org.apache.maven.it.Verifier.executeGoal(Verifier.java:1166)
	at org.apache.maven.it.Verifier.executeGoal(Verifier.java:1160)
	at org.apache.maven.it.MavenITmng2305MultipleProxiesTest.testit(MavenITmng2305MultipleProxiesTest.java:99)
	at sun.reflect.NativeMethodAccessorImpl.invoke0(Native Method)
	at sun.reflect.NativeMethodAccessorImpl.invoke(NativeMethodAccessorImpl.java:39)
	at sun.reflect.DelegatingMethodAccessorImpl.invoke(DelegatingMethodAccessorImpl.java:25)
	at java.lang.reflect.Method.invoke(Method.java:585)
	at junit.framework.TestCase.runTest(TestCase.java:164)
	at org.apache.maven.it.AbstractMavenIntegrationTestCase.runTest(AbstractMavenIntegrationTestCase.java:198)
	at junit.framework.TestCase.runBare(TestCase.java:130)
	at junit.framework.TestResult$1.protect(TestResult.java:106)
	at junit.framework.TestResult.runProtected(TestResult.java:124)
	at junit.framework.TestResult.run(TestResult.java:109)
	at junit.framework.TestCase.run(TestCase.java:120)
	at junit.framework.TestSuite.runTest(TestSuite.java:230)
	at junit.framework.TestSuite.run(TestSuite.java:225)
	at junit.framework.TestSuite.runTest(TestSuite.java:230)
	at junit.framework.TestSuite.run(TestSuite.java:225)
	at sun.reflect.NativeMethodAccessorImpl.invoke0(Native Method)
	at sun.reflect.NativeMethodAccessorImpl.invoke(NativeMethodAccessorImpl.java:39)
	at sun.reflect.DelegatingMethodAccessorImpl.invoke(DelegatingMethodAccessorImpl.java:25)
	at java.lang.reflect.Method.invoke(Method.java:585)
	at org.apache.maven.surefire.junit.JUnitTestSet.execute(JUnitTestSet.java:213)
	at org.apache.maven.surefire.suite.AbstractDirectoryTestSuite.executeTestSet(AbstractDirectoryTestSuite.java:140)
	at org.apache.maven.surefire.suite.AbstractDirectoryTestSuite.execute(AbstractDirectoryTestSuite.java:127)
	at org.apache.maven.surefire.Surefire.run(Surefire.java:177)
	at sun.reflect.NativeMethodAccessorImpl.invoke0(Native Method)
	at sun.reflect.NativeMethodAccessorImpl.invoke(NativeMethodAccessorImpl.java:39)
	at sun.reflect.DelegatingMethodAccessorImpl.invoke(DelegatingMethodAccessorImpl.java:25)
	at java.lang.reflect.Method.invoke(Method.java:585)
	at org.apache.maven.surefire.booter.SurefireBooter.runSuitesInProcess(SurefireBooter.java:345)
	at org.apache.maven.surefire.booter.SurefireBooter.main(SurefireBooter.java:1009)


Results :

Tests in error: 
  testit(org.apache.maven.it.MavenITmng2305MultipleProxiesTest)

Tests run: 599, Failures: 0, Errors: 1, Skipped: 0

[INFO] ------------------------------------------------------------------------
[INFO] BUILD FAILURE
[INFO] ------------------------------------------------------------------------
[INFO] Total time: 13:17.191s
[INFO] Finished at: Mon Apr 26 11:42:31 PDT 2010
[INFO] Final Memory: 7M/31M
[INFO] ------------------------------------------------------------------------
[ERROR] Failed to execute goal org.apache.maven.plugins:maven-surefire-plugin:2.4.3:test (default-test)
on project core-it-suite: There are test failures.

Please refer to C:\home\hudson\workspace\maven-3.0.x-ITs\jdk\1.5\label\windows\core-integration-tests\target\surefire-reports
for the individual test results.
-> [Help 1]
org.apache.maven.lifecycle.LifecycleExecutionException: Failed to execute goal org.apache.maven.plugins:maven-surefire-plugin:2.4.3:test
(default-test) on project core-it-suite: There are test failures.

Please refer to C:\home\hudson\workspace\maven-3.0.x-ITs\jdk\1.5\label\windows\core-integration-tests\target\surefire-reports
for the individual test results.
	at org.apache.maven.lifecycle.internal.MojoExecutor.execute(MojoExecutor.java:137)
	at org.apache.maven.lifecycle.internal.MojoExecutor.execute(MojoExecutor.java:77)
	at org.apache.maven.lifecycle.internal.MojoExecutor.execute(MojoExecutor.java:69)
	at org.apache.maven.lifecycle.internal.LifecycleModuleBuilder.buildProject(LifecycleModuleBuilder.java:82)
	at org.apache.maven.lifecycle.internal.LifecycleModuleBuilder.buildProject(LifecycleModuleBuilder.java:54)
	at org.apache.maven.lifecycle.DefaultLifecycleExecutor.singleThreadedBuild(DefaultLifecycleExecutor.java:218)
	at org.apache.maven.lifecycle.DefaultLifecycleExecutor.execute(DefaultLifecycleExecutor.java:190)
	at org.apache.maven.DefaultMaven.doExecute(DefaultMaven.java:246)
	at org.apache.maven.DefaultMaven.execute(DefaultMaven.java:95)
	at org.apache.maven.cli.MavenCli.execute(MavenCli.java:430)
	at org.apache.maven.cli.MavenCli.doMain(MavenCli.java:160)
	at org.apache.maven.cli.MavenCli.main(MavenCli.java:124)
	at sun.reflect.NativeMethodAccessorImpl.invoke0(Native Method)
	at sun.reflect.NativeMethodAccessorImpl.invoke(NativeMethodAccessorImpl.java:39)
	at sun.reflect.DelegatingMethodAccessorImpl.invoke(DelegatingMethodAccessorImpl.java:25)
	at java.lang.reflect.Method.invoke(Method.java:585)
	at org.codehaus.plexus.classworlds.launcher.Launcher.launchEnhanced(Launcher.java:290)
	at org.codehaus.plexus.classworlds.launcher.Launcher.launch(Launcher.java:230)
	at org.codehaus.plexus.classworlds.launcher.Launcher.mainWithExitCode(Launcher.java:409)
	at org.codehaus.plexus.classworlds.launcher.Launcher.main(Launcher.java:352)
Caused by: org.apache.maven.plugin.MojoFailureException: There are test failures.

Please refer to C:\home\hudson\workspace\maven-3.0.x-ITs\jdk\1.5\label\windows\core-integration-tests\target\surefire-reports
for the individual test results.
	at org.apache.maven.plugin.surefire.SurefirePlugin.execute(SurefirePlugin.java:575)
	at org.apache.maven.plugin.DefaultBuildPluginManager.executeMojo(DefaultBuildPluginManager.java:105)
	at org.apache.maven.lifecycle.internal.MojoExecutor.execute(MojoExecutor.java:133)
	... 19 more
[ERROR] 
[ERROR] Re-run Maven using the -X switch to enable full debug logging.
[ERROR] 
[ERROR] For more information about the errors and possible solutions, please read the following
articles:
[ERROR] [Help 1] http://cwiki.apache.org/confluence/display/MAVEN/MojoFailureException
Emma: looking for coverage reports in the provided path: core-integration-tests/target/site/emma/coverage.xml


Mime
View raw message