maven-notifications mailing list archives

Site index · List index
Message view « Date » · « Thread »
Top « Date » · « Thread »
From Hudson <Hud...@sonatype.org>
Subject Build failed in Hudson: maven-plugins-ITs » 1.5,windows #411
Date Sat, 10 Apr 2010 07:23:27 GMT
See <http://grid.sonatype.org/ci/job/maven-plugins-ITs/./jdk=1.5,label=windows/411/changes>

Changes:

[Jason van Zyl] MCOMPILER-124: Default source/target to 1.5

------------------------------------------
[...truncated 5620 lines...]
[INFO] Exploding webapp
[INFO] Assembling webapp[maven-war-plugin-test] in [C:\home\hudson\workspace\maven-plugins-ITs\jdk\1.5\label\windows\trunk\maven-war-plugin\target\test-classes\unit\warexplodedmojo\test-dir\ExplodedWarWithAar]
[INFO] Processing war project
[INFO] Copying webapp resources[C:\home\hudson\workspace\maven-plugins-ITs\jdk\1.5\label\windows\trunk\maven-war-plugin\target\test-classes\unit\warexplodedmojo\test-dir\ExplodedWarWithAar-test-data\source]
[INFO] Webapp assembled in [19 msecs]
[INFO] Exploding webapp
[INFO] Assembling webapp[maven-war-plugin-test] in [C:\home\hudson\workspace\maven-plugins-ITs\jdk\1.5\label\windows\trunk\maven-war-plugin\target\test-classes\unit\warexplodedmojo\test-dir\ExplodedWar_WithDuplicateDependencies]
[INFO] Processing war project
[INFO] Copying webapp resources[C:\home\hudson\workspace\maven-plugins-ITs\jdk\1.5\label\windows\trunk\maven-war-plugin\target\test-classes\unit\warexplodedmojo\test-dir\ExplodedWar_WithDuplicateDependencies-test-data\source]
[INFO] Webapp assembled in [22 msecs]
[INFO] Exploding webapp
[INFO] Assembling webapp[maven-war-plugin-test] in [C:\home\hudson\workspace\maven-plugins-ITs\jdk\1.5\label\windows\trunk\maven-war-plugin\target\test-classes\unit\warexplodedmojo\test-dir\ExplodedWar_DuplicateWithClassifier]
[INFO] Processing war project
[INFO] Copying webapp resources[C:\home\hudson\workspace\maven-plugins-ITs\jdk\1.5\label\windows\trunk\maven-war-plugin\target\test-classes\unit\warexplodedmojo\test-dir\ExplodedWar_DuplicateWithClassifier-test-data\source]
[INFO] Webapp assembled in [25 msecs]
[INFO] Exploding webapp
[INFO] Assembling webapp[maven-war-plugin-test] in [C:\home\hudson\workspace\maven-plugins-ITs\jdk\1.5\label\windows\trunk\maven-war-plugin\target\test-classes\unit\warexplodedmojo\test-dir\ExplodedWar_WithClasses]
[INFO] Processing war project
[INFO] Copying webapp resources[C:\home\hudson\workspace\maven-plugins-ITs\jdk\1.5\label\windows\trunk\maven-war-plugin\target\test-classes\unit\warexplodedmojo\test-dir\ExplodedWar_WithClasses-test-data\source]
[INFO] Webapp assembled in [22 msecs]
[INFO] Exploding webapp
[INFO] Assembling webapp[maven-war-plugin-test] in [C:\home\hudson\workspace\maven-plugins-ITs\jdk\1.5\label\windows\trunk\maven-war-plugin\target\test-classes\unit\warexplodedmojo\test-dir\ExplodedWar_WithSourceIncludeExclude]
[INFO] Processing war project
[INFO] Copying webapp resources[C:\home\hudson\workspace\maven-plugins-ITs\jdk\1.5\label\windows\trunk\maven-war-plugin\target\test-classes\unit\warexplodedmojo\test-dir\ExplodedWar_WithSourceIncludeExclude-test-data\source]
[INFO] Webapp assembled in [8 msecs]
[INFO] Exploding webapp
[INFO] Assembling webapp[maven-war-plugin-test] in [C:\home\hudson\workspace\maven-plugins-ITs\jdk\1.5\label\windows\trunk\maven-war-plugin\target\test-classes\unit\warexplodedmojo\test-dir\ExplodedWar_WithWarDependencyIncludeExclude]
[INFO] Processing war project
[INFO] Copying webapp resources[C:\home\hudson\workspace\maven-plugins-ITs\jdk\1.5\label\windows\trunk\maven-war-plugin\target\test-classes\unit\warexplodedmojo\test-dir\ExplodedWar_WithWarDependencyIncludeExclude-test-data\source]
[INFO] Processing overlay[ id wartests:war-include-exclude]
[INFO] Webapp assembled in [54 msecs]
[INFO] Exploding webapp
[INFO] Assembling webapp[maven-war-plugin-test] in [C:\home\hudson\workspace\maven-plugins-ITs\jdk\1.5\label\windows\trunk\maven-war-plugin\target\test-classes\unit\warexplodedmojo\test-dir\ExplodedWarWithSourceModificationCheck]
[INFO] Processing war project
[INFO] Copying webapp resources[C:\home\hudson\workspace\maven-plugins-ITs\jdk\1.5\label\windows\trunk\maven-war-plugin\target\test-classes\unit\warexplodedmojo\test-dir\ExplodedWarWithSourceModificationCheck-test-data\source]
[INFO] Webapp assembled in [17 msecs]
[INFO] Exploding webapp
[INFO] Assembling webapp[maven-war-plugin-test] in [C:\home\hudson\workspace\maven-plugins-ITs\jdk\1.5\label\windows\trunk\maven-war-plugin\target\test-classes\unit\warexplodedmojo\test-dir\ExplodedWarWithFileNameMapping]
[INFO] Processing war project
[INFO] Copying webapp resources[C:\home\hudson\workspace\maven-plugins-ITs\jdk\1.5\label\windows\trunk\maven-war-plugin\target\test-classes\unit\warexplodedmojo\test-dir\ExplodedWarWithFileNameMapping-test-data\source]
[INFO] Webapp assembled in [26 msecs]
[INFO] Exploding webapp
[INFO] Assembling webapp[maven-war-plugin-test] in [C:\home\hudson\workspace\maven-plugins-ITs\jdk\1.5\label\windows\trunk\maven-war-plugin\target\test-classes\unit\warexplodedmojo\test-dir\ExplodedWarWithFileNameMappingAndDuplicateDependencies]
[INFO] Processing war project
[INFO] Copying webapp resources[C:\home\hudson\workspace\maven-plugins-ITs\jdk\1.5\label\windows\trunk\maven-war-plugin\target\test-classes\unit\warexplodedmojo\test-dir\ExplodedWarWithFileNameMappingAndDuplicateDependencies-test-data\source]
[INFO] Webapp assembled in [29 msecs]
Tests run: 20, Failures: 0, Errors: 0, Skipped: 0, Time elapsed: 1.99 sec
Running org.apache.maven.plugin.war.WarInPlaceMojoTest
[INFO] Generating webapp in source directory[C:\home\hudson\workspace\maven-plugins-ITs\jdk\1.5\label\windows\trunk\maven-war-plugin\target\test-classes\unit\warexplodedinplacemojo\test-dir\SimpleExplodedInplaceWar-test-data\source]
[INFO] Assembling webapp[maven-war-plugin-test] in [C:\home\hudson\workspace\maven-plugins-ITs\jdk\1.5\label\windows\trunk\maven-war-plugin\target\test-classes\unit\warexplodedinplacemojo\test-dir\SimpleExplodedInplaceWar-test-data\source]
[INFO] Processing war project
[INFO] Copying webapp webResources[C:\home\hudson\workspace\maven-plugins-ITs\jdk\1.5\label\windows\trunk\maven-war-plugin\target\test-classes\unit\warexplodedinplacemojo\test-dir\resources]
to[C:\home\hudson\workspace\maven-plugins-ITs\jdk\1.5\label\windows\trunk\maven-war-plugin\target\test-classes\unit\warexplodedinplacemojo\test-dir\SimpleExplodedInplaceWar-test-data\source]
[INFO] Webapp assembled in [9 msecs]
Tests run: 2, Failures: 0, Errors: 0, Skipped: 0, Time elapsed: 0.143 sec
Running org.apache.maven.plugin.war.WarManifestMojoTest
Tests run: 5, Failures: 0, Errors: 0, Skipped: 0, Time elapsed: 0.368 sec
Running org.apache.maven.plugin.war.util.PathSetTest
Tests run: 5, Failures: 0, Errors: 0, Skipped: 0, Time elapsed: 0.021 sec
Running org.apache.maven.plugin.war.util.WarUtilsTest
Tests run: 1, Failures: 0, Errors: 0, Skipped: 0, Time elapsed: 0.003 sec
Running org.apache.maven.plugin.war.overlay.OverlayManagerTest
Tests run: 6, Failures: 0, Errors: 0, Skipped: 0, Time elapsed: 0.298 sec
Running org.apache.maven.plugin.war.WarDependenciesAnalysisTest
[INFO] Exploding webapp
[INFO] Assembling webapp[maven-war-plugin-test] in [C:\home\hudson\workspace\maven-plugins-ITs\jdk\1.5\label\windows\trunk\maven-war-plugin\target\test-classes\unit\dependenciesanalysis\test-dir\no-change]
[INFO] Processing war project
[INFO] Copying webapp resources[C:\home\hudson\workspace\maven-plugins-ITs\jdk\1.5\label\windows\trunk\maven-war-plugin\target\test-classes\unit\dependenciesanalysis\test-dir\no-change-test-data\source]
[INFO] Webapp assembled in [28 msecs]
[INFO] Exploding webapp
[INFO] Assembling webapp[maven-war-plugin-test] in [C:\home\hudson\workspace\maven-plugins-ITs\jdk\1.5\label\windows\trunk\maven-war-plugin\target\test-classes\unit\dependenciesanalysis\test-dir\no-change]
[INFO] Processing war project
[INFO] Copying webapp resources[C:\home\hudson\workspace\maven-plugins-ITs\jdk\1.5\label\windows\trunk\maven-war-plugin\target\test-classes\unit\dependenciesanalysis\test-dir\no-change-test-data\source]
[INFO] Webapp assembled in [11 msecs]
[INFO] Exploding webapp
[INFO] Assembling webapp[maven-war-plugin-test] in [C:\home\hudson\workspace\maven-plugins-ITs\jdk\1.5\label\windows\trunk\maven-war-plugin\target\test-classes\unit\dependenciesanalysis\test-dir\remove-dependency]
[INFO] Processing war project
[INFO] Copying webapp resources[C:\home\hudson\workspace\maven-plugins-ITs\jdk\1.5\label\windows\trunk\maven-war-plugin\target\test-classes\unit\dependenciesanalysis\test-dir\remove-dependency-test-data\source]
[INFO] Webapp assembled in [33 msecs]
[INFO] Exploding webapp
[INFO] Assembling webapp[maven-war-plugin-test] in [C:\home\hudson\workspace\maven-plugins-ITs\jdk\1.5\label\windows\trunk\maven-war-plugin\target\test-classes\unit\dependenciesanalysis\test-dir\remove-dependency]
[INFO] Dependency[Dependency {groupId=org.sample.jar, artifactId=lib-test, version=1.0, type=jar}]
has been removed from the project.
[INFO] Processing war project
[INFO] Copying webapp resources[C:\home\hudson\workspace\maven-plugins-ITs\jdk\1.5\label\windows\trunk\maven-war-plugin\target\test-classes\unit\dependenciesanalysis\test-dir\remove-dependency-test-data\source]
[INFO] Webapp assembled in [14 msecs]
[INFO] Exploding webapp
[INFO] Assembling webapp[maven-war-plugin-test] in [C:\home\hudson\workspace\maven-plugins-ITs\jdk\1.5\label\windows\trunk\maven-war-plugin\target\test-classes\unit\dependenciesanalysis\test-dir\dependency-update-version]
[INFO] Processing war project
[INFO] Copying webapp resources[C:\home\hudson\workspace\maven-plugins-ITs\jdk\1.5\label\windows\trunk\maven-war-plugin\target\test-classes\unit\dependenciesanalysis\test-dir\dependency-update-version-test-data\source]
[INFO] Webapp assembled in [29 msecs]
[INFO] Exploding webapp
[INFO] Assembling webapp[maven-war-plugin-test] in [C:\home\hudson\workspace\maven-plugins-ITs\jdk\1.5\label\windows\trunk\maven-war-plugin\target\test-classes\unit\dependenciesanalysis\test-dir\dependency-update-version]
[INFO] Version of dependency[Dependency {groupId=org.sample.jar, artifactId=lib-test, version=2.0,
type=jar}] has changed (1.0 -> 2.0).
[INFO] Processing war project
[INFO] Copying webapp resources[C:\home\hudson\workspace\maven-plugins-ITs\jdk\1.5\label\windows\trunk\maven-war-plugin\target\test-classes\unit\dependenciesanalysis\test-dir\dependency-update-version-test-data\source]
[INFO] Webapp assembled in [20 msecs]
[INFO] Exploding webapp
[INFO] Assembling webapp[maven-war-plugin-test] in [C:\home\hudson\workspace\maven-plugins-ITs\jdk\1.5\label\windows\trunk\maven-war-plugin\target\test-classes\unit\dependenciesanalysis\test-dir\dependency-now-provided]
[INFO] Processing war project
[INFO] Copying webapp resources[C:\home\hudson\workspace\maven-plugins-ITs\jdk\1.5\label\windows\trunk\maven-war-plugin\target\test-classes\unit\dependenciesanalysis\test-dir\dependency-now-provided-test-data\source]
[INFO] Webapp assembled in [31 msecs]
[INFO] Exploding webapp
[INFO] Assembling webapp[maven-war-plugin-test] in [C:\home\hudson\workspace\maven-plugins-ITs\jdk\1.5\label\windows\trunk\maven-war-plugin\target\test-classes\unit\dependenciesanalysis\test-dir\dependency-now-provided]
[INFO] Scope of dependency[Dependency {groupId=org.sample.jar, artifactId=lib-test, version=1.0,
type=jar}] has changed (runtime -> provided).
[INFO] Processing war project
[INFO] Copying webapp resources[C:\home\hudson\workspace\maven-plugins-ITs\jdk\1.5\label\windows\trunk\maven-war-plugin\target\test-classes\unit\dependenciesanalysis\test-dir\dependency-now-provided-test-data\source]
[INFO] Webapp assembled in [15 msecs]
Tests run: 4, Failures: 0, Errors: 0, Skipped: 0, Time elapsed: 0.553 sec

Results :

Tests run: 81, Failures: 0, Errors: 0, Skipped: 0

[INFO] [jar:jar {execution: default-jar}]
[INFO] Building jar: C:\home\hudson\workspace\maven-plugins-ITs\jdk\1.5\label\windows\trunk\maven-war-plugin\target\maven-war-plugin-2.1-beta-2-SNAPSHOT.jar
[INFO] [plugin:addPluginArtifactMetadata {execution: default-addPluginArtifactMetadata}]
[INFO] [invoker:install {execution: integration-test}]
[INFO] Installing C:\home\hudson\workspace\maven-plugins-ITs\jdk\1.5\label\windows\trunk\maven-war-plugin\pom.xml
to C:\home\hudson\workspace\maven-plugins-ITs\jdk\1.5\label\windows\trunk\maven-war-plugin\target\local-repo\org\apache\maven\plugins\maven-war-plugin\2.1-beta-2-SNAPSHOT\maven-war-plugin-2.1-beta-2-SNAPSHOT.pom
[INFO] Installing C:\home\hudson\workspace\maven-plugins-ITs\jdk\1.5\label\windows\trunk\maven-war-plugin\target\maven-war-plugin-2.1-beta-2-SNAPSHOT.jar
to C:\home\hudson\workspace\maven-plugins-ITs\jdk\1.5\label\windows\trunk\maven-war-plugin\target\local-repo\org\apache\maven\plugins\maven-war-plugin\2.1-beta-2-SNAPSHOT\maven-war-plugin-2.1-beta-2-SNAPSHOT.jar
[INFO] [invoker:run {execution: integration-test}]
[INFO] Building: default\pom.xml
[INFO] ..SUCCESS (8.9 s)
[INFO] Building: MWAR-129\pom.xml
[INFO] ..SUCCESS (3.0 s)
[INFO] Building: MWAR-131\pom.xml
[INFO] ..SUCCESS (33.3 s)
[INFO] Building: MWAR-133\pom.xml
[INFO] ..SUCCESS (3.8 s)
[INFO] Building: MWAR-139\pom.xml
[INFO] ..SUCCESS (3.5 s)
[INFO] Building: MWAR-143\pom.xml
[INFO] ..SUCCESS (10.1 s)
[INFO] Building: MWAR-62\pom.xml
[INFO] ..SUCCESS (2.6 s)
[INFO] Building: MWAR-96\pom.xml
[INFO] ..SUCCESS (3.9 s)
[INFO] Building: scoped-dependency-same-artifact\pom.xml
[INFO] ..SUCCESS (4.8 s)
[INFO] Building: simple-war-no-webxml\pom.xml
[INFO] ..SUCCESS (3.5 s)
[INFO] Building: simple-war-project\pom.xml
[INFO] ..SUCCESS (3.4 s)
[INFO] Building: web-resources-filtering\pom.xml
[INFO] ..SUCCESS (4.9 s)
[INFO] ---------------------------------------
[INFO] Execution Summary:
[INFO]   Builds Passing: 12
[INFO]   Builds Failing: 0
[INFO]   Builds Skipped: 0
[INFO] ---------------------------------------
[INFO] [install:install {execution: default-install}]
[INFO] Installing C:\home\hudson\workspace\maven-plugins-ITs\jdk\1.5\label\windows\trunk\maven-war-plugin\target\maven-war-plugin-2.1-beta-2-SNAPSHOT.jar
to C:\opt\repos\local-repository\org\apache\maven\plugins\maven-war-plugin\2.1-beta-2-SNAPSHOT\maven-war-plugin-2.1-beta-2-SNAPSHOT.jar
[INFO] [deploy:deploy {execution: default-deploy}]
[INFO] Retrieving previous build number from apache.snapshots.https
[INFO] repository metadata for: 'snapshot org.apache.maven.plugins:maven-war-plugin:2.1-beta-2-SNAPSHOT'
could not be found on repository: apache.snapshots.https, so will be created
Uploading: file:/opt/repos/deploy-junk/org/apache/maven/plugins/maven-war-plugin/2.1-beta-2-SNAPSHOT/maven-war-plugin-2.1-beta-2-20100410.064447-1.jar
74K uploaded  (maven-war-plugin-2.1-beta-2-20100410.064447-1.jar)
[INFO] Retrieving previous metadata from apache.snapshots.https
[INFO] repository metadata for: 'artifact org.apache.maven.plugins:maven-war-plugin' could
not be found on repository: apache.snapshots.https, so will be created
[INFO] Uploading repository metadata for: 'artifact org.apache.maven.plugins:maven-war-plugin'
[INFO] Retrieving previous metadata from apache.snapshots.https
[INFO] repository metadata for: 'snapshot org.apache.maven.plugins:maven-war-plugin:2.1-beta-2-SNAPSHOT'
could not be found on repository: apache.snapshots.https, so will be created
[INFO] Uploading repository metadata for: 'snapshot org.apache.maven.plugins:maven-war-plugin:2.1-beta-2-SNAPSHOT'
[INFO] Retrieving previous metadata from apache.snapshots.https
[INFO] Uploading repository metadata for: 'org.apache.maven.plugins'
[INFO] Uploading project information for maven-war-plugin 2.1-beta-2-20100410.064447-1
[INFO] 
[INFO] 
[INFO] ------------------------------------------------------------------------
[INFO] Reactor Summary:
[INFO] ------------------------------------------------------------------------
[INFO] Maven Plugins ......................................... SUCCESS [13.165s]
[INFO] Maven Invoker Plugin .................................. SUCCESS [5:48.347s]
[INFO] Maven Ant Plugin ...................................... SUCCESS [2:30.122s]
[INFO] Maven AntRun Plugin ................................... SUCCESS [1:01.070s]
[INFO] Maven Eclipse Plugin .................................. SUCCESS [11:51.102s]
[INFO] Maven Site Plugin ..................................... SUCCESS [4:50.427s]
[INFO] Maven Changelog Plugin ................................ SUCCESS [39.394s]
[INFO] Maven Changes Report Plugin ........................... SUCCESS [1:23.369s]
[INFO] Maven Checkstyle Plugin ............................... SUCCESS [2:29.767s]
[INFO] Maven Clean Plugin .................................... SUCCESS [24.480s]
[INFO] Maven Compiler Plugin ................................. SUCCESS [29.811s]
[INFO] Maven Dependency Plugin ............................... SUCCESS [2:52.008s]
[INFO] Maven Deploy Plugin ................................... SUCCESS [2:06.507s]
[INFO] Maven DOAP Plugin ..................................... SUCCESS [15.760s]
[INFO] Maven Documentation Checker Plugin .................... SUCCESS [22.755s]
[INFO] Maven EAR Plugin ...................................... SUCCESS [4:00.874s]
[INFO] Maven EJB Plugin ...................................... SUCCESS [43.086s]
[INFO] Maven GPG Plugin ...................................... SUCCESS [35.855s]
[INFO] Maven Help Plugin ..................................... SUCCESS [43.699s]
[INFO] Maven IDEA Plugin ..................................... SUCCESS [12.841s]
[INFO] Maven Install Plugin .................................. SUCCESS [1:41.739s]
[INFO] Maven JAR Plugin ...................................... SUCCESS [2:06.211s]
[INFO] Maven Jarsigner Plugin ................................ SUCCESS [1:06.064s]
[INFO] Maven Shade Plugin .................................... SUCCESS [2:48.044s]
[INFO] Maven Javadoc Plugin .................................. FAILED [12:59.309s]
[INFO] Maven Linkcheck Plugin ................................ SUCCESS [35.466s]
[INFO] Maven One Plugin ...................................... SUCCESS [10.177s]
[INFO] Maven Patch Plugin .................................... SUCCESS [35.446s]
[INFO] Maven PDF Plugin ...................................... SUCCESS [1:47.758s]
[INFO] Maven PMD Plugin ...................................... SUCCESS [1:05.571s]
[INFO] Maven RAR Plugin ...................................... SUCCESS [23.803s]
[INFO] Maven Reactor Plugin .................................. SUCCESS [4.727s]
[INFO] Maven Repository Plugin ............................... SUCCESS [2:01.689s]
[INFO] Maven Resources Plugin ................................ SUCCESS [1:17.073s]
[INFO] Maven Source Plugin ................................... SUCCESS [59.023s]
[INFO] Maven Stage Plugin .................................... SUCCESS [4.454s]
[INFO] Maven Toolchains Plugin ............................... SUCCESS [2.190s]
[INFO] Maven Verifier Plugin ................................. SUCCESS [19.967s]
[INFO] Maven WAR Plugin ...................................... SUCCESS [2:13.838s]
[INFO] ------------------------------------------------------------------------
[INFO] Error for project: Maven Javadoc Plugin (during deploy)
[INFO] ------------------------------------------------------------------------
[INFO] : org.apache.maven.plugin.invoker.InvokerSession@44ad54
1 build failed.
[INFO] ------------------------------------------------------------------------
[INFO] Trace
org.apache.maven.BuildFailureException: 1 build failed.
	at org.apache.maven.lifecycle.DefaultLifecycleExecutor.executeGoals(DefaultLifecycleExecutor.java:715)
	at org.apache.maven.lifecycle.DefaultLifecycleExecutor.executeGoalWithLifecycle(DefaultLifecycleExecutor.java:556)
	at org.apache.maven.lifecycle.DefaultLifecycleExecutor.executeGoal(DefaultLifecycleExecutor.java:535)
	at org.apache.maven.lifecycle.DefaultLifecycleExecutor.executeGoalAndHandleFailures(DefaultLifecycleExecutor.java:387)
	at org.apache.maven.lifecycle.DefaultLifecycleExecutor.executeTaskSegments(DefaultLifecycleExecutor.java:348)
	at org.apache.maven.lifecycle.DefaultLifecycleExecutor.execute(DefaultLifecycleExecutor.java:180)
	at org.apache.maven.DefaultMaven.doExecute(DefaultMaven.java:328)
	at org.apache.maven.DefaultMaven.execute(DefaultMaven.java:138)
	at org.apache.maven.cli.MavenCli.main(MavenCli.java:362)
	at org.apache.maven.cli.compat.CompatibleMain.main(CompatibleMain.java:60)
	at sun.reflect.NativeMethodAccessorImpl.invoke0(Native Method)
	at sun.reflect.NativeMethodAccessorImpl.invoke(NativeMethodAccessorImpl.java:39)
	at sun.reflect.DelegatingMethodAccessorImpl.invoke(DelegatingMethodAccessorImpl.java:25)
	at java.lang.reflect.Method.invoke(Method.java:585)
	at org.codehaus.classworlds.Launcher.launchEnhanced(Launcher.java:315)
	at org.codehaus.classworlds.Launcher.launch(Launcher.java:255)
	at org.codehaus.classworlds.Launcher.mainWithExitCode(Launcher.java:430)
	at org.codehaus.classworlds.Launcher.main(Launcher.java:375)
Caused by: org.apache.maven.plugin.MojoFailureException: 1 build failed.
	at org.apache.maven.plugin.invoker.InvokerSession.handleFailures(InvokerSession.java:244)
	at org.apache.maven.plugin.invoker.InvokerMojo.processResults(InvokerMojo.java:58)
	at org.apache.maven.plugin.invoker.AbstractInvokerMojo.execute(AbstractInvokerMojo.java:601)
	at org.apache.maven.plugin.DefaultPluginManager.executeMojo(DefaultPluginManager.java:490)
	at org.apache.maven.lifecycle.DefaultLifecycleExecutor.executeGoals(DefaultLifecycleExecutor.java:694)
	... 17 more
[INFO] ------------------------------------------------------------------------
[INFO] BUILD ERRORS
[INFO] ------------------------------------------------------------------------
[INFO] Total time: 75 minutes 58 seconds
[INFO] Finished at: Sat Apr 10 01:00:32 PDT 2010
[INFO] Final Memory: 61M/167M
[INFO] ------------------------------------------------------------------------


Mime
View raw message