maven-notifications mailing list archives

Site index · List index
Message view « Date » · « Thread »
Top « Date » · « Thread »
From Hudson <Hud...@sonatype.org>
Subject Build failed in Hudson: maven-plugins-ITs » 1.5,windows #408
Date Fri, 09 Apr 2010 07:28:43 GMT
See <http://grid.sonatype.org/ci/job/maven-plugins-ITs/./jdk=1.5,label=windows/408/changes>

Changes:

[John Casey] [MJAVAOC-280] Adding tests and fixing a couple minor issues with test-javadoc
generation and multiple javadoc executions in succession.

------------------------------------------
[...truncated 8087 lines...]
[INFO] Exploding webapp
[INFO] Assembling webapp[maven-war-plugin-test] in [C:\home\hudson\workspace\maven-plugins-ITs\jdk\1.5\label\windows\trunk\maven-war-plugin\target\test-classes\unit\warexplodedmojo\test-dir\ExplodedWarWithAar]
[INFO] Processing war project
[INFO] Copying webapp resources[C:\home\hudson\workspace\maven-plugins-ITs\jdk\1.5\label\windows\trunk\maven-war-plugin\target\test-classes\unit\warexplodedmojo\test-dir\ExplodedWarWithAar-test-data\source]
[INFO] Webapp assembled in [18 msecs]
[INFO] Exploding webapp
[INFO] Assembling webapp[maven-war-plugin-test] in [C:\home\hudson\workspace\maven-plugins-ITs\jdk\1.5\label\windows\trunk\maven-war-plugin\target\test-classes\unit\warexplodedmojo\test-dir\ExplodedWar_WithDuplicateDependencies]
[INFO] Processing war project
[INFO] Copying webapp resources[C:\home\hudson\workspace\maven-plugins-ITs\jdk\1.5\label\windows\trunk\maven-war-plugin\target\test-classes\unit\warexplodedmojo\test-dir\ExplodedWar_WithDuplicateDependencies-test-data\source]
[INFO] Webapp assembled in [33 msecs]
[INFO] Exploding webapp
[INFO] Assembling webapp[maven-war-plugin-test] in [C:\home\hudson\workspace\maven-plugins-ITs\jdk\1.5\label\windows\trunk\maven-war-plugin\target\test-classes\unit\warexplodedmojo\test-dir\ExplodedWar_DuplicateWithClassifier]
[INFO] Processing war project
[INFO] Copying webapp resources[C:\home\hudson\workspace\maven-plugins-ITs\jdk\1.5\label\windows\trunk\maven-war-plugin\target\test-classes\unit\warexplodedmojo\test-dir\ExplodedWar_DuplicateWithClassifier-test-data\source]
[INFO] Webapp assembled in [25 msecs]
[INFO] Exploding webapp
[INFO] Assembling webapp[maven-war-plugin-test] in [C:\home\hudson\workspace\maven-plugins-ITs\jdk\1.5\label\windows\trunk\maven-war-plugin\target\test-classes\unit\warexplodedmojo\test-dir\ExplodedWar_WithClasses]
[INFO] Processing war project
[INFO] Copying webapp resources[C:\home\hudson\workspace\maven-plugins-ITs\jdk\1.5\label\windows\trunk\maven-war-plugin\target\test-classes\unit\warexplodedmojo\test-dir\ExplodedWar_WithClasses-test-data\source]
[INFO] Webapp assembled in [29 msecs]
[INFO] Exploding webapp
[INFO] Assembling webapp[maven-war-plugin-test] in [C:\home\hudson\workspace\maven-plugins-ITs\jdk\1.5\label\windows\trunk\maven-war-plugin\target\test-classes\unit\warexplodedmojo\test-dir\ExplodedWar_WithSourceIncludeExclude]
[INFO] Processing war project
[INFO] Copying webapp resources[C:\home\hudson\workspace\maven-plugins-ITs\jdk\1.5\label\windows\trunk\maven-war-plugin\target\test-classes\unit\warexplodedmojo\test-dir\ExplodedWar_WithSourceIncludeExclude-test-data\source]
[INFO] Webapp assembled in [9 msecs]
[INFO] Exploding webapp
[INFO] Assembling webapp[maven-war-plugin-test] in [C:\home\hudson\workspace\maven-plugins-ITs\jdk\1.5\label\windows\trunk\maven-war-plugin\target\test-classes\unit\warexplodedmojo\test-dir\ExplodedWar_WithWarDependencyIncludeExclude]
[INFO] Processing war project
[INFO] Copying webapp resources[C:\home\hudson\workspace\maven-plugins-ITs\jdk\1.5\label\windows\trunk\maven-war-plugin\target\test-classes\unit\warexplodedmojo\test-dir\ExplodedWar_WithWarDependencyIncludeExclude-test-data\source]
[INFO] Processing overlay[ id wartests:war-include-exclude]
[INFO] Webapp assembled in [89 msecs]
[INFO] Exploding webapp
[INFO] Assembling webapp[maven-war-plugin-test] in [C:\home\hudson\workspace\maven-plugins-ITs\jdk\1.5\label\windows\trunk\maven-war-plugin\target\test-classes\unit\warexplodedmojo\test-dir\ExplodedWarWithSourceModificationCheck]
[INFO] Processing war project
[INFO] Copying webapp resources[C:\home\hudson\workspace\maven-plugins-ITs\jdk\1.5\label\windows\trunk\maven-war-plugin\target\test-classes\unit\warexplodedmojo\test-dir\ExplodedWarWithSourceModificationCheck-test-data\source]
[INFO] Webapp assembled in [25 msecs]
[INFO] Exploding webapp
[INFO] Assembling webapp[maven-war-plugin-test] in [C:\home\hudson\workspace\maven-plugins-ITs\jdk\1.5\label\windows\trunk\maven-war-plugin\target\test-classes\unit\warexplodedmojo\test-dir\ExplodedWarWithFileNameMapping]
[INFO] Processing war project
[INFO] Copying webapp resources[C:\home\hudson\workspace\maven-plugins-ITs\jdk\1.5\label\windows\trunk\maven-war-plugin\target\test-classes\unit\warexplodedmojo\test-dir\ExplodedWarWithFileNameMapping-test-data\source]
[INFO] Webapp assembled in [20 msecs]
[INFO] Exploding webapp
[INFO] Assembling webapp[maven-war-plugin-test] in [C:\home\hudson\workspace\maven-plugins-ITs\jdk\1.5\label\windows\trunk\maven-war-plugin\target\test-classes\unit\warexplodedmojo\test-dir\ExplodedWarWithFileNameMappingAndDuplicateDependencies]
[INFO] Processing war project
[INFO] Copying webapp resources[C:\home\hudson\workspace\maven-plugins-ITs\jdk\1.5\label\windows\trunk\maven-war-plugin\target\test-classes\unit\warexplodedmojo\test-dir\ExplodedWarWithFileNameMappingAndDuplicateDependencies-test-data\source]
[INFO] Webapp assembled in [22 msecs]
Tests run: 20, Failures: 0, Errors: 0, Skipped: 0, Time elapsed: 2.484 sec
Running org.apache.maven.plugin.war.WarInPlaceMojoTest
[INFO] Generating webapp in source directory[C:\home\hudson\workspace\maven-plugins-ITs\jdk\1.5\label\windows\trunk\maven-war-plugin\target\test-classes\unit\warexplodedinplacemojo\test-dir\SimpleExplodedInplaceWar-test-data\source]
[INFO] Assembling webapp[maven-war-plugin-test] in [C:\home\hudson\workspace\maven-plugins-ITs\jdk\1.5\label\windows\trunk\maven-war-plugin\target\test-classes\unit\warexplodedinplacemojo\test-dir\SimpleExplodedInplaceWar-test-data\source]
[INFO] Processing war project
[INFO] Copying webapp webResources[C:\home\hudson\workspace\maven-plugins-ITs\jdk\1.5\label\windows\trunk\maven-war-plugin\target\test-classes\unit\warexplodedinplacemojo\test-dir\resources]
to[C:\home\hudson\workspace\maven-plugins-ITs\jdk\1.5\label\windows\trunk\maven-war-plugin\target\test-classes\unit\warexplodedinplacemojo\test-dir\SimpleExplodedInplaceWar-test-data\source]
[INFO] Webapp assembled in [9 msecs]
Tests run: 2, Failures: 0, Errors: 0, Skipped: 0, Time elapsed: 0.186 sec
Running org.apache.maven.plugin.war.WarManifestMojoTest
Tests run: 5, Failures: 0, Errors: 0, Skipped: 0, Time elapsed: 0.474 sec
Running org.apache.maven.plugin.war.util.PathSetTest
Tests run: 5, Failures: 0, Errors: 0, Skipped: 0, Time elapsed: 0.015 sec
Running org.apache.maven.plugin.war.util.WarUtilsTest
Tests run: 1, Failures: 0, Errors: 0, Skipped: 0, Time elapsed: 0.007 sec
Running org.apache.maven.plugin.war.overlay.OverlayManagerTest
Tests run: 6, Failures: 0, Errors: 0, Skipped: 0, Time elapsed: 0.357 sec
Running org.apache.maven.plugin.war.WarDependenciesAnalysisTest
[INFO] Exploding webapp
[INFO] Assembling webapp[maven-war-plugin-test] in [C:\home\hudson\workspace\maven-plugins-ITs\jdk\1.5\label\windows\trunk\maven-war-plugin\target\test-classes\unit\dependenciesanalysis\test-dir\no-change]
[INFO] Processing war project
[INFO] Copying webapp resources[C:\home\hudson\workspace\maven-plugins-ITs\jdk\1.5\label\windows\trunk\maven-war-plugin\target\test-classes\unit\dependenciesanalysis\test-dir\no-change-test-data\source]
[INFO] Webapp assembled in [29 msecs]
[INFO] Exploding webapp
[INFO] Assembling webapp[maven-war-plugin-test] in [C:\home\hudson\workspace\maven-plugins-ITs\jdk\1.5\label\windows\trunk\maven-war-plugin\target\test-classes\unit\dependenciesanalysis\test-dir\no-change]
[INFO] Processing war project
[INFO] Copying webapp resources[C:\home\hudson\workspace\maven-plugins-ITs\jdk\1.5\label\windows\trunk\maven-war-plugin\target\test-classes\unit\dependenciesanalysis\test-dir\no-change-test-data\source]
[INFO] Webapp assembled in [17 msecs]
[INFO] Exploding webapp
[INFO] Assembling webapp[maven-war-plugin-test] in [C:\home\hudson\workspace\maven-plugins-ITs\jdk\1.5\label\windows\trunk\maven-war-plugin\target\test-classes\unit\dependenciesanalysis\test-dir\remove-dependency]
[INFO] Processing war project
[INFO] Copying webapp resources[C:\home\hudson\workspace\maven-plugins-ITs\jdk\1.5\label\windows\trunk\maven-war-plugin\target\test-classes\unit\dependenciesanalysis\test-dir\remove-dependency-test-data\source]
[INFO] Webapp assembled in [26 msecs]
[INFO] Exploding webapp
[INFO] Assembling webapp[maven-war-plugin-test] in [C:\home\hudson\workspace\maven-plugins-ITs\jdk\1.5\label\windows\trunk\maven-war-plugin\target\test-classes\unit\dependenciesanalysis\test-dir\remove-dependency]
[INFO] Dependency[Dependency {groupId=org.sample.jar, artifactId=lib-test, version=1.0, type=jar}]
has been removed from the project.
[INFO] Processing war project
[INFO] Copying webapp resources[C:\home\hudson\workspace\maven-plugins-ITs\jdk\1.5\label\windows\trunk\maven-war-plugin\target\test-classes\unit\dependenciesanalysis\test-dir\remove-dependency-test-data\source]
[INFO] Webapp assembled in [13 msecs]
[INFO] Exploding webapp
[INFO] Assembling webapp[maven-war-plugin-test] in [C:\home\hudson\workspace\maven-plugins-ITs\jdk\1.5\label\windows\trunk\maven-war-plugin\target\test-classes\unit\dependenciesanalysis\test-dir\dependency-update-version]
[INFO] Processing war project
[INFO] Copying webapp resources[C:\home\hudson\workspace\maven-plugins-ITs\jdk\1.5\label\windows\trunk\maven-war-plugin\target\test-classes\unit\dependenciesanalysis\test-dir\dependency-update-version-test-data\source]
[INFO] Webapp assembled in [24 msecs]
[INFO] Exploding webapp
[INFO] Assembling webapp[maven-war-plugin-test] in [C:\home\hudson\workspace\maven-plugins-ITs\jdk\1.5\label\windows\trunk\maven-war-plugin\target\test-classes\unit\dependenciesanalysis\test-dir\dependency-update-version]
[INFO] Version of dependency[Dependency {groupId=org.sample.jar, artifactId=lib-test, version=2.0,
type=jar}] has changed (1.0 -> 2.0).
[INFO] Processing war project
[INFO] Copying webapp resources[C:\home\hudson\workspace\maven-plugins-ITs\jdk\1.5\label\windows\trunk\maven-war-plugin\target\test-classes\unit\dependenciesanalysis\test-dir\dependency-update-version-test-data\source]
[INFO] Webapp assembled in [17 msecs]
[INFO] Exploding webapp
[INFO] Assembling webapp[maven-war-plugin-test] in [C:\home\hudson\workspace\maven-plugins-ITs\jdk\1.5\label\windows\trunk\maven-war-plugin\target\test-classes\unit\dependenciesanalysis\test-dir\dependency-now-provided]
[INFO] Processing war project
[INFO] Copying webapp resources[C:\home\hudson\workspace\maven-plugins-ITs\jdk\1.5\label\windows\trunk\maven-war-plugin\target\test-classes\unit\dependenciesanalysis\test-dir\dependency-now-provided-test-data\source]
[INFO] Webapp assembled in [39 msecs]
[INFO] Exploding webapp
[INFO] Assembling webapp[maven-war-plugin-test] in [C:\home\hudson\workspace\maven-plugins-ITs\jdk\1.5\label\windows\trunk\maven-war-plugin\target\test-classes\unit\dependenciesanalysis\test-dir\dependency-now-provided]
[INFO] Scope of dependency[Dependency {groupId=org.sample.jar, artifactId=lib-test, version=1.0,
type=jar}] has changed (runtime -> provided).
[INFO] Processing war project
[INFO] Copying webapp resources[C:\home\hudson\workspace\maven-plugins-ITs\jdk\1.5\label\windows\trunk\maven-war-plugin\target\test-classes\unit\dependenciesanalysis\test-dir\dependency-now-provided-test-data\source]
[INFO] Webapp assembled in [25 msecs]
Tests run: 4, Failures: 0, Errors: 0, Skipped: 0, Time elapsed: 0.539 sec

Results :

Tests run: 81, Failures: 0, Errors: 0, Skipped: 0

[INFO] [jar:jar {execution: default-jar}]
[INFO] Building jar: C:\home\hudson\workspace\maven-plugins-ITs\jdk\1.5\label\windows\trunk\maven-war-plugin\target\maven-war-plugin-2.1-beta-2-SNAPSHOT.jar
[INFO] [plugin:addPluginArtifactMetadata {execution: default-addPluginArtifactMetadata}]
[INFO] [invoker:install {execution: integration-test}]
[INFO] Installing C:\home\hudson\workspace\maven-plugins-ITs\jdk\1.5\label\windows\trunk\maven-war-plugin\pom.xml
to C:\home\hudson\workspace\maven-plugins-ITs\jdk\1.5\label\windows\trunk\maven-war-plugin\target\local-repo\org\apache\maven\plugins\maven-war-plugin\2.1-beta-2-SNAPSHOT\maven-war-plugin-2.1-beta-2-SNAPSHOT.pom
[INFO] Installing C:\home\hudson\workspace\maven-plugins-ITs\jdk\1.5\label\windows\trunk\maven-war-plugin\target\maven-war-plugin-2.1-beta-2-SNAPSHOT.jar
to C:\home\hudson\workspace\maven-plugins-ITs\jdk\1.5\label\windows\trunk\maven-war-plugin\target\local-repo\org\apache\maven\plugins\maven-war-plugin\2.1-beta-2-SNAPSHOT\maven-war-plugin-2.1-beta-2-SNAPSHOT.jar
[INFO] [invoker:run {execution: integration-test}]
[INFO] Building: default\pom.xml
[INFO] ..SUCCESS (9.0 s)
[INFO] Building: MWAR-129\pom.xml
[INFO] ..SUCCESS (2.7 s)
[INFO] Building: MWAR-131\pom.xml
[INFO] ..SUCCESS (30.4 s)
[INFO] Building: MWAR-133\pom.xml
[INFO] ..SUCCESS (3.5 s)
[INFO] Building: MWAR-139\pom.xml
[INFO] ..SUCCESS (3.3 s)
[INFO] Building: MWAR-143\pom.xml
[INFO] ..SUCCESS (8.7 s)
[INFO] Building: MWAR-62\pom.xml
[INFO] ..SUCCESS (2.8 s)
[INFO] Building: MWAR-96\pom.xml
[INFO] ..SUCCESS (3.5 s)
[INFO] Building: scoped-dependency-same-artifact\pom.xml
[INFO] ..SUCCESS (5.0 s)
[INFO] Building: simple-war-no-webxml\pom.xml
[INFO] ..SUCCESS (4.4 s)
[INFO] Building: simple-war-project\pom.xml
[INFO] ..SUCCESS (3.6 s)
[INFO] Building: web-resources-filtering\pom.xml
[INFO] ..SUCCESS (4.6 s)
[INFO] ---------------------------------------
[INFO] Execution Summary:
[INFO]   Builds Passing: 12
[INFO]   Builds Failing: 0
[INFO]   Builds Skipped: 0
[INFO] ---------------------------------------
[INFO] [install:install {execution: default-install}]
[INFO] Installing C:\home\hudson\workspace\maven-plugins-ITs\jdk\1.5\label\windows\trunk\maven-war-plugin\target\maven-war-plugin-2.1-beta-2-SNAPSHOT.jar
to C:\opt\repos\local-repository\org\apache\maven\plugins\maven-war-plugin\2.1-beta-2-SNAPSHOT\maven-war-plugin-2.1-beta-2-SNAPSHOT.jar
[INFO] [deploy:deploy {execution: default-deploy}]
[INFO] Retrieving previous build number from apache.snapshots.https
[INFO] repository metadata for: 'snapshot org.apache.maven.plugins:maven-war-plugin:2.1-beta-2-SNAPSHOT'
could not be found on repository: apache.snapshots.https, so will be created
Uploading: file:/opt/repos/deploy-junk/org/apache/maven/plugins/maven-war-plugin/2.1-beta-2-SNAPSHOT/maven-war-plugin-2.1-beta-2-20100409.060857-1.jar
74K uploaded  (maven-war-plugin-2.1-beta-2-20100409.060857-1.jar)
[INFO] Retrieving previous metadata from apache.snapshots.https
[INFO] repository metadata for: 'artifact org.apache.maven.plugins:maven-war-plugin' could
not be found on repository: apache.snapshots.https, so will be created
[INFO] Uploading repository metadata for: 'artifact org.apache.maven.plugins:maven-war-plugin'
[INFO] Retrieving previous metadata from apache.snapshots.https
[INFO] repository metadata for: 'snapshot org.apache.maven.plugins:maven-war-plugin:2.1-beta-2-SNAPSHOT'
could not be found on repository: apache.snapshots.https, so will be created
[INFO] Uploading repository metadata for: 'snapshot org.apache.maven.plugins:maven-war-plugin:2.1-beta-2-SNAPSHOT'
[INFO] Retrieving previous metadata from apache.snapshots.https
[INFO] Uploading repository metadata for: 'org.apache.maven.plugins'
[INFO] Uploading project information for maven-war-plugin 2.1-beta-2-20100409.060857-1
[INFO] 
[INFO] 
[INFO] ------------------------------------------------------------------------
[INFO] Reactor Summary:
[INFO] ------------------------------------------------------------------------
[INFO] Maven Plugins ......................................... SUCCESS [1:55.620s]
[INFO] Maven Invoker Plugin .................................. SUCCESS [7:25.382s]
[INFO] Maven Ant Plugin ...................................... SUCCESS [3:10.009s]
[INFO] Maven AntRun Plugin ................................... SUCCESS [1:14.144s]
[INFO] Maven Eclipse Plugin .................................. SUCCESS [12:11.199s]
[INFO] Maven Site Plugin ..................................... SUCCESS [6:11.614s]
[INFO] Maven Changelog Plugin ................................ SUCCESS [47.532s]
[INFO] Maven Changes Report Plugin ........................... SUCCESS [1:45.751s]
[INFO] Maven Checkstyle Plugin ............................... SUCCESS [2:53.047s]
[INFO] Maven Clean Plugin .................................... SUCCESS [24.817s]
[INFO] Maven Compiler Plugin ................................. SUCCESS [33.921s]
[INFO] Maven Dependency Plugin ............................... SUCCESS [3:02.208s]
[INFO] Maven Deploy Plugin ................................... SUCCESS [1:59.978s]
[INFO] Maven DOAP Plugin ..................................... SUCCESS [35.876s]
[INFO] Maven Documentation Checker Plugin .................... SUCCESS [23.643s]
[INFO] Maven EAR Plugin ...................................... SUCCESS [3:52.874s]
[INFO] Maven EJB Plugin ...................................... SUCCESS [44.320s]
[INFO] Maven GPG Plugin ...................................... SUCCESS [32.344s]
[INFO] Maven Help Plugin ..................................... SUCCESS [47.247s]
[INFO] Maven IDEA Plugin ..................................... SUCCESS [17.394s]
[INFO] Maven Install Plugin .................................. SUCCESS [1:38.705s]
[INFO] Maven JAR Plugin ...................................... SUCCESS [2:10.529s]
[INFO] Maven Jarsigner Plugin ................................ SUCCESS [1:05.948s]
[INFO] Maven Shade Plugin .................................... SUCCESS [2:54.693s]
[INFO] Maven Javadoc Plugin .................................. FAILED [13:17.792s]
[INFO] Maven Linkcheck Plugin ................................ SUCCESS [6.995s]
[INFO] Maven One Plugin ...................................... SUCCESS [15.501s]
[INFO] Maven Patch Plugin .................................... SUCCESS [16.775s]
[INFO] Maven PDF Plugin ...................................... SUCCESS [1:01.754s]
[INFO] Maven PMD Plugin ...................................... SUCCESS [1:22.782s]
[INFO] Maven RAR Plugin ...................................... SUCCESS [17.403s]
[INFO] Maven Reactor Plugin .................................. SUCCESS [11.877s]
[INFO] Maven Repository Plugin ............................... SUCCESS [1:46.608s]
[INFO] Maven Resources Plugin ................................ SUCCESS [1:07.276s]
[INFO] Maven Source Plugin ................................... SUCCESS [50.608s]
[INFO] Maven Stage Plugin .................................... SUCCESS [3.283s]
[INFO] Maven Toolchains Plugin ............................... SUCCESS [2.026s]
[INFO] Maven Verifier Plugin ................................. SUCCESS [15.103s]
[INFO] Maven WAR Plugin ...................................... SUCCESS [1:58.838s]
[INFO] ------------------------------------------------------------------------
[INFO] Error for project: Maven Javadoc Plugin (during deploy)
[INFO] ------------------------------------------------------------------------
[INFO] : org.apache.maven.plugin.invoker.InvokerSession@1cb30a4
1 build failed.
[INFO] ------------------------------------------------------------------------
[INFO] Trace
org.apache.maven.BuildFailureException: 1 build failed.
	at org.apache.maven.lifecycle.DefaultLifecycleExecutor.executeGoals(DefaultLifecycleExecutor.java:715)
	at org.apache.maven.lifecycle.DefaultLifecycleExecutor.executeGoalWithLifecycle(DefaultLifecycleExecutor.java:556)
	at org.apache.maven.lifecycle.DefaultLifecycleExecutor.executeGoal(DefaultLifecycleExecutor.java:535)
	at org.apache.maven.lifecycle.DefaultLifecycleExecutor.executeGoalAndHandleFailures(DefaultLifecycleExecutor.java:387)
	at org.apache.maven.lifecycle.DefaultLifecycleExecutor.executeTaskSegments(DefaultLifecycleExecutor.java:348)
	at org.apache.maven.lifecycle.DefaultLifecycleExecutor.execute(DefaultLifecycleExecutor.java:180)
	at org.apache.maven.DefaultMaven.doExecute(DefaultMaven.java:328)
	at org.apache.maven.DefaultMaven.execute(DefaultMaven.java:138)
	at org.apache.maven.cli.MavenCli.main(MavenCli.java:362)
	at org.apache.maven.cli.compat.CompatibleMain.main(CompatibleMain.java:60)
	at sun.reflect.NativeMethodAccessorImpl.invoke0(Native Method)
	at sun.reflect.NativeMethodAccessorImpl.invoke(NativeMethodAccessorImpl.java:39)
	at sun.reflect.DelegatingMethodAccessorImpl.invoke(DelegatingMethodAccessorImpl.java:25)
	at java.lang.reflect.Method.invoke(Method.java:585)
	at org.codehaus.classworlds.Launcher.launchEnhanced(Launcher.java:315)
	at org.codehaus.classworlds.Launcher.launch(Launcher.java:255)
	at org.codehaus.classworlds.Launcher.mainWithExitCode(Launcher.java:430)
	at org.codehaus.classworlds.Launcher.main(Launcher.java:375)
Caused by: org.apache.maven.plugin.MojoFailureException: 1 build failed.
	at org.apache.maven.plugin.invoker.InvokerSession.handleFailures(InvokerSession.java:244)
	at org.apache.maven.plugin.invoker.InvokerMojo.processResults(InvokerMojo.java:58)
	at org.apache.maven.plugin.invoker.AbstractInvokerMojo.execute(AbstractInvokerMojo.java:601)
	at org.apache.maven.plugin.DefaultPluginManager.executeMojo(DefaultPluginManager.java:490)
	at org.apache.maven.lifecycle.DefaultLifecycleExecutor.executeGoals(DefaultLifecycleExecutor.java:694)
	... 17 more
[INFO] ------------------------------------------------------------------------
[INFO] BUILD ERRORS
[INFO] ------------------------------------------------------------------------
[INFO] Total time: 81 minutes 39 seconds
[INFO] Finished at: Fri Apr 09 00:28:36 PDT 2010
[INFO] Final Memory: 63M/171M
[INFO] ------------------------------------------------------------------------


Mime
View raw message