maven-notifications mailing list archives

Site index · List index
Message view « Date » · « Thread »
Top « Date » · « Thread »
From Hudson <Hud...@sonatype.org>
Subject Build failed in Hudson: maven-scm » 1.5,ubuntu #134
Date Tue, 08 Jun 2010 21:40:52 GMT
See <http://grid.sonatype.org/ci/job/maven-scm/./jdk=1.5,label=ubuntu/134/changes>

Changes:

[Olivier Lamy] [SCM-535] Cache Settings in SvnUtil
apply similar patch to CvsUtil and GitUtil.

[Olivier Lamy] [SCM-535] Cache Settings in SvnUtil
Submitted by Jake Cobb

------------------------------------------
[...truncated 1923 lines...]
[INFO] Building Maven SCM Visual Source Safe Provider
[INFO]    task-segment: [clean, deploy]
[INFO] ------------------------------------------------------------------------
[INFO] [clean:clean {execution: default-clean}]
[INFO] Deleting <http://grid.sonatype.org/ci/job/maven-scm/./jdk=1.5,label=ubuntu/ws/trunk/maven-scm-providers/maven-scm-provider-vss/target>
[WARNING] DEPRECATED [model]: Use models instead
[INFO] [modello:java {execution: default}]
[INFO] outputDirectory: <http://grid.sonatype.org/ci/job/maven-scm/./jdk=1.5,label=ubuntu/ws/trunk/maven-scm-providers/maven-scm-provider-vss/target/generated-sources/modello>
[INFO] Working on model: src/main/mdo/vss-settings.mdo
[INFO] Generating current version: 1.0.0
[WARNING] DEPRECATED [model]: Use models instead
[INFO] [modello:xpp3-reader {execution: default}]
[INFO] outputDirectory: <http://grid.sonatype.org/ci/job/maven-scm/./jdk=1.5,label=ubuntu/ws/trunk/maven-scm-providers/maven-scm-provider-vss/target/generated-sources/modello>
[INFO] Working on model: src/main/mdo/vss-settings.mdo
[INFO] Generating current version: 1.0.0
[WARNING] DEPRECATED [model]: Use models instead
[INFO] [modello:xpp3-writer {execution: default}]
[INFO] outputDirectory: <http://grid.sonatype.org/ci/job/maven-scm/./jdk=1.5,label=ubuntu/ws/trunk/maven-scm-providers/maven-scm-provider-vss/target/generated-sources/modello>
[INFO] Working on model: src/main/mdo/vss-settings.mdo
[INFO] Generating current version: 1.0.0
[WARNING] DEPRECATED [model]: Use models instead
[INFO] [modello:xsd {execution: default}]
[INFO] outputDirectory: <http://grid.sonatype.org/ci/job/maven-scm/./jdk=1.5,label=ubuntu/ws/trunk/maven-scm-providers/maven-scm-provider-vss/target/generated-site/xsd>
[INFO] Working on model: src/main/mdo/vss-settings.mdo
[INFO] Generating current version: 1.0.0
[INFO] [remote-resources:process {execution: default}]
[INFO] [resources:resources {execution: default-resources}]
[INFO] Using 'UTF-8' encoding to copy filtered resources.
[INFO] skip non existing resourceDirectory <http://grid.sonatype.org/ci/job/maven-scm/./jdk=1.5,label=ubuntu/ws/trunk/maven-scm-providers/maven-scm-provider-vss/src/main/resources>
[INFO] Copying 3 resources
[INFO] [compiler:compile {execution: default-compile}]
[INFO] Compiling 24 source files to <http://grid.sonatype.org/ci/job/maven-scm/./jdk=1.5,label=ubuntu/ws/trunk/maven-scm-providers/maven-scm-provider-vss/target/classes>
[INFO] [plexus-component-metadata:generate-metadata {execution: default}]
[INFO] Discovered 1 component descriptors(s)
[INFO] [resources:testResources {execution: default-testResources}]
[INFO] Using 'UTF-8' encoding to copy filtered resources.
[INFO] Copying 1 resource
[INFO] Copying 3 resources
[INFO] [compiler:testCompile {execution: default-testCompile}]
[INFO] Compiling 9 source files to <http://grid.sonatype.org/ci/job/maven-scm/./jdk=1.5,label=ubuntu/ws/trunk/maven-scm-providers/maven-scm-provider-vss/target/test-classes>
[INFO] [surefire:test {execution: default-test}]
[INFO] Surefire report directory: <http://grid.sonatype.org/ci/job/maven-scm/./jdk=1.5,label=ubuntu/ws/trunk/maven-scm-providers/maven-scm-provider-vss/target/surefire-reports>

-------------------------------------------------------
 T E S T S
-------------------------------------------------------
Running org.apache.maven.scm.provider.vss.commands.changelog.VssHistoryCommandTest
Tests run: 1, Failures: 0, Errors: 0, Skipped: 0, Time elapsed: 0.265 sec
Running org.apache.maven.scm.provider.vss.commands.checkout.VssCheckOutCommandTest
Tests run: 1, Failures: 0, Errors: 0, Skipped: 0, Time elapsed: 0.059 sec
Running org.apache.maven.scm.provider.vss.commands.status.VssStatusConsumerTest
Tests run: 1, Failures: 0, Errors: 0, Skipped: 0, Time elapsed: 0.033 sec
Running org.apache.maven.scm.provider.vss.commands.edit.VssEditCommandTest
Tests run: 4, Failures: 0, Errors: 0, Skipped: 0, Time elapsed: 0.367 sec
Running org.apache.maven.scm.provider.vss.commands.VssCommandLineUtilsTest
Tests run: 2, Failures: 0, Errors: 0, Skipped: 0, Time elapsed: 0.094 sec
Running org.apache.maven.scm.provider.vss.commands.status.VssStatusCommandTest
Tests run: 1, Failures: 0, Errors: 0, Skipped: 0, Time elapsed: 0.06 sec
Running org.apache.maven.scm.provider.vss.VssScmProviderTest
Tests run: 1, Failures: 0, Errors: 0, Skipped: 0, Time elapsed: 0.02 sec
Running org.apache.maven.scm.provider.vss.commands.update.VssUpdateCommandTest
Tests run: 1, Failures: 0, Errors: 0, Skipped: 0, Time elapsed: 0.042 sec
Running org.apache.maven.scm.provider.vss.commands.add.VssAddCommandTest
Tests run: 2, Failures: 0, Errors: 0, Skipped: 0, Time elapsed: 0.083 sec

Results :

Tests run: 14, Failures: 0, Errors: 0, Skipped: 0

[INFO] [jar:jar {execution: default-jar}]
[INFO] Building jar: <http://grid.sonatype.org/ci/job/maven-scm/./jdk=1.5,label=ubuntu/ws/trunk/maven-scm-providers/maven-scm-provider-vss/target/maven-scm-provider-vss-1.4-SNAPSHOT.jar>
[INFO] [install:install {execution: default-install}]
[INFO] Installing <http://grid.sonatype.org/ci/job/maven-scm/./jdk=1.5,label=ubuntu/ws/trunk/maven-scm-providers/maven-scm-provider-vss/target/maven-scm-provider-vss-1.4-SNAPSHOT.jar>
to /opt/repos/scm/org/apache/maven/scm/maven-scm-provider-vss/1.4-SNAPSHOT/maven-scm-provider-vss-1.4-SNAPSHOT.jar
[INFO] [deploy:deploy {execution: default-deploy}]
[INFO] Retrieving previous build number from apache.snapshots.https
Uploading: http://repository.sonatype.org:8081/content/repositories/maven.snapshots/org/apache/maven/scm/maven-scm-provider-vss/1.4-SNAPSHOT/maven-scm-provider-vss-1.4-20100608.213743-23.jar
66K uploaded  (maven-scm-provider-vss-1.4-20100608.213743-23.jar)
[INFO] Retrieving previous metadata from apache.snapshots.https
[INFO] Uploading repository metadata for: 'artifact org.apache.maven.scm:maven-scm-provider-vss'
[INFO] Retrieving previous metadata from apache.snapshots.https
[INFO] Uploading repository metadata for: 'snapshot org.apache.maven.scm:maven-scm-provider-vss:1.4-SNAPSHOT'
[INFO] Uploading project information for maven-scm-provider-vss 1.4-20100608.213743-23
[INFO] ------------------------------------------------------------------------
[INFO] Building Maven SCM TFS Provider
[INFO]    task-segment: [clean, deploy]
[INFO] ------------------------------------------------------------------------
[INFO] [clean:clean {execution: default-clean}]
[INFO] Deleting <http://grid.sonatype.org/ci/job/maven-scm/./jdk=1.5,label=ubuntu/ws/trunk/maven-scm-providers/maven-scm-provider-tfs/target>
[INFO] [remote-resources:process {execution: default}]
[INFO] [resources:resources {execution: default-resources}]
[INFO] Using 'UTF-8' encoding to copy filtered resources.
[INFO] skip non existing resourceDirectory <http://grid.sonatype.org/ci/job/maven-scm/./jdk=1.5,label=ubuntu/ws/trunk/maven-scm-providers/maven-scm-provider-tfs/src/main/resources>
[INFO] Copying 3 resources
[INFO] [compiler:compile {execution: default-compile}]
[INFO] Compiling 21 source files to <http://grid.sonatype.org/ci/job/maven-scm/./jdk=1.5,label=ubuntu/ws/trunk/maven-scm-providers/maven-scm-provider-tfs/target/classes>
[INFO] [plexus-component-metadata:generate-metadata {execution: default}]
[INFO] Discovered 1 component descriptors(s)
[INFO] [resources:testResources {execution: default-testResources}]
[INFO] Using 'UTF-8' encoding to copy filtered resources.
[INFO] Copying 1 resource
[INFO] Copying 3 resources
[INFO] [compiler:testCompile {execution: default-testCompile}]
[INFO] Compiling 13 source files to <http://grid.sonatype.org/ci/job/maven-scm/./jdk=1.5,label=ubuntu/ws/trunk/maven-scm-providers/maven-scm-provider-tfs/target/test-classes>
[INFO] [surefire:test {execution: default-test}]
[INFO] Surefire report directory: <http://grid.sonatype.org/ci/job/maven-scm/./jdk=1.5,label=ubuntu/ws/trunk/maven-scm-providers/maven-scm-provider-tfs/target/surefire-reports>

-------------------------------------------------------
 T E S T S
-------------------------------------------------------
Running org.apache.maven.scm.provider.tfs.command.TfsEditCommandTest
Tests run: 3, Failures: 0, Errors: 0, Skipped: 0, Time elapsed: 0.715 sec
Running org.apache.maven.scm.provider.tfs.command.TfsCommandTest
Tests run: 1, Failures: 0, Errors: 0, Skipped: 0, Time elapsed: 0.057 sec
Running org.apache.maven.scm.provider.tfs.command.TfsListCommandTest
Tests run: 3, Failures: 0, Errors: 0, Skipped: 0, Time elapsed: 0.165 sec
Running org.apache.maven.scm.provider.tfs.command.TfsStatusCommandTest
Tests run: 4, Failures: 0, Errors: 0, Skipped: 0, Time elapsed: 0.171 sec
Running org.apache.maven.scm.provider.tfs.command.TfsAddCommandTest
Tests run: 2, Failures: 0, Errors: 0, Skipped: 0, Time elapsed: 0.098 sec
Running org.apache.maven.scm.provider.tfs.command.TfsCheckOutCommandTest
Tests run: 4, Failures: 0, Errors: 0, Skipped: 0, Time elapsed: 0.161 sec
Running org.apache.maven.scm.provider.tfs.command.TfsTagCommandTest
Tests run: 2, Failures: 0, Errors: 0, Skipped: 0, Time elapsed: 0.05 sec
Running org.apache.maven.scm.provider.tfs.command.TfsUpdateCommandTest
Tests run: 2, Failures: 0, Errors: 0, Skipped: 0, Time elapsed: 0.051 sec
Running org.apache.maven.scm.provider.tfs.command.blame.TfsBlameConsumerTest
Tests run: 1, Failures: 0, Errors: 0, Skipped: 0, Time elapsed: 0.037 sec
Running org.apache.maven.scm.provider.tfs.command.TfsBranchCommandTest
Tests run: 2, Failures: 0, Errors: 0, Skipped: 0, Time elapsed: 0.038 sec
Running org.apache.maven.scm.provider.tfs.command.TfsChangeLogCommandTest
Tests run: 4, Failures: 0, Errors: 0, Skipped: 0, Time elapsed: 0.076 sec
Running org.apache.maven.scm.provider.tfs.command.TfsUnEditCommandTest
Tests run: 2, Failures: 0, Errors: 0, Skipped: 0, Time elapsed: 0.015 sec
Running org.apache.maven.scm.provider.tfs.command.TfsCheckInCommandTest
Tests run: 2, Failures: 0, Errors: 0, Skipped: 0, Time elapsed: 0.049 sec

Results :

Tests run: 32, Failures: 0, Errors: 0, Skipped: 0

[INFO] [jar:jar {execution: default-jar}]
[INFO] Building jar: <http://grid.sonatype.org/ci/job/maven-scm/./jdk=1.5,label=ubuntu/ws/trunk/maven-scm-providers/maven-scm-provider-tfs/target/maven-scm-provider-tfs-1.4-SNAPSHOT.jar>
[INFO] [install:install {execution: default-install}]
[INFO] Installing <http://grid.sonatype.org/ci/job/maven-scm/./jdk=1.5,label=ubuntu/ws/trunk/maven-scm-providers/maven-scm-provider-tfs/target/maven-scm-provider-tfs-1.4-SNAPSHOT.jar>
to /opt/repos/scm/org/apache/maven/scm/maven-scm-provider-tfs/1.4-SNAPSHOT/maven-scm-provider-tfs-1.4-SNAPSHOT.jar
[INFO] [deploy:deploy {execution: default-deploy}]
[INFO] Retrieving previous build number from apache.snapshots.https
Uploading: http://repository.sonatype.org:8081/content/repositories/maven.snapshots/org/apache/maven/scm/maven-scm-provider-tfs/1.4-SNAPSHOT/maven-scm-provider-tfs-1.4-20100608.213743-23.jar
40K uploaded  (maven-scm-provider-tfs-1.4-20100608.213743-23.jar)
[INFO] Uploading project information for maven-scm-provider-tfs 1.4-20100608.213743-23
[INFO] Retrieving previous metadata from apache.snapshots.https
[INFO] Uploading repository metadata for: 'artifact org.apache.maven.scm:maven-scm-provider-tfs'
[INFO] Retrieving previous metadata from apache.snapshots.https
[INFO] Uploading repository metadata for: 'snapshot org.apache.maven.scm:maven-scm-provider-tfs:1.4-SNAPSHOT'
[INFO] ------------------------------------------------------------------------
[INFO] SKIPPING Maven SCM Standard Providers
[INFO]    task-segment: [clean, deploy]
[INFO] This project has been banned from further executions due to previous failures.
[INFO] ------------------------------------------------------------------------
[INFO] ------------------------------------------------------------------------
[INFO] SKIPPING Maven SCM Client
[INFO]    task-segment: [clean, deploy]
[INFO] This project has been banned from further executions due to previous failures.
[INFO] ------------------------------------------------------------------------
[INFO] ------------------------------------------------------------------------
[INFO] SKIPPING Maven SCM Plugin
[INFO]    task-segment: [clean, deploy]
[INFO] This project has been banned from further executions due to previous failures.
[INFO] ------------------------------------------------------------------------
[INFO] 
[INFO] 
[INFO] ------------------------------------------------------------------------
[INFO] Reactor Summary:
[INFO] ------------------------------------------------------------------------
[INFO] Maven SCM ............................................. SUCCESS [7.601s]
[INFO] Maven SCM API ......................................... SUCCESS [11.491s]
[INFO] Maven SCM Managers .................................... SUCCESS [3.725s]
[INFO] Maven SCM Manager for Plexus .......................... SUCCESS [8.137s]
[INFO] Maven SCM Test ........................................ SUCCESS [6.094s]
[INFO] Maven SCM Providers ................................... SUCCESS [4.783s]
[INFO] Maven SCM AccuRev Provider ............................ SUCCESS [12.883s]
[INFO] Maven SCM Bazaar Provider ............................. SUCCESS [5.503s]
[INFO] Maven SCM Clearcase Provider .......................... SUCCESS [10.753s]
[INFO] Maven SCM CVS Provider - Parent ....................... SUCCESS [2.815s]
[INFO] Maven SCM CVS Provider TCK tests ...................... SUCCESS [5.177s]
[INFO] Maven SCM CVS Provider - Common library ............... SUCCESS [6.260s]
[INFO] Maven SCM CVS Provider - CVS Executable Impl. ......... SUCCESS [9.560s]
[INFO] Maven SCM CVS Provider - CVS Java Impl. ............... SUCCESS [5.213s]
[INFO] Maven SCM Mercurial (Hg) Provider ..................... SUCCESS [5.241s]
[INFO] Maven SCM Git Provider - Parent ....................... SUCCESS [2.530s]
[INFO] Maven SCM Git Provider - Common library ............... SUCCESS [6.663s]
[INFO] Maven SCM git Provider TCK Tests ...................... SUCCESS [6.582s]
[INFO] Maven SCM Git Provider - Git Executable Impl. ......... SUCCESS [6.845s]
[INFO] Maven SCM Local Provider .............................. SUCCESS [5.938s]
[INFO] Maven SCM Perforce Provider ........................... SUCCESS [7.963s]
[INFO] Maven SCM Starteam Provider ........................... SUCCESS [10.621s]
[INFO] Maven SCM Subversion Provider - Parent ................ SUCCESS [2.668s]
[INFO] Maven SCM Subversion Provider - Common library ........ SUCCESS [5.232s]
[INFO] Maven SCM Subversion Provider TCK Tests ............... SUCCESS [3.748s]
[INFO] Maven SCM Subversion Provider - SVN Executable Impl. .. FAILED [51.430s]
[INFO] Maven SCM Synergy Provider ............................ SUCCESS [7.621s]
[INFO] Maven SCM Visual Source Safe Provider ................. SUCCESS [9.995s]
[INFO] Maven SCM TFS Provider ................................ SUCCESS [9.484s]
[INFO] Maven SCM Standard Providers .......................... SKIPPED (dependency build failed
or was skipped)
[INFO] Maven SCM Client ...................................... SKIPPED (dependency build failed
or was skipped)
[INFO] Maven SCM Plugin ...................................... SKIPPED (dependency build failed
or was skipped)
[INFO] ------------------------------------------------------------------------
[INFO] Error for project: Maven SCM Subversion Provider - SVN Executable Impl. (during deploy)
[INFO] ------------------------------------------------------------------------
[INFO] There are test failures.

Please refer to <http://grid.sonatype.org/ci/job/maven-scm/./jdk=1.5,label=ubuntu/ws/trunk/maven-scm-providers/maven-scm-providers-svn/maven-scm-provider-svnexe/target/surefire-reports>
for the individual test results.
[INFO] ------------------------------------------------------------------------
[INFO] Trace
org.apache.maven.BuildFailureException: There are test failures.

Please refer to <http://grid.sonatype.org/ci/job/maven-scm/./jdk=1.5,label=ubuntu/ws/trunk/maven-scm-providers/maven-scm-providers-svn/maven-scm-provider-svnexe/target/surefire-reports>
for the individual test results.
	at org.apache.maven.lifecycle.DefaultLifecycleExecutor.executeGoals(DefaultLifecycleExecutor.java:715)
	at org.apache.maven.lifecycle.DefaultLifecycleExecutor.executeGoalWithLifecycle(DefaultLifecycleExecutor.java:556)
	at org.apache.maven.lifecycle.DefaultLifecycleExecutor.executeGoal(DefaultLifecycleExecutor.java:535)
	at org.apache.maven.lifecycle.DefaultLifecycleExecutor.executeGoalAndHandleFailures(DefaultLifecycleExecutor.java:387)
	at org.apache.maven.lifecycle.DefaultLifecycleExecutor.executeTaskSegments(DefaultLifecycleExecutor.java:348)
	at org.apache.maven.lifecycle.DefaultLifecycleExecutor.execute(DefaultLifecycleExecutor.java:180)
	at org.apache.maven.DefaultMaven.doExecute(DefaultMaven.java:328)
	at org.apache.maven.DefaultMaven.execute(DefaultMaven.java:138)
	at org.apache.maven.cli.MavenCli.main(MavenCli.java:362)
	at org.apache.maven.cli.compat.CompatibleMain.main(CompatibleMain.java:60)
	at sun.reflect.NativeMethodAccessorImpl.invoke0(Native Method)
	at sun.reflect.NativeMethodAccessorImpl.invoke(NativeMethodAccessorImpl.java:39)
	at sun.reflect.DelegatingMethodAccessorImpl.invoke(DelegatingMethodAccessorImpl.java:25)
	at java.lang.reflect.Method.invoke(Method.java:585)
	at org.codehaus.classworlds.Launcher.launchEnhanced(Launcher.java:315)
	at org.codehaus.classworlds.Launcher.launch(Launcher.java:255)
	at org.codehaus.classworlds.Launcher.mainWithExitCode(Launcher.java:430)
	at org.codehaus.classworlds.Launcher.main(Launcher.java:375)
Caused by: org.apache.maven.plugin.MojoFailureException: There are test failures.

Please refer to <http://grid.sonatype.org/ci/job/maven-scm/./jdk=1.5,label=ubuntu/ws/trunk/maven-scm-providers/maven-scm-providers-svn/maven-scm-provider-svnexe/target/surefire-reports>
for the individual test results.
	at org.apache.maven.plugin.surefire.SurefirePlugin.execute(SurefirePlugin.java:629)
	at org.apache.maven.plugin.DefaultPluginManager.executeMojo(DefaultPluginManager.java:490)
	at org.apache.maven.lifecycle.DefaultLifecycleExecutor.executeGoals(DefaultLifecycleExecutor.java:694)
	... 17 more
[INFO] ------------------------------------------------------------------------
[INFO] BUILD ERRORS
[INFO] ------------------------------------------------------------------------
[INFO] Total time: 4 minutes 5 seconds
[INFO] Finished at: Tue Jun 08 15:41:42 GMT-06:00 2010
[INFO] Final Memory: 51M/101M
[INFO] ------------------------------------------------------------------------
Recording test results


Mime
View raw message