maven-notifications mailing list archives

Site index · List index
Message view « Date » · « Thread »
Top « Date » · « Thread »
From Hudson <Hud...@sonatype.org>
Subject Build failed in Hudson: maven-plugins-ITs » 1.5,ubuntu #454
Date Thu, 03 Jun 2010 07:24:53 GMT
See <http://grid.sonatype.org/ci/job/maven-plugins-ITs/./jdk=1.5,label=ubuntu/454/changes>

Changes:

[Paul] [MANTRUN-141] Merge the AbstractAntMojo with AntRunMojo

[dkulp] Since the DefaultCheckstyleExecutor contains an object (ResourceManager) 
that holds onto state and must be per-lookup, the DefaultCheckstyleExecutor
must also be per-lookup to be thread safe.

[Paul] [MANTRUN-74] Add unit test to verify that maven antrun plugin can be run in multiple
phases in the build

[Lukas Theussl] document validation and entity issues

------------------------------------------
[...truncated 8028 lines...]
[INFO] Processing war project
[INFO] Copying webapp resources[<http://grid.sonatype.org/ci/job/maven-plugins-ITs/./jdk=1.5,label=ubuntu/ws/trunk/maven-war-plugin/target/test-classes/unit/warexplodedmojo/test-dir/ExplodedWar_WithClasses-test-data/source]>
[INFO] Webapp assembled in [5 msecs]
[INFO] Exploding webapp
[INFO] Assembling webapp[maven-war-plugin-test] in [<http://grid.sonatype.org/ci/job/maven-plugins-ITs/./jdk=1.5,label=ubuntu/ws/trunk/maven-war-plugin/target/test-classes/unit/warexplodedmojo/test-dir/ExplodedWar_WithSourceIncludeExclude]>
[INFO] Processing war project
[INFO] Copying webapp resources[<http://grid.sonatype.org/ci/job/maven-plugins-ITs/./jdk=1.5,label=ubuntu/ws/trunk/maven-war-plugin/target/test-classes/unit/warexplodedmojo/test-dir/ExplodedWar_WithSourceIncludeExclude-test-data/source]>
[INFO] Webapp assembled in [3 msecs]
[INFO] Exploding webapp
[INFO] Assembling webapp[maven-war-plugin-test] in [<http://grid.sonatype.org/ci/job/maven-plugins-ITs/./jdk=1.5,label=ubuntu/ws/trunk/maven-war-plugin/target/test-classes/unit/warexplodedmojo/test-dir/ExplodedWar_WithWarDependencyIncludeExclude]>
[INFO] Processing war project
[INFO] Copying webapp resources[<http://grid.sonatype.org/ci/job/maven-plugins-ITs/./jdk=1.5,label=ubuntu/ws/trunk/maven-war-plugin/target/test-classes/unit/warexplodedmojo/test-dir/ExplodedWar_WithWarDependencyIncludeExclude-test-data/source]>
[INFO] Processing overlay[ id wartests:war-include-exclude]
[INFO] Webapp assembled in [12 msecs]
[INFO] Exploding webapp
[INFO] Assembling webapp[maven-war-plugin-test] in [<http://grid.sonatype.org/ci/job/maven-plugins-ITs/./jdk=1.5,label=ubuntu/ws/trunk/maven-war-plugin/target/test-classes/unit/warexplodedmojo/test-dir/ExplodedWarWithSourceModificationCheck]>
[INFO] Processing war project
[INFO] Copying webapp resources[<http://grid.sonatype.org/ci/job/maven-plugins-ITs/./jdk=1.5,label=ubuntu/ws/trunk/maven-war-plugin/target/test-classes/unit/warexplodedmojo/test-dir/ExplodedWarWithSourceModificationCheck-test-data/source]>
[INFO] Webapp assembled in [4 msecs]
[INFO] Exploding webapp
[INFO] Assembling webapp[maven-war-plugin-test] in [<http://grid.sonatype.org/ci/job/maven-plugins-ITs/./jdk=1.5,label=ubuntu/ws/trunk/maven-war-plugin/target/test-classes/unit/warexplodedmojo/test-dir/ExplodedWarWithFileNameMapping]>
[INFO] Processing war project
[INFO] Copying webapp resources[<http://grid.sonatype.org/ci/job/maven-plugins-ITs/./jdk=1.5,label=ubuntu/ws/trunk/maven-war-plugin/target/test-classes/unit/warexplodedmojo/test-dir/ExplodedWarWithFileNameMapping-test-data/source]>
[INFO] Webapp assembled in [4 msecs]
[INFO] Exploding webapp
[INFO] Assembling webapp[maven-war-plugin-test] in [<http://grid.sonatype.org/ci/job/maven-plugins-ITs/./jdk=1.5,label=ubuntu/ws/trunk/maven-war-plugin/target/test-classes/unit/warexplodedmojo/test-dir/ExplodedWarWithFileNameMappingAndDuplicateDependencies]>
[INFO] Processing war project
[INFO] Copying webapp resources[<http://grid.sonatype.org/ci/job/maven-plugins-ITs/./jdk=1.5,label=ubuntu/ws/trunk/maven-war-plugin/target/test-classes/unit/warexplodedmojo/test-dir/ExplodedWarWithFileNameMappingAndDuplicateDependencies-test-data/source]>
[INFO] Webapp assembled in [5 msecs]
Tests run: 20, Failures: 0, Errors: 0, Skipped: 0, Time elapsed: 1.675 sec
Running org.apache.maven.plugin.war.WarInPlaceMojoTest
[INFO] Generating webapp in source directory[<http://grid.sonatype.org/ci/job/maven-plugins-ITs/./jdk=1.5,label=ubuntu/ws/trunk/maven-war-plugin/target/test-classes/unit/warexplodedinplacemojo/test-dir/SimpleExplodedInplaceWar-test-data/source]>
[INFO] Assembling webapp[maven-war-plugin-test] in [<http://grid.sonatype.org/ci/job/maven-plugins-ITs/./jdk=1.5,label=ubuntu/ws/trunk/maven-war-plugin/target/test-classes/unit/warexplodedinplacemojo/test-dir/SimpleExplodedInplaceWar-test-data/source]>
[INFO] Processing war project
[INFO] Copying webapp webResources[<http://grid.sonatype.org/ci/job/maven-plugins-ITs/./jdk=1.5,label=ubuntu/ws/trunk/maven-war-plugin/target/test-classes/unit/warexplodedinplacemojo/test-dir/resources]>
to[<http://grid.sonatype.org/ci/job/maven-plugins-ITs/./jdk=1.5,label=ubuntu/ws/trunk/maven-war-plugin/target/test-classes/unit/warexplodedinplacemojo/test-dir/SimpleExplodedInplaceWar-test-data/source]>
[INFO] Webapp assembled in [3 msecs]
Tests run: 2, Failures: 0, Errors: 0, Skipped: 0, Time elapsed: 0.082 sec
Running org.apache.maven.plugin.war.WarManifestMojoTest
Tests run: 5, Failures: 0, Errors: 0, Skipped: 0, Time elapsed: 0.223 sec
Running org.apache.maven.plugin.war.util.PathSetTest
Tests run: 5, Failures: 0, Errors: 0, Skipped: 0, Time elapsed: 0.006 sec
Running org.apache.maven.plugin.war.util.WarUtilsTest
Tests run: 1, Failures: 0, Errors: 0, Skipped: 0, Time elapsed: 0.003 sec
Running org.apache.maven.plugin.war.overlay.OverlayManagerTest
Tests run: 5, Failures: 0, Errors: 0, Skipped: 0, Time elapsed: 0.164 sec
Running org.apache.maven.plugin.war.WarDependenciesAnalysisTest
[INFO] Exploding webapp
[INFO] Assembling webapp[maven-war-plugin-test] in [<http://grid.sonatype.org/ci/job/maven-plugins-ITs/./jdk=1.5,label=ubuntu/ws/trunk/maven-war-plugin/target/test-classes/unit/dependenciesanalysis/test-dir/no-change]>
[INFO] Processing war project
[INFO] Copying webapp resources[<http://grid.sonatype.org/ci/job/maven-plugins-ITs/./jdk=1.5,label=ubuntu/ws/trunk/maven-war-plugin/target/test-classes/unit/dependenciesanalysis/test-dir/no-change-test-data/source]>
[INFO] Webapp assembled in [7 msecs]
[INFO] Exploding webapp
[INFO] Assembling webapp[maven-war-plugin-test] in [<http://grid.sonatype.org/ci/job/maven-plugins-ITs/./jdk=1.5,label=ubuntu/ws/trunk/maven-war-plugin/target/test-classes/unit/dependenciesanalysis/test-dir/no-change]>
[INFO] Processing war project
[INFO] Copying webapp resources[<http://grid.sonatype.org/ci/job/maven-plugins-ITs/./jdk=1.5,label=ubuntu/ws/trunk/maven-war-plugin/target/test-classes/unit/dependenciesanalysis/test-dir/no-change-test-data/source]>
[INFO] Webapp assembled in [3 msecs]
[INFO] Exploding webapp
[INFO] Assembling webapp[maven-war-plugin-test] in [<http://grid.sonatype.org/ci/job/maven-plugins-ITs/./jdk=1.5,label=ubuntu/ws/trunk/maven-war-plugin/target/test-classes/unit/dependenciesanalysis/test-dir/remove-dependency]>
[INFO] Processing war project
[INFO] Copying webapp resources[<http://grid.sonatype.org/ci/job/maven-plugins-ITs/./jdk=1.5,label=ubuntu/ws/trunk/maven-war-plugin/target/test-classes/unit/dependenciesanalysis/test-dir/remove-dependency-test-data/source]>
[INFO] Webapp assembled in [7 msecs]
[INFO] Exploding webapp
[INFO] Assembling webapp[maven-war-plugin-test] in [<http://grid.sonatype.org/ci/job/maven-plugins-ITs/./jdk=1.5,label=ubuntu/ws/trunk/maven-war-plugin/target/test-classes/unit/dependenciesanalysis/test-dir/remove-dependency]>
[INFO] Dependency[Dependency {groupId=org.sample.jar, artifactId=lib-test, version=1.0, type=jar}]
has been removed from the project.
[INFO] Processing war project
[INFO] Copying webapp resources[<http://grid.sonatype.org/ci/job/maven-plugins-ITs/./jdk=1.5,label=ubuntu/ws/trunk/maven-war-plugin/target/test-classes/unit/dependenciesanalysis/test-dir/remove-dependency-test-data/source]>
[INFO] Webapp assembled in [3 msecs]
[INFO] Exploding webapp
[INFO] Assembling webapp[maven-war-plugin-test] in [<http://grid.sonatype.org/ci/job/maven-plugins-ITs/./jdk=1.5,label=ubuntu/ws/trunk/maven-war-plugin/target/test-classes/unit/dependenciesanalysis/test-dir/dependency-update-version]>
[INFO] Processing war project
[INFO] Copying webapp resources[<http://grid.sonatype.org/ci/job/maven-plugins-ITs/./jdk=1.5,label=ubuntu/ws/trunk/maven-war-plugin/target/test-classes/unit/dependenciesanalysis/test-dir/dependency-update-version-test-data/source]>
[INFO] Webapp assembled in [7 msecs]
[INFO] Exploding webapp
[INFO] Assembling webapp[maven-war-plugin-test] in [<http://grid.sonatype.org/ci/job/maven-plugins-ITs/./jdk=1.5,label=ubuntu/ws/trunk/maven-war-plugin/target/test-classes/unit/dependenciesanalysis/test-dir/dependency-update-version]>
[INFO] Version of dependency[Dependency {groupId=org.sample.jar, artifactId=lib-test, version=2.0,
type=jar}] has changed (1.0 -> 2.0).
[INFO] Processing war project
[INFO] Copying webapp resources[<http://grid.sonatype.org/ci/job/maven-plugins-ITs/./jdk=1.5,label=ubuntu/ws/trunk/maven-war-plugin/target/test-classes/unit/dependenciesanalysis/test-dir/dependency-update-version-test-data/source]>
[INFO] Webapp assembled in [6 msecs]
[INFO] Exploding webapp
[INFO] Assembling webapp[maven-war-plugin-test] in [<http://grid.sonatype.org/ci/job/maven-plugins-ITs/./jdk=1.5,label=ubuntu/ws/trunk/maven-war-plugin/target/test-classes/unit/dependenciesanalysis/test-dir/dependency-now-provided]>
[INFO] Processing war project
[INFO] Copying webapp resources[<http://grid.sonatype.org/ci/job/maven-plugins-ITs/./jdk=1.5,label=ubuntu/ws/trunk/maven-war-plugin/target/test-classes/unit/dependenciesanalysis/test-dir/dependency-now-provided-test-data/source]>
[INFO] Webapp assembled in [8 msecs]
[INFO] Exploding webapp
[INFO] Assembling webapp[maven-war-plugin-test] in [<http://grid.sonatype.org/ci/job/maven-plugins-ITs/./jdk=1.5,label=ubuntu/ws/trunk/maven-war-plugin/target/test-classes/unit/dependenciesanalysis/test-dir/dependency-now-provided]>
[INFO] Scope of dependency[Dependency {groupId=org.sample.jar, artifactId=lib-test, version=1.0,
type=jar}] has changed (runtime -> provided).
[INFO] Processing war project
[INFO] Copying webapp resources[<http://grid.sonatype.org/ci/job/maven-plugins-ITs/./jdk=1.5,label=ubuntu/ws/trunk/maven-war-plugin/target/test-classes/unit/dependenciesanalysis/test-dir/dependency-now-provided-test-data/source]>
[INFO] Webapp assembled in [9 msecs]
Tests run: 4, Failures: 0, Errors: 0, Skipped: 0, Time elapsed: 0.268 sec

Results :

Tests run: 81, Failures: 0, Errors: 0, Skipped: 0

[INFO] [jar:jar {execution: default-jar}]
[INFO] Building jar: <http://grid.sonatype.org/ci/job/maven-plugins-ITs/./jdk=1.5,label=ubuntu/ws/trunk/maven-war-plugin/target/maven-war-plugin-2.1-beta-2-SNAPSHOT.jar>
[INFO] [plugin:addPluginArtifactMetadata {execution: default-addPluginArtifactMetadata}]
[INFO] [invoker:install {execution: integration-test}]
[INFO] Installing <http://grid.sonatype.org/ci/job/maven-plugins-ITs/./jdk=1.5,label=ubuntu/ws/trunk/maven-war-plugin/pom.xml>
to <http://grid.sonatype.org/ci/job/maven-plugins-ITs/./jdk=1.5,label=ubuntu/ws/trunk/maven-war-plugin/target/local-repo/org/apache/maven/plugins/maven-war-plugin/2.1-beta-2-SNAPSHOT/maven-war-plugin-2.1-beta-2-SNAPSHOT.pom>
[INFO] Installing <http://grid.sonatype.org/ci/job/maven-plugins-ITs/./jdk=1.5,label=ubuntu/ws/trunk/maven-war-plugin/target/maven-war-plugin-2.1-beta-2-SNAPSHOT.jar>
to <http://grid.sonatype.org/ci/job/maven-plugins-ITs/./jdk=1.5,label=ubuntu/ws/trunk/maven-war-plugin/target/local-repo/org/apache/maven/plugins/maven-war-plugin/2.1-beta-2-SNAPSHOT/maven-war-plugin-2.1-beta-2-SNAPSHOT.jar>
[INFO] [invoker:run {execution: integration-test}]
[INFO] Building: web-resources-filtering/pom.xml
[INFO] ..SUCCESS (16.0 s)
[INFO] Building: MWAR-96/pom.xml
[INFO] ..SUCCESS (4.6 s)
[INFO] Building: MWAR-62/pom.xml
[INFO] ..SUCCESS (3.2 s)
[INFO] Building: default/pom.xml
[INFO] ..SUCCESS (9.0 s)
[INFO] Building: simple-war-no-webxml/pom.xml
[INFO] ..SUCCESS (5.1 s)
[INFO] Building: scoped-dependency-same-artifact/pom.xml
[INFO] ..SUCCESS (5.9 s)
[INFO] Building: MWAR-143/pom.xml
[INFO] ..SUCCESS (9.8 s)
[INFO] Building: MWAR-139/pom.xml
[INFO] ..SUCCESS (4.7 s)
[INFO] Building: simple-war-project/pom.xml
[INFO] ..SUCCESS (4.4 s)
[INFO] Building: MWAR-129/pom.xml
[INFO] ..SUCCESS (3.4 s)
[INFO] Building: MWAR-133/pom.xml
[INFO] ..SUCCESS (3.3 s)
[INFO] Building: MWAR-131/pom.xml
[INFO] ..SUCCESS (21.5 s)
[INFO] ---------------------------------------
[INFO] Execution Summary:
[INFO]   Builds Passing: 12
[INFO]   Builds Failing: 0
[INFO]   Builds Skipped: 0
[INFO] ---------------------------------------
[INFO] [install:install {execution: default-install}]
[INFO] Installing <http://grid.sonatype.org/ci/job/maven-plugins-ITs/./jdk=1.5,label=ubuntu/ws/trunk/maven-war-plugin/target/maven-war-plugin-2.1-beta-2-SNAPSHOT.jar>
to /opt/repos/local-repository/org/apache/maven/plugins/maven-war-plugin/2.1-beta-2-SNAPSHOT/maven-war-plugin-2.1-beta-2-SNAPSHOT.jar
[INFO] [deploy:deploy {execution: default-deploy}]
[INFO] Retrieving previous build number from apache.snapshots.https
Uploading: http://repository.sonatype.org:8081/content/repositories/maven.snapshots/org/apache/maven/plugins/maven-war-plugin/2.1-beta-2-SNAPSHOT/maven-war-plugin-2.1-beta-2-20100603.060655-454.jar
75K uploaded  (maven-war-plugin-2.1-beta-2-20100603.060655-454.jar)
[INFO] Retrieving previous metadata from apache.snapshots.https
[INFO] Uploading repository metadata for: 'artifact org.apache.maven.plugins:maven-war-plugin'
[INFO] Retrieving previous metadata from apache.snapshots.https
[INFO] Uploading repository metadata for: 'snapshot org.apache.maven.plugins:maven-war-plugin:2.1-beta-2-SNAPSHOT'
[INFO] Retrieving previous metadata from apache.snapshots.https
[INFO] Uploading repository metadata for: 'org.apache.maven.plugins'
[INFO] Uploading project information for maven-war-plugin 2.1-beta-2-20100603.060655-454
[INFO] ------------------------------------------------------------------------
[INFO] Building Maven Plugins Aggregator
[INFO]    task-segment: [clean, deploy]
[INFO] ------------------------------------------------------------------------
[INFO] [clean:clean {execution: default-clean}]
[INFO] Deleting file set: <http://grid.sonatype.org/ci/job/maven-plugins-ITs/./jdk=1.5,label=ubuntu/ws/trunk/target>
(included: [**], excluded: [])
[INFO] [remote-resources:process {execution: default}]
[INFO] [site:attach-descriptor {execution: default-attach-descriptor}]
[INFO] [install:install {execution: default-install}]
[INFO] Installing <http://grid.sonatype.org/ci/job/maven-plugins-ITs/./jdk=1.5,label=ubuntu/ws/trunk/pom.xml>
to /opt/repos/local-repository/org/apache/maven/plugins/maven-plugins-aggregator/1-SNAPSHOT/maven-plugins-aggregator-1-SNAPSHOT.pom
[INFO] [deploy:deploy {execution: default-deploy}]
[INFO] Retrieving previous build number from apache.snapshots.https
Uploading: http://repository.sonatype.org:8081/content/repositories/maven.snapshots/org/apache/maven/plugins/maven-plugins-aggregator/1-SNAPSHOT/maven-plugins-aggregator-1-20100603.060655-13.pom
3K uploaded  (maven-plugins-aggregator-1-20100603.060655-13.pom)
[INFO] Retrieving previous metadata from apache.snapshots.https
[INFO] Uploading repository metadata for: 'artifact org.apache.maven.plugins:maven-plugins-aggregator'
[INFO] Retrieving previous metadata from apache.snapshots.https
[INFO] Uploading repository metadata for: 'snapshot org.apache.maven.plugins:maven-plugins-aggregator:1-SNAPSHOT'
[INFO] 
[INFO] 
[INFO] ------------------------------------------------------------------------
[INFO] Reactor Summary:
[INFO] ------------------------------------------------------------------------
[INFO] Maven Plugins ......................................... SUCCESS [2:31.623s]
[INFO] Maven Invoker Plugin .................................. SUCCESS [7:08.805s]
[INFO] Maven Ant Plugin ...................................... SUCCESS [3:09.018s]
[INFO] Maven AntRun Plugin ................................... SUCCESS [1:42.462s]
[INFO] Maven Eclipse Plugin .................................. SUCCESS [9:26.361s]
[INFO] Maven Changelog Plugin ................................ SUCCESS [51.217s]
[INFO] Maven Changes Report Plugin ........................... SUCCESS [1:29.216s]
[INFO] Maven Checkstyle Plugin ............................... FAILED [3:02.204s]
[INFO] Maven Clean Plugin .................................... SUCCESS [34.409s]
[INFO] Maven Compiler Plugin ................................. SUCCESS [42.414s]
[INFO] Maven Dependency Plugin ............................... SUCCESS [4:39.801s]
[INFO] Maven Deploy Plugin ................................... SUCCESS [2:00.623s]
[INFO] Maven DOAP Plugin ..................................... SUCCESS [21.354s]
[INFO] Maven Documentation Checker Plugin .................... SUCCESS [29.077s]
[INFO] Maven EAR Plugin ...................................... SUCCESS [4:48.324s]
[INFO] Maven EJB Plugin ...................................... SUCCESS [1:02.175s]
[INFO] Maven GPG Plugin ...................................... SUCCESS [39.906s]
[INFO] Maven Help Plugin ..................................... SUCCESS [52.070s]
[INFO] Maven IDEA Plugin ..................................... SUCCESS [16.726s]
[INFO] Maven Install Plugin .................................. SUCCESS [1:40.901s]
[INFO] Maven JAR Plugin ...................................... SUCCESS [2:06.928s]
[INFO] Maven Jarsigner Plugin ................................ SUCCESS [1:04.115s]
[INFO] Maven Shade Plugin .................................... SUCCESS [2:54.523s]
[INFO] Maven Javadoc Plugin .................................. SUCCESS [13:00.657s]
[INFO] Maven Linkcheck Plugin ................................ SUCCESS [6.354s]
[INFO] Maven One Plugin ...................................... SUCCESS [8.791s]
[INFO] Maven Patch Plugin .................................... SUCCESS [27.577s]
[INFO] Maven PDF Plugin ...................................... SUCCESS [53.623s]
[INFO] Maven PMD Plugin ...................................... SUCCESS [1:21.968s]
[INFO] Maven RAR Plugin ...................................... SUCCESS [16.317s]
[INFO] Maven Reactor Plugin .................................. SUCCESS [9.473s]
[INFO] Maven Repository Plugin ............................... SUCCESS [1:11.760s]
[INFO] Maven Resources Plugin ................................ SUCCESS [1:10.990s]
[INFO] Maven Site Plugin ..................................... SUCCESS [4:34.647s]
[INFO] Maven Source Plugin ................................... SUCCESS [51.583s]
[INFO] Maven Stage Plugin .................................... SUCCESS [5.562s]
[INFO] Maven Toolchains Plugin ............................... SKIPPED (dependency build failed
or was skipped)
[INFO] Maven Verifier Plugin ................................. SUCCESS [14.496s]
[INFO] Maven WAR Plugin ...................................... SUCCESS [2:06.759s]
[INFO] Maven Plugins Aggregator .............................. SUCCESS [1.791s]
[INFO] ------------------------------------------------------------------------
[INFO] Error for project: Maven Checkstyle Plugin (during deploy)
[INFO] ------------------------------------------------------------------------
[INFO] : org.apache.maven.plugin.invoker.InvokerSession@5c1eea
1 build failed.
[INFO] ------------------------------------------------------------------------
[INFO] Trace
org.apache.maven.BuildFailureException: 1 build failed.
	at org.apache.maven.lifecycle.DefaultLifecycleExecutor.executeGoals(DefaultLifecycleExecutor.java:715)
	at org.apache.maven.lifecycle.DefaultLifecycleExecutor.executeGoalWithLifecycle(DefaultLifecycleExecutor.java:556)
	at org.apache.maven.lifecycle.DefaultLifecycleExecutor.executeGoal(DefaultLifecycleExecutor.java:535)
	at org.apache.maven.lifecycle.DefaultLifecycleExecutor.executeGoalAndHandleFailures(DefaultLifecycleExecutor.java:387)
	at org.apache.maven.lifecycle.DefaultLifecycleExecutor.executeTaskSegments(DefaultLifecycleExecutor.java:348)
	at org.apache.maven.lifecycle.DefaultLifecycleExecutor.execute(DefaultLifecycleExecutor.java:180)
	at org.apache.maven.DefaultMaven.doExecute(DefaultMaven.java:328)
	at org.apache.maven.DefaultMaven.execute(DefaultMaven.java:138)
	at org.apache.maven.cli.MavenCli.main(MavenCli.java:362)
	at org.apache.maven.cli.compat.CompatibleMain.main(CompatibleMain.java:60)
	at sun.reflect.NativeMethodAccessorImpl.invoke0(Native Method)
	at sun.reflect.NativeMethodAccessorImpl.invoke(NativeMethodAccessorImpl.java:39)
	at sun.reflect.DelegatingMethodAccessorImpl.invoke(DelegatingMethodAccessorImpl.java:25)
	at java.lang.reflect.Method.invoke(Method.java:585)
	at org.codehaus.classworlds.Launcher.launchEnhanced(Launcher.java:315)
	at org.codehaus.classworlds.Launcher.launch(Launcher.java:255)
	at org.codehaus.classworlds.Launcher.mainWithExitCode(Launcher.java:430)
	at org.codehaus.classworlds.Launcher.main(Launcher.java:375)
Caused by: org.apache.maven.plugin.MojoFailureException: 1 build failed.
	at org.apache.maven.plugin.invoker.InvokerSession.handleFailures(InvokerSession.java:263)
	at org.apache.maven.plugin.invoker.InvokerMojo.processResults(InvokerMojo.java:58)
	at org.apache.maven.plugin.invoker.AbstractInvokerMojo.execute(AbstractInvokerMojo.java:620)
	at org.apache.maven.plugin.DefaultPluginManager.executeMojo(DefaultPluginManager.java:490)
	at org.apache.maven.lifecycle.DefaultLifecycleExecutor.executeGoals(DefaultLifecycleExecutor.java:694)
	... 17 more
[INFO] ------------------------------------------------------------------------
[INFO] BUILD ERRORS
[INFO] ------------------------------------------------------------------------
[INFO] Total time: 80 minutes 29 seconds
[INFO] Finished at: Thu Jun 03 01:24:51 GMT-06:00 2010
[INFO] Final Memory: 60M/131M
[INFO] ------------------------------------------------------------------------
Failed to send e-mail to dkulp because no e-mail address is known, and no default e-mail domain
is configured


Mime
View raw message