maven-notifications mailing list archives

Site index · List index
Message view « Date » · « Thread »
Top « Date » · « Thread »
From Hudson <Hud...@sonatype.org>
Subject Build failed in Hudson: maven-plugins-ITs » 1.5,windows #458
Date Wed, 09 Jun 2010 06:05:48 GMT
See <http://grid.sonatype.org/ci/job/maven-plugins-ITs/./jdk=1.5,label=windows/458/changes>

Changes:

[Olivier Lamy] [MPMD-122] Add @threadSafe support for maven3

------------------------------------------
Started by upstream project "maven-plugins-ITs" build number 458
Building remotely on vista2
Updating http://svn.apache.org/repos/asf/maven/plugins/trunk
U         maven-pmd-plugin\src\test\java\org\apache\maven\plugin\pmd\stubs\InvalidFormatMavenProjectStub.java
U         maven-pmd-plugin\src\test\java\org\apache\maven\plugin\pmd\CpdReportTest.java
U         maven-pmd-plugin\src\test\java\org\apache\maven\plugin\pmd\PmdReportTest.java
U         maven-pmd-plugin\src\main\java\org\apache\maven\plugin\pmd\AbstractPmdReport.java
U         maven-pmd-plugin\src\main\java\org\apache\maven\plugin\pmd\CpdReport.java
U         maven-pmd-plugin\src\main\java\org\apache\maven\plugin\pmd\PmdReport.java
U         maven-pmd-plugin\src\main\java\org\apache\maven\plugin\pmd\CpdViolationCheckMojo.java
U         maven-pmd-plugin\pom.xml
At revision 952908
[trunk] $ \opt\maven\apache-maven-2.2.1\bin\mvn.bat -Dlabel=windows -Djdk=1.5 clean deploy
-B -U -e -V -fae -Prun-its
+ Error stacktraces are turned on.
Apache Maven 2.2.1 (r801777; 2009-08-06 12:16:01-0700)
Java version: 1.5.0_17
Java home: C:\opt\java\sdk\1.5\jre
Default locale: en_US, platform encoding: Cp1252
OS name: "windows vista" version: "6.0" arch: "x86" Family: "windows"
[INFO] Scanning for projects...
Downloading: http://repository.sonatype.org:8081/content/groups/sonatype-public-grid/org/apache/maven/maven-parent/16/maven-parent-16.pom
[WARNING] Unable to get resource 'org.apache.maven:maven-parent:pom:16' from repository central
(http://Nexus): Error transferring file: Connection refused: connect
Downloading: http://repository.sonatype.org:8081/content/groups/sonatype-public-grid/org/apache/maven/maven-parent/16/maven-parent-16.pom
[WARNING] Unable to get resource 'org.apache.maven:maven-parent:pom:16' from repository central
(http://repo1.maven.org/maven2): Error transferring file: Connection refused: connect
[INFO] ------------------------------------------------------------------------
[ERROR] FATAL ERROR
[INFO] ------------------------------------------------------------------------
[INFO] Failed to resolve artifact.

GroupId: org.apache.maven
ArtifactId: maven-parent
Version: 16

Reason: Unable to download the artifact from any repository

  org.apache.maven:maven-parent:pom:16

from the specified remote repositories:
  Nexus (http://repository.sonatype.org:8081/content/groups/sonatype-public-grid)



[INFO] ------------------------------------------------------------------------
[INFO] Trace
org.apache.maven.reactor.MavenExecutionException: Cannot find parent: org.apache.maven:maven-parent
for project: org.apache.maven.plugins:maven-plugins-aggregator:pom:1-SNAPSHOT for project
org.apache.maven.plugins:maven-plugins-aggregator:pom:1-SNAPSHOT
	at org.apache.maven.DefaultMaven.getProjects(DefaultMaven.java:404)
	at org.apache.maven.DefaultMaven.doExecute(DefaultMaven.java:272)
	at org.apache.maven.DefaultMaven.execute(DefaultMaven.java:138)
	at org.apache.maven.cli.MavenCli.main(MavenCli.java:362)
	at org.apache.maven.cli.compat.CompatibleMain.main(CompatibleMain.java:60)
	at sun.reflect.NativeMethodAccessorImpl.invoke0(Native Method)
	at sun.reflect.NativeMethodAccessorImpl.invoke(NativeMethodAccessorImpl.java:39)
	at sun.reflect.DelegatingMethodAccessorImpl.invoke(DelegatingMethodAccessorImpl.java:25)
	at java.lang.reflect.Method.invoke(Method.java:585)
	at org.codehaus.classworlds.Launcher.launchEnhanced(Launcher.java:315)
	at org.codehaus.classworlds.Launcher.launch(Launcher.java:255)
	at org.codehaus.classworlds.Launcher.mainWithExitCode(Launcher.java:430)
	at org.codehaus.classworlds.Launcher.main(Launcher.java:375)
Caused by: org.apache.maven.project.ProjectBuildingException: Cannot find parent: org.apache.maven:maven-parent
for project: org.apache.maven.plugins:maven-plugins-aggregator:pom:1-SNAPSHOT for project
org.apache.maven.plugins:maven-plugins-aggregator:pom:1-SNAPSHOT
	at org.apache.maven.project.DefaultMavenProjectBuilder.assembleLineage(DefaultMavenProjectBuilder.java:1396)
	at org.apache.maven.project.DefaultMavenProjectBuilder.buildInternal(DefaultMavenProjectBuilder.java:823)
	at org.apache.maven.project.DefaultMavenProjectBuilder.buildFromSourceFileInternal(DefaultMavenProjectBuilder.java:508)
	at org.apache.maven.project.DefaultMavenProjectBuilder.build(DefaultMavenProjectBuilder.java:200)
	at org.apache.maven.DefaultMaven.getProject(DefaultMaven.java:604)
	at org.apache.maven.DefaultMaven.collectProjects(DefaultMaven.java:487)
	at org.apache.maven.DefaultMaven.getProjects(DefaultMaven.java:391)
	... 12 more
Caused by: org.apache.maven.project.ProjectBuildingException: POM 'org.apache.maven:maven-parent'
not found in repository: Unable to download the artifact from any repository

  org.apache.maven:maven-parent:pom:16

from the specified remote repositories:
  Nexus (http://repository.sonatype.org:8081/content/groups/sonatype-public-grid)

 for project org.apache.maven:maven-parent
	at org.apache.maven.project.DefaultMavenProjectBuilder.findModelFromRepository(DefaultMavenProjectBuilder.java:605)
	at org.apache.maven.project.DefaultMavenProjectBuilder.assembleLineage(DefaultMavenProjectBuilder.java:1392)
	... 18 more
Caused by: org.apache.maven.artifact.resolver.ArtifactNotFoundException: Unable to download
the artifact from any repository

  org.apache.maven:maven-parent:pom:16

from the specified remote repositories:
  Nexus (http://repository.sonatype.org:8081/content/groups/sonatype-public-grid)


	at org.apache.maven.artifact.resolver.DefaultArtifactResolver.resolve(DefaultArtifactResolver.java:228)
	at org.apache.maven.artifact.resolver.DefaultArtifactResolver.resolve(DefaultArtifactResolver.java:90)
	at org.apache.maven.project.DefaultMavenProjectBuilder.findModelFromRepository(DefaultMavenProjectBuilder.java:558)
	... 19 more
Caused by: org.apache.maven.wagon.ResourceDoesNotExistException: Unable to download the artifact
from any repository
	at org.apache.maven.artifact.manager.DefaultWagonManager.getArtifact(DefaultWagonManager.java:404)
	at org.apache.maven.artifact.resolver.DefaultArtifactResolver.resolve(DefaultArtifactResolver.java:216)
	... 21 more
[INFO] ------------------------------------------------------------------------
[INFO] Total time: 2 seconds
[INFO] Finished at: Tue Jun 08 23:05:48 PDT 2010
[INFO] Final Memory: 1M/2M
[INFO] ------------------------------------------------------------------------


Mime
View raw message