maven-notifications mailing list archives

Site index · List index
Message view « Date » · « Thread »
Top « Date » · « Thread »
From Hudson <Hud...@sonatype.org>
Subject Build failed in Hudson: maven-3.0.x-ITs » 1.5,ubuntu #310
Date Tue, 03 Aug 2010 08:33:05 GMT
See <http://grid.sonatype.org/ci/job/maven-3.0.x-ITs/./jdk=1.5,label=ubuntu/310/changes>

Changes:

[Kristian Rosenvold] o Disabled IT while working some more on it

[Benjamin Bentmann] o Restored accidentially deleted config

[Benjamin Bentmann] o Made ITs use global settings for common setup

[Benjamin Bentmann] o Fixed version range

[Benjamin Bentmann] o Fixed parent

[Benjamin Bentmann] o Adjusted setup

[Kristian Rosenvold] [MNG-4633] Test

Tests Robert Munteanu's problem description from the issue, but unfortunately only demonstrates
that the
ThreadLockedArtifact works as it should.

[Benjamin Bentmann] o Stabilized IT for embedded execution

[Benjamin Bentmann] o Deleted broken IT that is now superseded by IT for MNG-4745

[Benjamin Bentmann] [MNG-4745] [regression] Maven does not check for plugin updates, even
if forced via -U

o Added IT

------------------------------------------
[...truncated 1174 lines...]
mng2690MojoLoadingErrors(MojoRequirementComponentLookupException)..OK (0.5 s)
mng2668UsePluginDependenciesForSorting(itMNG2668)...........OK (0.5 s)
mng2605BogusProfileActivation(itMNG2605)....................OK (0.6 s)
mng2591MergeInheritedPluginConfig(itNoProfile)..............OK (0.5 s)
mng2591MergeInheritedPluginConfig(itWithProfile)............OK (0.5 s)
mng2577SettingsXmlInterpolation(itEnvVars)..................OK (8.4 s)
mng2577SettingsXmlInterpolation(itSystemProps)..............OK (1.6 s)
mng2576MakeLikeReactor(itMakeOnlyList)......................OK (0.6 s)
mng2576MakeLikeReactor(itMakeUpstream)......................OK (0.5 s)
mng2576MakeLikeReactor(itMakeDownstream)....................OK (0.5 s)
mng2576MakeLikeReactor(itMakeBoth)..........................OK (0.6 s)
mng2576MakeLikeReactor(itMatchesByBasedir)..................OK (0.6 s)
mng2576MakeLikeReactor(itMatchesById).......................OK (0.5 s)
mng2576MakeLikeReactor(itMatchesByArtifactId)...............OK (0.5 s)
mng2576MakeLikeReactor(itResumeFrom)........................OK (0.5 s)
mng2562Timestamp(itDefaultFormat)...........................OK (0.5 s)
mng2562Timestamp(itCustomFormat)............................OK (0.5 s)
mng2562Timestamp(itSameValueAcrossModules)..................OK (0.5 s)
mng2539PluginDependenciesComeFromPluginRepos(itMNG2539).....SKIPPED - version 3.0-SNAPSHOT
not in range (2.0.4,3.0-alpha-3)
mng2486TimestampedDependencyVersionInterpolation(it)........OK (2.2 s)
mng2432PluginPrefixOrder(itMNG2432).........................OK (0.5 s)
mng2387InactiveProxy(it)....................................OK (0.7 s)
mng2363BasedirAwareFileActivator(it)........................OK (0.5 s)
mng2362DeployedPomEncoding(it)..............................OK (0.6 s)
mng2339BadProjectInterpolation(itMNG2339a)..................OK (0.5 s)
mng2339BadProjectInterpolation(itMNG2339b)..................OK (1.2 s)
mng2318LocalParentResolution(itMNG2318).....................OK (0.5 s)
mng2309ProfileInjectionOrder(itMNG2309).....................OK (0.5 s)
mng2305MultipleProxies(it)..................................OK (11.6 s)
mng2293CustomPluginParamImpl(itMNG2293).....................OK (1.5 s)
mng2277AggregatorAndResolutionPlugins(itMNG2277)............OK (0.6 s)
mng2276ProfileActivationBySettingsProperty(itActivation)....OK (0.5 s)
mng2276ProfileActivationBySettingsProperty(itCliWins).......OK (0.5 s)
mng2254PomEncoding(itMNG2254)...............................OK (0.6 s)
mng2234ActiveProfilesFromSettings(itMNG2234)................OK (0.5 s)
mng2228ComponentInjection(itMNG2228)........................OK (0.7 s)
mng2222OutputDirectoryReactorResolution(it).................OK (0.5 s)
mng2201PluginConfigInterpolation(itMNG2201).................OK (0.5 s)
mng2196ParentResolution(itMNG2196)..........................OK (0.3 s)
mng2174PluginDepsManagedByParentProfile(itMNG2174)..........OK (0.6 s)
mng2140ReactorAwareDepResolutionWhenFork(it)................OK (0.5 s)
mng2136ActiveByDefaultProfile(itMNG2136)....................OK (0.5 s)
mng2135PluginBuildInReactor(it).............................OK (2.7 s)
mng2130ParentLookupFromReactorCache(itMNG2130)..............OK (0.5 s)
mng2124PomInterpolationWithParentValues(itMNG2124)..........OK (0.5 s)
mng2123VersionRangeDependency(itMNG2123)....................OK (0.7 s)
mng2103PluginExecutionInheritance(it).......................OK (0.5 s)
mng2098VersionRangeSatisfiedFromWrongRepo(it)...............OK (0.6 s)
mng2068ReactorRelativeParents(itInheritedIdFields)..........OK (0.5 s)
mng2068ReactorRelativeParents(itExplicitIdFields)...........OK (0.5 s)
mng2068ReactorRelativeParents(itComplex)....................OK (0.5 s)
mng2054PluginExecutionInheritance(itMNG2054)................OK (0.5 s)
mng2052InterpolateWithSettingsProfileProperties(itMNG2052)..OK (0.5 s)
mng2045testJarDependenciesBrokenInReactor(itMNG2045)........OK (0.5 s)
mng2006ChildPathAwareUrlInheritance(itMNG2006)..............OK (0.6 s)
mng1999DefaultReportsInheritance(itInheritSuppression)......SKIPPED - version 3.0-SNAPSHOT
not in range (2.0.9,2.1.0-M1),(2.1.0-M1,3.0-alpha-1)
mng1999DefaultReportsInheritance(itOverrideSuppression).....SKIPPED - version 3.0-SNAPSHOT
not in range (2.0.9,2.1.0-M1),(2.1.0-M1,3.0-alpha-1)
mng1995InterpolateBooleanModelElements(itMNG1995)...........OK (0.5 s)
mng1992SystemPropOverridesPomProp(itMNG1992)................OK (0.5 s)
mng1957JdkActivationWithVersionRange(itMNG1957).............OK (0.5 s)
mng1908LegacySnapshotUpdate(itMNG1908)......................SKIPPED - version 3.0-SNAPSHOT
not in range [2.0,3.0-alpha-3)
mng1895ScopeConflictResolution(it)..........................OK (7.8 s)
mng1830ShowVersion(Version).................................OK (0.5 s)
mng1803PomValidationErrorIncludesLineNumber(it).............OK (0.0 s)
mng1751ForcedMetadataUpdateDuringDeployment(it).............OK (1.1 s)
mng1703PluginMgmtDepInheritance(itMNG1703)..................OK (0.7 s)
mng1701DuplicatePlugin(it)..................................OK (0.5 s)
mng1493NonStandardModulePomNames(itMNG1493).................OK (0.5 s)
mng1491ReactorArtifactIdCollision(itMNG1491)................OK (0.0 s)
mng1415QuotedSystemProperties(itMNG1415)....................OK (0.5 s)
mng1412DependenciesOrder(itMNG1412).........................OK (10.2 s)
mng1349ChecksumFormats(itMNG1349)...........................OK (16.5 s)
mng1323AntrunDependencies(itMNG1323)........................OK (0.7 s)
mng1233WarDepWithProvidedScope(itMNG1233)...................OK (8.1 s)
mng1144MultipleDefaultGoals(it).............................OK (0.7 s)
mng1088ReactorPluginResolution(itMNG1088)...................OK (1.0 s)
mng1073AggregatorForksReactor(itForkLifecycle)..............OK (0.6 s)
mng1073AggregatorForksReactor(itForkGoal)...................OK (0.5 s)
mng1052PluginMngtConfig(itMNG1052)..........................OK (0.6 s)
mng1021EqualAttachmentBuildNumber(itMNG1021)................OK (0.6 s)
mng0985NonExecutedPluginMngtGoals(itMNG0985)................OK (0.6 s)
mng0956ComponentInjectionViaProjectLevelPluginDep(itMNG0956)..OK (0.7 s)
mng0947OptionalDependency(it)...............................OK (6.6 s)
mng0870ReactorAwarePluginDiscovery(itMNG0870)...............OK (0.6 s)
mng0866EvaluateDefaultValue(itMNG866).......................OK (0.5 s)
mng0848SystemPropOverridesDefaultValue(itMNG848)............OK (0.5 s)
mng0836PluginParentResolution(itMNG836).....................OK (3.1 s)
mng0823MojoContextPassing(itMNG0823)........................OK (0.6 s)
mng0820ConflictResolution(itMNG0820)........................OK (12.1 s)
mng0818WarDepsNotTransitive(itMNG0818)......................OK (1.3 s)
mng0814ExplicitProfileActivation(itMNG814)..................OK (0.6 s)
mng0786ProfileAwareReactor(itMNG0786).......................OK (0.6 s)
mng0781PluginConfigVsExecConfig(itMNG0781)..................OK (0.5 s)
mng0773SettingsProfileReactorPollution(itMNG773)............OK (0.5 s)
mng0768OfflineMode(itMNG768)................................OK (3.5 s)
mng0761MissingSnapshotDistRepo(itMNG761)....................OK (0.6 s)
mng0731LegacyRepoLayout(itMNG731)...........................SKIPPED - version 3.0-SNAPSHOT
not in range [2.0,3.0-alpha-3)
mng0680ParentBasedir(itMNG680)..............................OK (0.6 s)
mng0674PluginParameterAlias(itLifecycle)....................OK (0.5 s)
mng0674PluginParameterAlias(itCli)..........................OK (0.5 s)
mng0666IgnoreLegacyPom(itMNG666)............................OK (4.7 s)
mng0557UserSettingsCliOption(itMNG557)......................OK (0.5 s)
mng0553SettingsAuthzEncryption(itBasic).....................OK (13.4 s)
mng0553SettingsAuthzEncryption(itRelocation)................OK (4.4 s)
mng0553SettingsAuthzEncryption(itEncryption)................OK (8.2 s)
mng0522InheritedPluginMgmtConfig(itMNG522)..................OK (0.7 s)
mng0507ArtifactRelocation(itMNG507).........................OK (3.7 s)
mng0505VersionRange(itMNG505)...............................OK (0.8 s)
mng0496IgnoreUnknownPluginParameters(itMNG496)..............OK (0.6 s)
mng0479OverrideCentralRepo(itMNG479)........................OK (1.0 s)
mng0471CustomLifecycle(itMNG471)............................OK (0.5 s)
mng0469ReportConfig(itReportConfigOverridesBuildDefaults)...SKIPPED - version 3.0-SNAPSHOT
not in range [2.0.0,3.0-alpha-1)
mng0469ReportConfig(itBuildConfigDominantDuringBuild).......OK (0.5 s)
mng0469ReportConfig(itBuildConfigIrrelevantForReports)......OK (0.5 s)
mng0461TolerateMissingDependencyPom(it).....................OK (0.6 s)
mng0449PluginVersionResolution(itLifecycleInvocation).......OK (0.5 s)
mng0449PluginVersionResolution(itCliInvocation).............OK (0.6 s)
mng0377PluginLookupFromPrefix(itMNG377).....................OK (0.6 s)
mng0294MergeGlobalAndUserSettings(itMNG294).................OK (0.5 s)
mng0282NonReactorExecWhenProjectIndependent(itMNG282).......OK (0.7 s)
mng0249ResolveDepsFromReactor(itMNG0249)....................OK (0.6 s)
mng0187CollectedProjects(it)................................OK (0.5 s)
mng0095ReactorFailureBehavior(itFailFast)...................OK (0.5 s)
mng0095ReactorFailureBehavior(itFailNever)..................OK (0.5 s)
mng0095ReactorFailureBehavior(itFailAtEnd)..................OK (0.6 s)
0145ReactorWithIncludesExcludes(itDefaultIncludesExcludes)..SKIPPED - version 3.0-SNAPSHOT
not in range [2.0,3.0-alpha-1)
0145ReactorWithIncludesExcludes(itCustomIncludes)...........SKIPPED - version 3.0-SNAPSHOT
not in range [2.0,3.0-alpha-1)
0145ReactorWithIncludesExcludes(itCustomExcludes)...........SKIPPED - version 3.0-SNAPSHOT
not in range [2.0,3.0-alpha-1)
0144LifecycleExecutionOrder(it0144).........................OK (1.6 s)
0143TransitiveDependencyScopes(itCompileScope)..............OK (0.7 s)
0143TransitiveDependencyScopes(itProvidedScope).............OK (0.6 s)
0143TransitiveDependencyScopes(itRuntimeScope)..............OK (0.6 s)
0143TransitiveDependencyScopes(itTestScope).................OK (0.6 s)
0142DirectDependencyScopes(it0142)..........................OK (15.0 s)
0140InterpolationWithPomPrefix(it0140)......................OK (0.7 s)
0139InterpolationWithProjectPrefix(it0139)..................OK (0.5 s)
0138PluginLifecycle(it0138).................................OK (0.7 s)
0137EarLifecycle(it0137)....................................OK (0.9 s)
0136RarLifecycle(it0136)....................................OK (1.1 s)
0135EjbLifecycle(it0135)....................................OK (1.3 s)
0134WarLifecycle(it0134)....................................OK (1.4 s)
0133JarLifecycle(it0133)....................................OK (0.6 s)
0132PomLifecycle(it0132)....................................OK (0.6 s)
0131SiteLifecycle(it0131)...................................OK (0.5 s)
0130CleanLifecycle(it0130)..................................OK (0.5 s)
0113ServerAuthzAvailableToWagonMgrInPlugin(it0113)..........OK (0.6 s)
0090EnvVarInterpolation(it0090).............................OK (3.4 s)
0087PluginRealmWithProjectLevelDeps(it0087).................OK (0.9 s)
0086PluginRealm(it0086).....................................OK (0.5 s)
0085TransitiveSystemScope(it0085)...........................OK (1.8 s)
0072InterpolationWithDottedProperty(it0072).................OK (0.5 s)
0071PluginConfigWithDottedProperty(it0071)..................OK (0.6 s)
0064MojoConfigViaSetters(it0064)............................OK (0.9 s)
0063SystemScopeDependency(it0063)...........................OK (0.6 s)
0056MultipleGoalExecutions(it0056)..........................OK (0.6 s)
0052ReleaseProfile(it0052)..................................OK (0.6 s)
0051ReleaseProfile(it0051)..................................OK (4.6 s)
0041ArtifactTypeFromPluginExtension(it0041).................OK (2.3 s)
0040PackagingFromPluginExtension(it0040)....................OK (0.6 s)
0039ReleasePomInReactor(it0039).............................SKIPPED - version 3.0-SNAPSHOT
not in range [2.0,3.0-alpha-1)
0038AlternatePomFileDifferentDir(it0038)....................OK (0.6 s)
0037AlternatePomFileSameDir(it0037).........................OK (0.6 s)
0036ReleasePom(it0036)......................................SKIPPED - version 3.0-SNAPSHOT
not in range (2.0,3.0-alpha-1)
0032MavenPrerequisite(it0032)...............................OK (0.6 s)
0030DepPomDepMngtInheritance(it0030)........................OK (4.2 s)
0025MultipleExecutionLevelConfigs(it0025)...................OK (0.7 s)
0024MultipleGoalExecutions(it0024)..........................OK (0.6 s)
0023SettingsProfile(it0023).................................OK (0.5 s)
0021PomProfile(it0021)......................................OK (4.2 s)
0019PluginVersionMngtBySuperPom(it0019).....................OK (0.6 s)
0018DependencyManagement(it0018)............................OK (4.5 s)
0012PomInterpolation(it0012)................................OK (0.7 s)
0011DefaultVersionByDependencyManagement(it0011)............OK (3.7 s)
0010DependencyClosureResolution(it0010).....................OK (9.0 s)
0009GoalConfiguration(it0009)...............................OK (0.6 s)
0008SimplePlugin(it0008)....................................OK (0.6 s)
Tests run: 612, Failures: 2, Errors: 0, Skipped: 0, Time elapsed: 835.45 sec <<<
FAILURE!
testitRepoPolicyAlways(org.apache.maven.it.MavenITmng4745PluginVersionUpdateTest)  Time elapsed:
16.166 sec  <<< FAILURE!
junit.framework.AssertionFailedError: expected:<1.1> but was:<1.0>
	at junit.framework.Assert.fail(Assert.java:47)
	at junit.framework.Assert.failNotEquals(Assert.java:280)
	at junit.framework.Assert.assertEquals(Assert.java:64)
	at junit.framework.Assert.assertEquals(Assert.java:71)
	at org.apache.maven.it.MavenITmng4745PluginVersionUpdateTest.testitRepoPolicyAlways(MavenITmng4745PluginVersionUpdateTest.java:73)

testitForceUpdate(org.apache.maven.it.MavenITmng4745PluginVersionUpdateTest)  Time elapsed:
3.992 sec  <<< FAILURE!
junit.framework.AssertionFailedError: expected:<1.1> but was:<1.0>
	at junit.framework.Assert.fail(Assert.java:47)
	at junit.framework.Assert.failNotEquals(Assert.java:280)
	at junit.framework.Assert.assertEquals(Assert.java:64)
	at junit.framework.Assert.assertEquals(Assert.java:71)
	at org.apache.maven.it.MavenITmng4745PluginVersionUpdateTest.testitForceUpdate(MavenITmng4745PluginVersionUpdateTest.java:140)


Results :

Failed tests: 
  testitRepoPolicyAlways(org.apache.maven.it.MavenITmng4745PluginVersionUpdateTest)
  testitForceUpdate(org.apache.maven.it.MavenITmng4745PluginVersionUpdateTest)

Tests run: 612, Failures: 2, Errors: 0, Skipped: 0

[INFO] ------------------------------------------------------------------------
[INFO] BUILD FAILURE
[INFO] ------------------------------------------------------------------------
[INFO] Total time: 17:48.756s
[INFO] Finished at: Tue Aug 03 02:33:05 GMT-06:00 2010
[INFO] Final Memory: 7M/66M
[INFO] ------------------------------------------------------------------------
[ERROR] Failed to execute goal org.apache.maven.plugins:maven-surefire-plugin:2.4.3:test (default-test)
on project core-it-suite: There are test failures.

Please refer to <http://grid.sonatype.org/ci/job/maven-3.0.x-ITs/./jdk=1.5,label=ubuntu/ws/core-integration-tests/target/surefire-reports>
for the individual test results.
-> [Help 1]
org.apache.maven.lifecycle.LifecycleExecutionException: Failed to execute goal org.apache.maven.plugins:maven-surefire-plugin:2.4.3:test
(default-test) on project core-it-suite: There are test failures.

Please refer to <http://grid.sonatype.org/ci/job/maven-3.0.x-ITs/./jdk=1.5,label=ubuntu/ws/core-integration-tests/target/surefire-reports>
for the individual test results.
	at org.apache.maven.lifecycle.internal.MojoExecutor.execute(MojoExecutor.java:148)
	at org.apache.maven.lifecycle.internal.MojoExecutor.execute(MojoExecutor.java:87)
	at org.apache.maven.lifecycle.internal.MojoExecutor.execute(MojoExecutor.java:79)
	at org.apache.maven.lifecycle.internal.LifecycleModuleBuilder.buildProject(LifecycleModuleBuilder.java:86)
	at org.apache.maven.lifecycle.internal.LifecycleModuleBuilder.buildProject(LifecycleModuleBuilder.java:58)
	at org.apache.maven.lifecycle.internal.LifecycleStarter.singleThreadedBuild(LifecycleStarter.java:183)
	at org.apache.maven.lifecycle.internal.LifecycleStarter.execute(LifecycleStarter.java:161)
	at org.apache.maven.DefaultMaven.doExecute(DefaultMaven.java:252)
	at org.apache.maven.DefaultMaven.execute(DefaultMaven.java:100)
	at org.apache.maven.cli.MavenCli.execute(MavenCli.java:443)
	at org.apache.maven.cli.MavenCli.doMain(MavenCli.java:166)
	at org.apache.maven.cli.MavenCli.main(MavenCli.java:130)
	at sun.reflect.NativeMethodAccessorImpl.invoke0(Native Method)
	at sun.reflect.NativeMethodAccessorImpl.invoke(NativeMethodAccessorImpl.java:39)
	at sun.reflect.DelegatingMethodAccessorImpl.invoke(DelegatingMethodAccessorImpl.java:25)
	at java.lang.reflect.Method.invoke(Method.java:585)
	at org.codehaus.plexus.classworlds.launcher.Launcher.launchEnhanced(Launcher.java:290)
	at org.codehaus.plexus.classworlds.launcher.Launcher.launch(Launcher.java:230)
	at org.codehaus.plexus.classworlds.launcher.Launcher.mainWithExitCode(Launcher.java:409)
	at org.codehaus.plexus.classworlds.launcher.Launcher.main(Launcher.java:352)
Caused by: org.apache.maven.plugin.MojoFailureException: There are test failures.

Please refer to <http://grid.sonatype.org/ci/job/maven-3.0.x-ITs/./jdk=1.5,label=ubuntu/ws/core-integration-tests/target/surefire-reports>
for the individual test results.
	at org.apache.maven.plugin.surefire.SurefirePlugin.execute(SurefirePlugin.java:575)
	at org.apache.maven.plugin.DefaultBuildPluginManager.executeMojo(DefaultBuildPluginManager.java:110)
	at org.apache.maven.lifecycle.internal.MojoExecutor.execute(MojoExecutor.java:144)
	... 19 more
[ERROR] 
[ERROR] Re-run Maven using the -X switch to enable full debug logging.
[ERROR] 
[ERROR] For more information about the errors and possible solutions, please read the following
articles:
[ERROR] [Help 1] http://cwiki.apache.org/confluence/display/MAVEN/MojoFailureException
Emma: looking for coverage reports in the provided path: core-integration-tests/target/site/emma/coverage.xml


Mime
View raw message