maven-notifications mailing list archives

Site index · List index
Message view « Date » · « Thread »
Top « Date » · « Thread »
From Hudson <Hud...@sonatype.org>
Subject Build failed in Hudson: maven-3.0.x-ITs » 1.5,ubuntu #337
Date Mon, 30 Aug 2010 12:50:13 GMT
See <http://grid.sonatype.org/ci/job/maven-3.0.x-ITs/./jdk=1.5,label=ubuntu/337/>

------------------------------------------
[...truncated 711 lines...]
0052ReleaseProfile(it0052)..................................OK (2.0 s)
0051ReleaseProfile(it0051)..................................OK (2.5 s)
0041ArtifactTypeFromPluginExtension(it0041).................OK (4.3 s)
0040PackagingFromPluginExtension(it0040)....................OK (1.7 s)
0039ReleasePomInReactor(it0039).............................SKIPPED - version 3.0-SNAPSHOT
not in range [2.0,3.0-alpha-1)
0038AlternatePomFileDifferentDir(it0038)....................OK (1.5 s)
0037AlternatePomFileSameDir(it0037).........................OK (1.4 s)
0036ReleasePom(it0036)......................................SKIPPED - version 3.0-SNAPSHOT
not in range (2.0,3.0-alpha-1)
0032MavenPrerequisite(it0032)...............................OK (1.6 s)
0030DepPomDepMngtInheritance(it0030)........................OK (19.7 s)
0025MultipleExecutionLevelConfigs(it0025)...................OK (1.9 s)
0024MultipleGoalExecutions(it0024)..........................OK (1.7 s)
0023SettingsProfile(it0023).................................OK (3.4 s)
0021PomProfile(it0021)......................................OK (2.3 s)
0019PluginVersionMngtBySuperPom(it0019).....................OK (5.0 s)
0018DependencyManagement(it0018)............................OK (2.5 s)
0012PomInterpolation(it0012)................................OK (2.2 s)
0011DefaultVersionByDependencyManagement(it0011)............OK (1.9 s)
0010DependencyClosureResolution(it0010).....................OK (2.3 s)
0009GoalConfiguration(it0009)...............................OK (1.9 s)
0008SimplePlugin(it0008)....................................OK (1.8 s)
Tests run: 646, Failures: 0, Errors: 4, Skipped: 0, Time elapsed: 1,411.049 sec <<<
FAILURE!
testit(org.apache.maven.it.MavenITmng4482ForcePluginSnapshotUpdateTest)  Time elapsed: 0.522
sec  <<< ERROR!
org.apache.maven.it.VerificationException: Exit code was non-zero: 1; command line and log
= 
<http://grid.sonatype.org/ci/job/maven-3.0.x-ITs/./jdk=1.5,label=ubuntu/ws/core-integration-tests/target/distro/bin/mvn>
--global-settings <http://grid.sonatype.org/ci/job/maven-3.0.x-ITs/./jdk=1.5,label=ubuntu/ws/core-integration-tests/target/test-classes/settings.xml>
-s settings.xml -e --batch-mode -Dmaven.repo.local=/opt/repos/local-repository validate
EMMA: collecting runtime coverage data ...
java.net.BindException: Address already in use
	at java.net.PlainSocketImpl.socketBind(Native Method)
	at java.net.PlainSocketImpl.bind(PlainSocketImpl.java:359)
	at java.net.ServerSocket.bind(ServerSocket.java:319)
	at java.net.ServerSocket.<init>(ServerSocket.java:185)
	at java.net.ServerSocket.<init>(ServerSocket.java:97)
	at com.vladium.emma.rt.RTController.start(RTController.java:99)
	at com.vladium.emma.rt.RT.reset(RT.java:222)
	at com.vladium.emma.rt.RT.<clinit>(RT.java:540)
	at org.apache.maven.cli.MavenCli.$VRi(MavenCli.java)
	at org.apache.maven.cli.MavenCli.<clinit>(MavenCli.java)
	at sun.reflect.NativeMethodAccessorImpl.invoke0(Native Method)
	at sun.reflect.NativeMethodAccessorImpl.invoke(NativeMethodAccessorImpl.java:39)
	at sun.reflect.DelegatingMethodAccessorImpl.invoke(DelegatingMethodAccessorImpl.java:25)
	at java.lang.reflect.Method.invoke(Method.java:585)
	at org.codehaus.plexus.classworlds.launcher.Launcher.launchEnhanced(Launcher.java:290)
	at org.codehaus.plexus.classworlds.launcher.Launcher.launch(Launcher.java:230)
	at org.codehaus.plexus.classworlds.launcher.Launcher.mainWithExitCode(Launcher.java:409)
	at org.codehaus.plexus.classworlds.launcher.Launcher.main(Launcher.java:352)
Exception in thread "main" java.lang.Error: EMMA: runtime controller could not be started,
aborting
	at com.vladium.emma.rt.RT.reset(RT.java:233)
	at com.vladium.emma.rt.RT.<clinit>(RT.java:540)
	at org.apache.maven.cli.MavenCli.$VRi(MavenCli.java)
	at org.apache.maven.cli.MavenCli.<clinit>(MavenCli.java)
	at sun.reflect.NativeMethodAccessorImpl.invoke0(Native Method)
	at sun.reflect.NativeMethodAccessorImpl.invoke(NativeMethodAccessorImpl.java:39)
	at sun.reflect.DelegatingMethodAccessorImpl.invoke(DelegatingMethodAccessorImpl.java:25)
	at java.lang.reflect.Method.invoke(Method.java:585)
	at org.codehaus.plexus.classworlds.launcher.Launcher.launchEnhanced(Launcher.java:290)
	at org.codehaus.plexus.classworlds.launcher.Launcher.launch(Launcher.java:230)
	at org.codehaus.plexus.classworlds.launcher.Launcher.mainWithExitCode(Launcher.java:409)
	at org.codehaus.plexus.classworlds.launcher.Launcher.main(Launcher.java:352)
	at org.apache.maven.it.Verifier.executeGoals(Verifier.java:1348)
	at org.apache.maven.it.Verifier.executeGoal(Verifier.java:1191)
	at org.apache.maven.it.Verifier.executeGoal(Verifier.java:1185)
	at org.apache.maven.it.MavenITmng4482ForcePluginSnapshotUpdateTest.testit(MavenITmng4482ForcePluginSnapshotUpdateTest.java:68)

testitHttpToHttp(org.apache.maven.it.MavenITmng4428FollowHttpRedirectTest)  Time elapsed:
0.66 sec  <<< ERROR!
org.apache.maven.it.VerificationException: Exit code was non-zero: 1; command line and log
= 
<http://grid.sonatype.org/ci/job/maven-3.0.x-ITs/./jdk=1.5,label=ubuntu/ws/core-integration-tests/target/distro/bin/mvn>
--global-settings <http://grid.sonatype.org/ci/job/maven-3.0.x-ITs/./jdk=1.5,label=ubuntu/ws/core-integration-tests/target/test-classes/settings.xml>
-X --settings settings.xml -e --batch-mode -Djavax.net.ssl.trustStorePassword=store-passwd
-Djavax.net.ssl.trustStore=<http://grid.sonatype.org/ci/job/maven-3.0.x-ITs/./jdk=1.5,label=ubuntu/ws/core-integration-tests/target/test-classes/mng-4428/keystore>
-Dmaven.repo.local=/opt/repos/local-repository validate
EMMA: collecting runtime coverage data ...
java.net.BindException: Address already in use
	at java.net.PlainSocketImpl.socketBind(Native Method)
	at java.net.PlainSocketImpl.bind(PlainSocketImpl.java:359)
	at java.net.ServerSocket.bind(ServerSocket.java:319)
	at java.net.ServerSocket.<init>(ServerSocket.java:185)
	at java.net.ServerSocket.<init>(ServerSocket.java:97)
	at com.vladium.emma.rt.RTController.start(RTController.java:99)
	at com.vladium.emma.rt.RT.reset(RT.java:222)
	at com.vladium.emma.rt.RT.<clinit>(RT.java:540)
	at org.apache.maven.cli.MavenCli.$VRi(MavenCli.java)
	at org.apache.maven.cli.MavenCli.<clinit>(MavenCli.java)
	at sun.reflect.NativeMethodAccessorImpl.invoke0(Native Method)
	at sun.reflect.NativeMethodAccessorImpl.invoke(NativeMethodAccessorImpl.java:39)
	at sun.reflect.DelegatingMethodAccessorImpl.invoke(DelegatingMethodAccessorImpl.java:25)
	at java.lang.reflect.Method.invoke(Method.java:585)
	at org.codehaus.plexus.classworlds.launcher.Launcher.launchEnhanced(Launcher.java:290)
	at org.codehaus.plexus.classworlds.launcher.Launcher.launch(Launcher.java:230)
	at org.codehaus.plexus.classworlds.launcher.Launcher.mainWithExitCode(Launcher.java:409)
	at org.codehaus.plexus.classworlds.launcher.Launcher.main(Launcher.java:352)
Exception in thread "main" java.lang.Error: EMMA: runtime controller could not be started,
aborting
	at com.vladium.emma.rt.RT.reset(RT.java:233)
	at com.vladium.emma.rt.RT.<clinit>(RT.java:540)
	at org.apache.maven.cli.MavenCli.$VRi(MavenCli.java)
	at org.apache.maven.cli.MavenCli.<clinit>(MavenCli.java)
	at sun.reflect.NativeMethodAccessorImpl.invoke0(Native Method)
	at sun.reflect.NativeMethodAccessorImpl.invoke(NativeMethodAccessorImpl.java:39)
	at sun.reflect.DelegatingMethodAccessorImpl.invoke(DelegatingMethodAccessorImpl.java:25)
	at java.lang.reflect.Method.invoke(Method.java:585)
	at org.codehaus.plexus.classworlds.launcher.Launcher.launchEnhanced(Launcher.java:290)
	at org.codehaus.plexus.classworlds.launcher.Launcher.launch(Launcher.java:230)
	at org.codehaus.plexus.classworlds.launcher.Launcher.mainWithExitCode(Launcher.java:409)
	at org.codehaus.plexus.classworlds.launcher.Launcher.main(Launcher.java:352)
	at org.apache.maven.it.Verifier.executeGoals(Verifier.java:1348)
	at org.apache.maven.it.Verifier.executeGoal(Verifier.java:1191)
	at org.apache.maven.it.Verifier.executeGoal(Verifier.java:1185)
	at org.apache.maven.it.MavenITmng4428FollowHttpRedirectTest.testit(MavenITmng4428FollowHttpRedirectTest.java:149)
	at org.apache.maven.it.MavenITmng4428FollowHttpRedirectTest.testit(MavenITmng4428FollowHttpRedirectTest.java:109)
	at org.apache.maven.it.MavenITmng4428FollowHttpRedirectTest.testitHttpToHttp(MavenITmng4428FollowHttpRedirectTest.java:62)

testitHttpsToHttps(org.apache.maven.it.MavenITmng4428FollowHttpRedirectTest)  Time elapsed:
0.483 sec  <<< ERROR!
org.apache.maven.it.VerificationException: Exit code was non-zero: 1; command line and log
= 
<http://grid.sonatype.org/ci/job/maven-3.0.x-ITs/./jdk=1.5,label=ubuntu/ws/core-integration-tests/target/distro/bin/mvn>
--global-settings <http://grid.sonatype.org/ci/job/maven-3.0.x-ITs/./jdk=1.5,label=ubuntu/ws/core-integration-tests/target/test-classes/settings.xml>
-X --settings settings.xml -e --batch-mode -Djavax.net.ssl.trustStorePassword=store-passwd
-Djavax.net.ssl.trustStore=<http://grid.sonatype.org/ci/job/maven-3.0.x-ITs/./jdk=1.5,label=ubuntu/ws/core-integration-tests/target/test-classes/mng-4428/keystore>
-Dmaven.repo.local=/opt/repos/local-repository validate
EMMA: collecting runtime coverage data ...
java.net.BindException: Address already in use
	at java.net.PlainSocketImpl.socketBind(Native Method)
	at java.net.PlainSocketImpl.bind(PlainSocketImpl.java:359)
	at java.net.ServerSocket.bind(ServerSocket.java:319)
	at java.net.ServerSocket.<init>(ServerSocket.java:185)
	at java.net.ServerSocket.<init>(ServerSocket.java:97)
	at com.vladium.emma.rt.RTController.start(RTController.java:99)
	at com.vladium.emma.rt.RT.reset(RT.java:222)
	at com.vladium.emma.rt.RT.<clinit>(RT.java:540)
	at org.apache.maven.cli.MavenCli.$VRi(MavenCli.java)
	at org.apache.maven.cli.MavenCli.<clinit>(MavenCli.java)
	at sun.reflect.NativeMethodAccessorImpl.invoke0(Native Method)
	at sun.reflect.NativeMethodAccessorImpl.invoke(NativeMethodAccessorImpl.java:39)
	at sun.reflect.DelegatingMethodAccessorImpl.invoke(DelegatingMethodAccessorImpl.java:25)
	at java.lang.reflect.Method.invoke(Method.java:585)
	at org.codehaus.plexus.classworlds.launcher.Launcher.launchEnhanced(Launcher.java:290)
	at org.codehaus.plexus.classworlds.launcher.Launcher.launch(Launcher.java:230)
	at org.codehaus.plexus.classworlds.launcher.Launcher.mainWithExitCode(Launcher.java:409)
	at org.codehaus.plexus.classworlds.launcher.Launcher.main(Launcher.java:352)
Exception in thread "main" java.lang.Error: EMMA: runtime controller could not be started,
aborting
	at com.vladium.emma.rt.RT.reset(RT.java:233)
	at com.vladium.emma.rt.RT.<clinit>(RT.java:540)
	at org.apache.maven.cli.MavenCli.$VRi(MavenCli.java)
	at org.apache.maven.cli.MavenCli.<clinit>(MavenCli.java)
	at sun.reflect.NativeMethodAccessorImpl.invoke0(Native Method)
	at sun.reflect.NativeMethodAccessorImpl.invoke(NativeMethodAccessorImpl.java:39)
	at sun.reflect.DelegatingMethodAccessorImpl.invoke(DelegatingMethodAccessorImpl.java:25)
	at java.lang.reflect.Method.invoke(Method.java:585)
	at org.codehaus.plexus.classworlds.launcher.Launcher.launchEnhanced(Launcher.java:290)
	at org.codehaus.plexus.classworlds.launcher.Launcher.launch(Launcher.java:230)
	at org.codehaus.plexus.classworlds.launcher.Launcher.mainWithExitCode(Launcher.java:409)
	at org.codehaus.plexus.classworlds.launcher.Launcher.main(Launcher.java:352)
	at org.apache.maven.it.Verifier.executeGoals(Verifier.java:1348)
	at org.apache.maven.it.Verifier.executeGoal(Verifier.java:1191)
	at org.apache.maven.it.Verifier.executeGoal(Verifier.java:1185)
	at org.apache.maven.it.MavenITmng4428FollowHttpRedirectTest.testit(MavenITmng4428FollowHttpRedirectTest.java:149)
	at org.apache.maven.it.MavenITmng4428FollowHttpRedirectTest.testit(MavenITmng4428FollowHttpRedirectTest.java:109)
	at org.apache.maven.it.MavenITmng4428FollowHttpRedirectTest.testitHttpsToHttps(MavenITmng4428FollowHttpRedirectTest.java:71)

testitRelativeLocation(org.apache.maven.it.MavenITmng4428FollowHttpRedirectTest)  Time elapsed:
0.383 sec  <<< ERROR!
org.apache.maven.it.VerificationException: Exit code was non-zero: 1; command line and log
= 
<http://grid.sonatype.org/ci/job/maven-3.0.x-ITs/./jdk=1.5,label=ubuntu/ws/core-integration-tests/target/distro/bin/mvn>
--global-settings <http://grid.sonatype.org/ci/job/maven-3.0.x-ITs/./jdk=1.5,label=ubuntu/ws/core-integration-tests/target/test-classes/settings.xml>
-X --settings settings.xml -e --batch-mode -Djavax.net.ssl.trustStorePassword=store-passwd
-Djavax.net.ssl.trustStore=<http://grid.sonatype.org/ci/job/maven-3.0.x-ITs/./jdk=1.5,label=ubuntu/ws/core-integration-tests/target/test-classes/mng-4428/keystore>
-Dmaven.repo.local=/opt/repos/local-repository validate
EMMA: collecting runtime coverage data ...
java.net.BindException: Address already in use
	at java.net.PlainSocketImpl.socketBind(Native Method)
	at java.net.PlainSocketImpl.bind(PlainSocketImpl.java:359)
	at java.net.ServerSocket.bind(ServerSocket.java:319)
	at java.net.ServerSocket.<init>(ServerSocket.java:185)
	at java.net.ServerSocket.<init>(ServerSocket.java:97)
	at com.vladium.emma.rt.RTController.start(RTController.java:99)
	at com.vladium.emma.rt.RT.reset(RT.java:222)
	at com.vladium.emma.rt.RT.<clinit>(RT.java:540)
	at org.apache.maven.cli.MavenCli.$VRi(MavenCli.java)
	at org.apache.maven.cli.MavenCli.<clinit>(MavenCli.java)
	at sun.reflect.NativeMethodAccessorImpl.invoke0(Native Method)
	at sun.reflect.NativeMethodAccessorImpl.invoke(NativeMethodAccessorImpl.java:39)
	at sun.reflect.DelegatingMethodAccessorImpl.invoke(DelegatingMethodAccessorImpl.java:25)
	at java.lang.reflect.Method.invoke(Method.java:585)
	at org.codehaus.plexus.classworlds.launcher.Launcher.launchEnhanced(Launcher.java:290)
	at org.codehaus.plexus.classworlds.launcher.Launcher.launch(Launcher.java:230)
	at org.codehaus.plexus.classworlds.launcher.Launcher.mainWithExitCode(Launcher.java:409)
	at org.codehaus.plexus.classworlds.launcher.Launcher.main(Launcher.java:352)
Exception in thread "main" java.lang.Error: EMMA: runtime controller could not be started,
aborting
	at com.vladium.emma.rt.RT.reset(RT.java:233)
	at com.vladium.emma.rt.RT.<clinit>(RT.java:540)
	at org.apache.maven.cli.MavenCli.$VRi(MavenCli.java)
	at org.apache.maven.cli.MavenCli.<clinit>(MavenCli.java)
	at sun.reflect.NativeMethodAccessorImpl.invoke0(Native Method)
	at sun.reflect.NativeMethodAccessorImpl.invoke(NativeMethodAccessorImpl.java:39)
	at sun.reflect.DelegatingMethodAccessorImpl.invoke(DelegatingMethodAccessorImpl.java:25)
	at java.lang.reflect.Method.invoke(Method.java:585)
	at org.codehaus.plexus.classworlds.launcher.Launcher.launchEnhanced(Launcher.java:290)
	at org.codehaus.plexus.classworlds.launcher.Launcher.launch(Launcher.java:230)
	at org.codehaus.plexus.classworlds.launcher.Launcher.mainWithExitCode(Launcher.java:409)
	at org.codehaus.plexus.classworlds.launcher.Launcher.main(Launcher.java:352)
	at org.apache.maven.it.Verifier.executeGoals(Verifier.java:1348)
	at org.apache.maven.it.Verifier.executeGoal(Verifier.java:1191)
	at org.apache.maven.it.Verifier.executeGoal(Verifier.java:1185)
	at org.apache.maven.it.MavenITmng4428FollowHttpRedirectTest.testit(MavenITmng4428FollowHttpRedirectTest.java:149)
	at org.apache.maven.it.MavenITmng4428FollowHttpRedirectTest.testitRelativeLocation(MavenITmng4428FollowHttpRedirectTest.java:103)


Results :

Tests in error: 
  testit(org.apache.maven.it.MavenITmng4482ForcePluginSnapshotUpdateTest)
  testitHttpToHttp(org.apache.maven.it.MavenITmng4428FollowHttpRedirectTest)
  testitHttpsToHttps(org.apache.maven.it.MavenITmng4428FollowHttpRedirectTest)
  testitRelativeLocation(org.apache.maven.it.MavenITmng4428FollowHttpRedirectTest)

Tests run: 646, Failures: 0, Errors: 4, Skipped: 0

[INFO] ------------------------------------------------------------------------
[INFO] BUILD FAILURE
[INFO] ------------------------------------------------------------------------
[INFO] Total time: 29:20.985s
[INFO] Finished at: Mon Aug 30 06:50:07 GMT-06:00 2010
[INFO] Final Memory: 9M/71M
[INFO] ------------------------------------------------------------------------
[ERROR] Failed to execute goal org.apache.maven.plugins:maven-surefire-plugin:2.4.3:test (default-test)
on project core-it-suite: There are test failures.

Please refer to <http://grid.sonatype.org/ci/job/maven-3.0.x-ITs/./jdk=1.5,label=ubuntu/ws/core-integration-tests/target/surefire-reports>
for the individual test results.
-> [Help 1]
org.apache.maven.lifecycle.LifecycleExecutionException: Failed to execute goal org.apache.maven.plugins:maven-surefire-plugin:2.4.3:test
(default-test) on project core-it-suite: There are test failures.

Please refer to <http://grid.sonatype.org/ci/job/maven-3.0.x-ITs/./jdk=1.5,label=ubuntu/ws/core-integration-tests/target/surefire-reports>
for the individual test results.
	at org.apache.maven.lifecycle.internal.MojoExecutor.execute(MojoExecutor.java:149)
	at org.apache.maven.lifecycle.internal.MojoExecutor.execute(MojoExecutor.java:88)
	at org.apache.maven.lifecycle.internal.MojoExecutor.execute(MojoExecutor.java:80)
	at org.apache.maven.lifecycle.internal.LifecycleModuleBuilder.buildProject(LifecycleModuleBuilder.java:87)
	at org.apache.maven.lifecycle.internal.LifecycleModuleBuilder.buildProject(LifecycleModuleBuilder.java:59)
	at org.apache.maven.lifecycle.internal.LifecycleStarter.singleThreadedBuild(LifecycleStarter.java:183)
	at org.apache.maven.lifecycle.internal.LifecycleStarter.execute(LifecycleStarter.java:161)
	at org.apache.maven.DefaultMaven.doExecute(DefaultMaven.java:315)
	at org.apache.maven.DefaultMaven.execute(DefaultMaven.java:152)
	at org.apache.maven.cli.MavenCli.execute(MavenCli.java:445)
	at org.apache.maven.cli.MavenCli.doMain(MavenCli.java:168)
	at org.apache.maven.cli.MavenCli.main(MavenCli.java:132)
	at sun.reflect.NativeMethodAccessorImpl.invoke0(Native Method)
	at sun.reflect.NativeMethodAccessorImpl.invoke(NativeMethodAccessorImpl.java:39)
	at sun.reflect.DelegatingMethodAccessorImpl.invoke(DelegatingMethodAccessorImpl.java:25)
	at java.lang.reflect.Method.invoke(Method.java:585)
	at org.codehaus.plexus.classworlds.launcher.Launcher.launchEnhanced(Launcher.java:290)
	at org.codehaus.plexus.classworlds.launcher.Launcher.launch(Launcher.java:230)
	at org.codehaus.plexus.classworlds.launcher.Launcher.mainWithExitCode(Launcher.java:409)
	at org.codehaus.plexus.classworlds.launcher.Launcher.main(Launcher.java:352)
Caused by: org.apache.maven.plugin.MojoFailureException: There are test failures.

Please refer to <http://grid.sonatype.org/ci/job/maven-3.0.x-ITs/./jdk=1.5,label=ubuntu/ws/core-integration-tests/target/surefire-reports>
for the individual test results.
	at org.apache.maven.plugin.surefire.SurefirePlugin.execute(SurefirePlugin.java:575)
	at org.apache.maven.plugin.DefaultBuildPluginManager.executeMojo(DefaultBuildPluginManager.java:107)
	at org.apache.maven.lifecycle.internal.MojoExecutor.execute(MojoExecutor.java:145)
	... 19 more
[ERROR] 
[ERROR] Re-run Maven using the -X switch to enable full debug logging.
[ERROR] 
[ERROR] For more information about the errors and possible solutions, please read the following
articles:
[ERROR] [Help 1] http://cwiki.apache.org/confluence/display/MAVEN/MojoFailureException
Emma: looking for coverage reports in the provided path: core-integration-tests/target/site/emma/coverage.xml


Mime
View raw message