maven-notifications mailing list archives

Site index · List index
Message view « Date » · « Thread »
Top « Date » · « Thread »
From Hudson <Hud...@sonatype.org>
Subject Build failed in Hudson: maven-plugins-ITs » 1.5,windows #478
Date Sun, 01 Aug 2010 07:28:19 GMT
See <http://grid.sonatype.org/ci/job/maven-plugins-ITs/./jdk=1.5,label=windows/478/changes>

Changes:

[Hervé Boutemy] [MPIR-80] added minimum JDK Rev to project summary

------------------------------------------
[...truncated 7904 lines...]
[INFO] Webapp assembled in [28 msecs]
[INFO] Exploding webapp
[INFO] Assembling webapp[maven-war-plugin-test] in [C:\home\hudson\workspace\maven-plugins-ITs\jdk\1.5\label\windows\trunk\maven-war-plugin\target\test-classes\unit\dependenciesanalysis\test-dir\dependency-now-provided]
[INFO] Scope of dependency[Dependency {groupId=org.sample.jar, artifactId=lib-test, version=1.0,
type=jar}] has changed (runtime -> provided).
[INFO] Processing war project
[INFO] Copying webapp resources[C:\home\hudson\workspace\maven-plugins-ITs\jdk\1.5\label\windows\trunk\maven-war-plugin\target\test-classes\unit\dependenciesanalysis\test-dir\dependency-now-provided-test-data\source]
[INFO] Webapp assembled in [12 msecs]
Tests run: 4, Failures: 0, Errors: 0, Skipped: 0, Time elapsed: 0.5 sec

Results :

Tests run: 81, Failures: 0, Errors: 0, Skipped: 0

[INFO] [jar:jar {execution: default-jar}]
[INFO] Building jar: C:\home\hudson\workspace\maven-plugins-ITs\jdk\1.5\label\windows\trunk\maven-war-plugin\target\maven-war-plugin-2.1-beta-2-SNAPSHOT.jar
[INFO] [plugin:addPluginArtifactMetadata {execution: default-addPluginArtifactMetadata}]
[INFO] [invoker:install {execution: integration-test}]
[INFO] Installing C:\home\hudson\workspace\maven-plugins-ITs\jdk\1.5\label\windows\trunk\maven-war-plugin\pom.xml
to C:\home\hudson\workspace\maven-plugins-ITs\jdk\1.5\label\windows\trunk\maven-war-plugin\target\local-repo\org\apache\maven\plugins\maven-war-plugin\2.1-beta-2-SNAPSHOT\maven-war-plugin-2.1-beta-2-SNAPSHOT.pom
[INFO] Installing C:\home\hudson\workspace\maven-plugins-ITs\jdk\1.5\label\windows\trunk\maven-war-plugin\target\maven-war-plugin-2.1-beta-2-SNAPSHOT.jar
to C:\home\hudson\workspace\maven-plugins-ITs\jdk\1.5\label\windows\trunk\maven-war-plugin\target\local-repo\org\apache\maven\plugins\maven-war-plugin\2.1-beta-2-SNAPSHOT\maven-war-plugin-2.1-beta-2-SNAPSHOT.jar
[INFO] [invoker:run {execution: integration-test}]
[INFO] Building: default\pom.xml
[INFO] ..SUCCESS (15.3 s)
[INFO] Building: MWAR-129\pom.xml
[INFO] ..SUCCESS (2.6 s)
[INFO] Building: MWAR-131\pom.xml
[INFO] ..SUCCESS (28.5 s)
[INFO] Building: MWAR-133\pom.xml
[INFO] ..SUCCESS (3.9 s)
[INFO] Building: MWAR-139\pom.xml
[INFO] ..SUCCESS (4.0 s)
[INFO] Building: MWAR-143\pom.xml
[INFO] ..SUCCESS (10.0 s)
[INFO] Building: MWAR-62\pom.xml
[INFO] ..SUCCESS (2.7 s)
[INFO] Building: MWAR-96\pom.xml
[INFO] ..SUCCESS (3.5 s)
[INFO] Building: scoped-dependency-same-artifact\pom.xml
[INFO] ..SUCCESS (4.7 s)
[INFO] Building: simple-war-no-webxml\pom.xml
[INFO] ..SUCCESS (3.6 s)
[INFO] Building: simple-war-project\pom.xml
[INFO] ..SUCCESS (3.6 s)
[INFO] Building: web-resources-filtering\pom.xml
[INFO] ..SUCCESS (5.0 s)
[INFO] ---------------------------------------
[INFO] Execution Summary:
[INFO]   Builds Passing: 12
[INFO]   Builds Failing: 0
[INFO]   Builds Skipped: 0
[INFO] ---------------------------------------
[INFO] [install:install {execution: default-install}]
[INFO] Installing C:\home\hudson\workspace\maven-plugins-ITs\jdk\1.5\label\windows\trunk\maven-war-plugin\target\maven-war-plugin-2.1-beta-2-SNAPSHOT.jar
to C:\opt\repos\local-repository\org\apache\maven\plugins\maven-war-plugin\2.1-beta-2-SNAPSHOT\maven-war-plugin-2.1-beta-2-SNAPSHOT.jar
[INFO] [deploy:deploy {execution: default-deploy}]
[INFO] Retrieving previous build number from apache.snapshots.https
[INFO] repository metadata for: 'snapshot org.apache.maven.plugins:maven-war-plugin:2.1-beta-2-SNAPSHOT'
could not be found on repository: apache.snapshots.https, so will be created
Uploading: file:/opt/repos/deploy-junk/org/apache/maven/plugins/maven-war-plugin/2.1-beta-2-SNAPSHOT/maven-war-plugin-2.1-beta-2-20100801.060818-1.jar
75K uploaded  (maven-war-plugin-2.1-beta-2-20100801.060818-1.jar)
[INFO] Retrieving previous metadata from apache.snapshots.https
[INFO] repository metadata for: 'artifact org.apache.maven.plugins:maven-war-plugin' could
not be found on repository: apache.snapshots.https, so will be created
[INFO] Uploading repository metadata for: 'artifact org.apache.maven.plugins:maven-war-plugin'
[INFO] Retrieving previous metadata from apache.snapshots.https
[INFO] repository metadata for: 'snapshot org.apache.maven.plugins:maven-war-plugin:2.1-beta-2-SNAPSHOT'
could not be found on repository: apache.snapshots.https, so will be created
[INFO] Uploading repository metadata for: 'snapshot org.apache.maven.plugins:maven-war-plugin:2.1-beta-2-SNAPSHOT'
[INFO] Retrieving previous metadata from apache.snapshots.https
[INFO] Uploading repository metadata for: 'org.apache.maven.plugins'
[INFO] Uploading project information for maven-war-plugin 2.1-beta-2-20100801.060818-1
[INFO] ------------------------------------------------------------------------
[INFO] Building Maven Plugins Aggregator
[INFO]    task-segment: [clean, deploy]
[INFO] ------------------------------------------------------------------------
[INFO] [clean:clean {execution: default-clean}]
[INFO] Deleting file set: C:\home\hudson\workspace\maven-plugins-ITs\jdk\1.5\label\windows\trunk\target
(included: [**], excluded: [])
[INFO] [remote-resources:process {execution: default}]
[INFO] [site:attach-descriptor {execution: default-attach-descriptor}]
[INFO] [install:install {execution: default-install}]
[INFO] Installing C:\home\hudson\workspace\maven-plugins-ITs\jdk\1.5\label\windows\trunk\pom.xml
to C:\opt\repos\local-repository\org\apache\maven\plugins\maven-plugins-aggregator\1-SNAPSHOT\maven-plugins-aggregator-1-SNAPSHOT.pom
[INFO] [deploy:deploy {execution: default-deploy}]
[INFO] Retrieving previous build number from apache.snapshots.https
[INFO] repository metadata for: 'snapshot org.apache.maven.plugins:maven-plugins-aggregator:1-SNAPSHOT'
could not be found on repository: apache.snapshots.https, so will be created
Uploading: file:/opt/repos/deploy-junk/org/apache/maven/plugins/maven-plugins-aggregator/1-SNAPSHOT/maven-plugins-aggregator-1-20100801.060818-1.pom
3K uploaded  (maven-plugins-aggregator-1-20100801.060818-1.pom)
[INFO] Retrieving previous metadata from apache.snapshots.https
[INFO] repository metadata for: 'artifact org.apache.maven.plugins:maven-plugins-aggregator'
could not be found on repository: apache.snapshots.https, so will be created
[INFO] Uploading repository metadata for: 'artifact org.apache.maven.plugins:maven-plugins-aggregator'
[INFO] Retrieving previous metadata from apache.snapshots.https
[INFO] repository metadata for: 'snapshot org.apache.maven.plugins:maven-plugins-aggregator:1-SNAPSHOT'
could not be found on repository: apache.snapshots.https, so will be created
[INFO] Uploading repository metadata for: 'snapshot org.apache.maven.plugins:maven-plugins-aggregator:1-SNAPSHOT'
[INFO] 
[INFO] 
[INFO] ------------------------------------------------------------------------
[INFO] Reactor Summary:
[INFO] ------------------------------------------------------------------------
[INFO] Maven Plugins ......................................... SUCCESS [2:56.373s]
[INFO] Maven Invoker Plugin .................................. SUCCESS [7:37.295s]
[INFO] Maven Ant Plugin ...................................... SUCCESS [3:04.735s]
[INFO] Maven AntRun Plugin ................................... SUCCESS [1:49.358s]
[INFO] Maven Eclipse Plugin .................................. SUCCESS [12:14.807s]
[INFO] Maven Changelog Plugin ................................ SUCCESS [43.174s]
[INFO] Maven Changes Report Plugin ........................... SUCCESS [1:40.682s]
[INFO] Maven Checkstyle Plugin ............................... SUCCESS [3:08.953s]
[INFO] Maven Clean Plugin .................................... SUCCESS [17.473s]
[INFO] Maven Compiler Plugin ................................. SUCCESS [37.996s]
[INFO] Maven Dependency Plugin ............................... SUCCESS [3:04.590s]
[INFO] Maven Deploy Plugin ................................... SUCCESS [2:07.036s]
[INFO] Maven DOAP Plugin ..................................... SUCCESS [23.824s]
[INFO] Maven Documentation Checker Plugin .................... SUCCESS [23.645s]
[INFO] Maven EAR Plugin ...................................... SUCCESS [3:58.130s]
[INFO] Maven EJB Plugin ...................................... SUCCESS [46.419s]
[INFO] Maven GPG Plugin ...................................... SUCCESS [46.068s]
[INFO] Maven Help Plugin ..................................... SUCCESS [45.088s]
[INFO] Maven IDEA Plugin ..................................... SUCCESS [18.467s]
[INFO] Maven Install Plugin .................................. SUCCESS [1:38.539s]
[INFO] Maven JAR Plugin ...................................... SUCCESS [2:06.960s]
[INFO] Maven Jarsigner Plugin ................................ SUCCESS [1:05.177s]
[INFO] Maven Shade Plugin .................................... SUCCESS [2:52.183s]
[INFO] Maven Javadoc Plugin .................................. SUCCESS [14:07.404s]
[INFO] Maven Linkcheck Plugin ................................ FAILED [3.048s]
[INFO] Maven One Plugin ...................................... SUCCESS [5.691s]
[INFO] Maven Patch Plugin .................................... SUCCESS [18.540s]
[INFO] Maven PDF Plugin ...................................... SUCCESS [1:07.062s]
[INFO] Maven PMD Plugin ...................................... SUCCESS [1:29.803s]
[INFO] Maven RAR Plugin ...................................... SUCCESS [17.216s]
[INFO] Maven Reactor Plugin .................................. SUCCESS [16.947s]
[INFO] Maven Repository Plugin ............................... SUCCESS [1:48.135s]
[INFO] Maven Resources Plugin ................................ SUCCESS [1:08.121s]
[INFO] Maven Site Plugin ..................................... SUCCESS [4:27.334s]
[INFO] Maven Source Plugin ................................... SUCCESS [47.845s]
[INFO] Maven Stage Plugin .................................... SUCCESS [3.112s]
[INFO] Maven Toolchains Plugin ............................... SUCCESS [2.059s]
[INFO] Maven Verifier Plugin ................................. SUCCESS [14.974s]
[INFO] Maven WAR Plugin ...................................... SUCCESS [2:05.657s]
[INFO] Maven Plugins Aggregator .............................. SUCCESS [0.129s]
[INFO] ------------------------------------------------------------------------
[INFO] Error for project: Maven Linkcheck Plugin (during deploy)
[INFO] ------------------------------------------------------------------------
[INFO] Failed to resolve artifact.

Missing:
----------
1) org.apache.maven.doxia:doxia-linkcheck:jar:1.1-SNAPSHOT

  Try downloading the file manually from the project website.

  Then, install it using the command: 
      mvn install:install-file -DgroupId=org.apache.maven.doxia -DartifactId=doxia-linkcheck
-Dversion=1.1-20100728.152249-15 -Dpackaging=jar -Dfile=/path/to/file

  Alternatively, if you host your own repository you can deploy the file there: 
      mvn deploy:deploy-file -DgroupId=org.apache.maven.doxia -DartifactId=doxia-linkcheck
-Dversion=1.1-20100728.152249-15 -Dpackaging=jar -Dfile=/path/to/file -Durl=[url] -DrepositoryId=[id]

  Path to dependency: 
  	1) org.apache.maven.plugins:maven-linkcheck-plugin:maven-plugin:1.0-SNAPSHOT
  	2) org.apache.maven.doxia:doxia-linkcheck:jar:1.1-SNAPSHOT

----------
1 required artifact is missing.

for artifact: 
  org.apache.maven.plugins:maven-linkcheck-plugin:maven-plugin:1.0-SNAPSHOT

from the specified remote repositories:
  Nexus (http://repository.sonatype.org:8081/content/groups/sonatype-public-grid)



[INFO] ------------------------------------------------------------------------
[INFO] Trace
org.apache.maven.lifecycle.LifecycleExecutionException: Missing:
----------
1) org.apache.maven.doxia:doxia-linkcheck:jar:1.1-SNAPSHOT

  Try downloading the file manually from the project website.

  Then, install it using the command: 
      mvn install:install-file -DgroupId=org.apache.maven.doxia -DartifactId=doxia-linkcheck
-Dversion=1.1-20100728.152249-15 -Dpackaging=jar -Dfile=/path/to/file

  Alternatively, if you host your own repository you can deploy the file there: 
      mvn deploy:deploy-file -DgroupId=org.apache.maven.doxia -DartifactId=doxia-linkcheck
-Dversion=1.1-20100728.152249-15 -Dpackaging=jar -Dfile=/path/to/file -Durl=[url] -DrepositoryId=[id]

  Path to dependency: 
  	1) org.apache.maven.plugins:maven-linkcheck-plugin:maven-plugin:1.0-SNAPSHOT
  	2) org.apache.maven.doxia:doxia-linkcheck:jar:1.1-SNAPSHOT

----------
1 required artifact is missing.

for artifact: 
  org.apache.maven.plugins:maven-linkcheck-plugin:maven-plugin:1.0-SNAPSHOT

from the specified remote repositories:
  Nexus (http://repository.sonatype.org:8081/content/groups/sonatype-public-grid)


	at org.apache.maven.lifecycle.DefaultLifecycleExecutor.executeGoals(DefaultLifecycleExecutor.java:711)
	at org.apache.maven.lifecycle.DefaultLifecycleExecutor.executeGoalWithLifecycle(DefaultLifecycleExecutor.java:556)
	at org.apache.maven.lifecycle.DefaultLifecycleExecutor.executeGoal(DefaultLifecycleExecutor.java:535)
	at org.apache.maven.lifecycle.DefaultLifecycleExecutor.executeGoalAndHandleFailures(DefaultLifecycleExecutor.java:387)
	at org.apache.maven.lifecycle.DefaultLifecycleExecutor.executeTaskSegments(DefaultLifecycleExecutor.java:348)
	at org.apache.maven.lifecycle.DefaultLifecycleExecutor.execute(DefaultLifecycleExecutor.java:180)
	at org.apache.maven.DefaultMaven.doExecute(DefaultMaven.java:328)
	at org.apache.maven.DefaultMaven.execute(DefaultMaven.java:138)
	at org.apache.maven.cli.MavenCli.main(MavenCli.java:362)
	at org.apache.maven.cli.compat.CompatibleMain.main(CompatibleMain.java:60)
	at sun.reflect.NativeMethodAccessorImpl.invoke0(Native Method)
	at sun.reflect.NativeMethodAccessorImpl.invoke(NativeMethodAccessorImpl.java:39)
	at sun.reflect.DelegatingMethodAccessorImpl.invoke(DelegatingMethodAccessorImpl.java:25)
	at java.lang.reflect.Method.invoke(Method.java:585)
	at org.codehaus.classworlds.Launcher.launchEnhanced(Launcher.java:315)
	at org.codehaus.classworlds.Launcher.launch(Launcher.java:255)
	at org.codehaus.classworlds.Launcher.mainWithExitCode(Launcher.java:430)
	at org.codehaus.classworlds.Launcher.main(Launcher.java:375)
Caused by: org.apache.maven.artifact.resolver.MultipleArtifactsNotFoundException: Missing:
----------
1) org.apache.maven.doxia:doxia-linkcheck:jar:1.1-SNAPSHOT

  Try downloading the file manually from the project website.

  Then, install it using the command: 
      mvn install:install-file -DgroupId=org.apache.maven.doxia -DartifactId=doxia-linkcheck
-Dversion=1.1-20100728.152249-15 -Dpackaging=jar -Dfile=/path/to/file

  Alternatively, if you host your own repository you can deploy the file there: 
      mvn deploy:deploy-file -DgroupId=org.apache.maven.doxia -DartifactId=doxia-linkcheck
-Dversion=1.1-20100728.152249-15 -Dpackaging=jar -Dfile=/path/to/file -Durl=[url] -DrepositoryId=[id]

  Path to dependency: 
  	1) org.apache.maven.plugins:maven-linkcheck-plugin:maven-plugin:1.0-SNAPSHOT
  	2) org.apache.maven.doxia:doxia-linkcheck:jar:1.1-SNAPSHOT

----------
1 required artifact is missing.

for artifact: 
  org.apache.maven.plugins:maven-linkcheck-plugin:maven-plugin:1.0-SNAPSHOT

from the specified remote repositories:
  Nexus (http://repository.sonatype.org:8081/content/groups/sonatype-public-grid)


	at org.apache.maven.artifact.resolver.DefaultArtifactResolver.resolveTransitively(DefaultArtifactResolver.java:360)
	at org.apache.maven.artifact.resolver.DefaultArtifactResolver.resolveTransitively(DefaultArtifactResolver.java:304)
	at org.apache.maven.plugin.DefaultPluginManager.resolveTransitiveDependencies(DefaultPluginManager.java:1499)
	at org.apache.maven.plugin.DefaultPluginManager.executeMojo(DefaultPluginManager.java:442)
	at org.apache.maven.lifecycle.DefaultLifecycleExecutor.executeGoals(DefaultLifecycleExecutor.java:694)
	... 17 more
[INFO] ------------------------------------------------------------------------
[INFO] BUILD ERRORS
[INFO] ------------------------------------------------------------------------
[INFO] Total time: 82 minutes 54 seconds
[INFO] Finished at: Sun Aug 01 00:28:13 PDT 2010
[INFO] Final Memory: 67M/175M
[INFO] ------------------------------------------------------------------------


Mime
View raw message