maven-notifications mailing list archives

Site index · List index
Message view « Date » · « Thread »
Top « Date » · « Thread »
From Hudson <Hud...@sonatype.org>
Subject Build failed in Hudson: surefire » 1.5,ubuntu #79
Date Fri, 06 Aug 2010 16:04:33 GMT
See <http://grid.sonatype.org/ci/job/surefire/./jdk=1.5,label=ubuntu/79/>

------------------------------------------
[...truncated 597 lines...]
Tests run: 8, Failures: 0, Errors: 0, Skipped: 0, Time elapsed: 0.057 sec
Running org.apache.maven.plugins.surefire.report.SurefireReportParserTest
WARNING: no time attribute found on testsuite element
Tests run: 8, Failures: 0, Errors: 0, Skipped: 0, Time elapsed: 0.2 sec
Running org.apache.maven.plugins.surefire.report.ReportTestCaseTest
Tests run: 4, Failures: 0, Errors: 0, Skipped: 0, Time elapsed: 0.004 sec
Running org.apache.maven.plugins.surefire.report.SurefireReportMojoTest
[WARNING] Unable to locate Test Source XRef to link to - DISABLED
Tests run: 4, Failures: 0, Errors: 0, Skipped: 0, Time elapsed: 4.03 sec

Results :

Tests run: 24, Failures: 0, Errors: 0, Skipped: 0

[INFO] [jar:jar {execution: default-jar}]
[INFO] Building jar: <http://grid.sonatype.org/ci/job/surefire/./jdk=1.5,label=ubuntu/ws/trunk/maven-surefire-report-plugin/target/maven-surefire-report-plugin-2.6-SNAPSHOT.jar>
[INFO] [plugin:addPluginArtifactMetadata {execution: default-addPluginArtifactMetadata}]
[INFO] [install:install {execution: default-install}]
[INFO] Installing <http://grid.sonatype.org/ci/job/surefire/./jdk=1.5,label=ubuntu/ws/trunk/maven-surefire-report-plugin/target/maven-surefire-report-plugin-2.6-SNAPSHOT.jar>
to /opt/repos/surefire/jdk=1.5,label=ubuntu/org/apache/maven/plugins/maven-surefire-report-plugin/2.6-SNAPSHOT/maven-surefire-report-plugin-2.6-SNAPSHOT.jar
[INFO] [deploy:deploy {execution: default-deploy}]
[INFO] Retrieving previous build number from apache.snapshots.https
Uploading: http://repository.sonatype.org:8081/content/repositories/maven.snapshots/org/apache/maven/plugins/maven-surefire-report-plugin/2.6-SNAPSHOT/maven-surefire-report-plugin-2.6-20100806.154137-38.jar
38K uploaded  (maven-surefire-report-plugin-2.6-20100806.154137-38.jar)
[INFO] Retrieving previous metadata from apache.snapshots.https
[INFO] Uploading repository metadata for: 'artifact org.apache.maven.plugins:maven-surefire-report-plugin'
[INFO] Retrieving previous metadata from apache.snapshots.https
[INFO] Uploading repository metadata for: 'snapshot org.apache.maven.plugins:maven-surefire-report-plugin:2.6-SNAPSHOT'
[INFO] Retrieving previous metadata from apache.snapshots.https
[INFO] Uploading repository metadata for: 'org.apache.maven.plugins'
[INFO] Uploading project information for maven-surefire-report-plugin 2.6-20100806.154137-38
[INFO] ------------------------------------------------------------------------
[INFO] Building Maven Surefire Integration Tests
[INFO]    task-segment: [clean, deploy]
[INFO] ------------------------------------------------------------------------
[INFO] [clean:clean {execution: default-clean}]
[INFO] Deleting file set: <http://grid.sonatype.org/ci/job/surefire/./jdk=1.5,label=ubuntu/ws/trunk/surefire-integration-tests/target>
(included: [**], excluded: [])
[INFO] [enforcer:enforce {execution: require-maven-2.1.0}]
[INFO] [remote-resources:process {execution: default}]
[INFO] [resources:resources {execution: default-resources}]
[INFO] Using 'UTF-8' encoding to copy filtered resources.
[INFO] skip non existing resourceDirectory <http://grid.sonatype.org/ci/job/surefire/./jdk=1.5,label=ubuntu/ws/trunk/surefire-integration-tests/src/main/resources>
[INFO] Copying 3 resources
[INFO] [compiler:compile {execution: default-compile}]
[INFO] No sources to compile
[INFO] [help:effective-settings {execution: settings.xml}]
[INFO] Effective-settings written to: <http://grid.sonatype.org/ci/job/surefire/./jdk=1.5,label=ubuntu/ws/trunk/surefire-integration-tests/target/private/settings.xml>
[INFO] [resources:testResources {execution: default-testResources}]
[INFO] Using 'UTF-8' encoding to copy filtered resources.
[INFO] Copying 155 resources
[INFO] Copying 3 resources
[INFO] [compiler:testCompile {execution: default-testCompile}]
[INFO] Compiling 57 source files to <http://grid.sonatype.org/ci/job/surefire/./jdk=1.5,label=ubuntu/ws/trunk/surefire-integration-tests/target/test-classes>
[WARNING] DEPRECATED [systemProperties]: Use systemPropertyVariables instead.
[INFO] [surefire:test {execution: default-test}]
[INFO] Surefire report directory: <http://grid.sonatype.org/ci/job/surefire/./jdk=1.5,label=ubuntu/ws/trunk/surefire-integration-tests/target/surefire-reports>

-------------------------------------------------------
 T E S T S
-------------------------------------------------------
Running org.apache.maven.surefire.its.SetUpForIntegrationTest
Tests run: 1, Failures: 0, Errors: 0, Skipped: 0, Time elapsed: 0.392 sec

Results :

Tests run: 1, Failures: 0, Errors: 0, Skipped: 0

[INFO] [jar:jar {execution: default-jar}]
[INFO] Building jar: <http://grid.sonatype.org/ci/job/surefire/./jdk=1.5,label=ubuntu/ws/trunk/surefire-integration-tests/target/surefire-integration-tests-2.6-SNAPSHOT.jar>
[INFO] [invoker:install {execution: default}]
[INFO] Installing <http://grid.sonatype.org/ci/job/surefire/./jdk=1.5,label=ubuntu/ws/trunk/maven-surefire-report-plugin/pom.xml>
to /opt/repos/surefire/jdk=1.5,label=ubuntu/org/apache/maven/plugins/maven-surefire-report-plugin/2.6-SNAPSHOT/maven-surefire-report-plugin-2.6-SNAPSHOT.pom
[INFO] Installing <http://grid.sonatype.org/ci/job/surefire/./jdk=1.5,label=ubuntu/ws/trunk/maven-surefire-report-plugin/target/maven-surefire-report-plugin-2.6-SNAPSHOT.jar>
to /opt/repos/surefire/jdk=1.5,label=ubuntu/org/apache/maven/plugins/maven-surefire-report-plugin/2.6-SNAPSHOT/maven-surefire-report-plugin-2.6-20100806.154137-38.jar
[INFO] Installing <http://grid.sonatype.org/ci/job/surefire/./jdk=1.5,label=ubuntu/ws/trunk/pom.xml>
to /opt/repos/surefire/jdk=1.5,label=ubuntu/org/apache/maven/surefire/surefire/2.6-SNAPSHOT/surefire-2.6-20100806.154137-39.pom
[INFO] Installing <http://grid.sonatype.org/ci/job/surefire/./jdk=1.5,label=ubuntu/ws/trunk/maven-surefire-plugin/pom.xml>
to /opt/repos/surefire/jdk=1.5,label=ubuntu/org/apache/maven/plugins/maven-surefire-plugin/2.6-SNAPSHOT/maven-surefire-plugin-2.6-SNAPSHOT.pom
[INFO] Installing <http://grid.sonatype.org/ci/job/surefire/./jdk=1.5,label=ubuntu/ws/trunk/maven-surefire-plugin/target/maven-surefire-plugin-2.6-SNAPSHOT.jar>
to /opt/repos/surefire/jdk=1.5,label=ubuntu/org/apache/maven/plugins/maven-surefire-plugin/2.6-SNAPSHOT/maven-surefire-plugin-2.6-20100806.154137-38.jar
[INFO] Installing <http://grid.sonatype.org/ci/job/surefire/./jdk=1.5,label=ubuntu/ws/trunk/surefire-booter/target/dependency-reduced-pom.xml>
to /opt/repos/surefire/jdk=1.5,label=ubuntu/org/apache/maven/surefire/surefire-booter/2.6-SNAPSHOT/surefire-booter-2.6-SNAPSHOT.pom
[INFO] Installing <http://grid.sonatype.org/ci/job/surefire/./jdk=1.5,label=ubuntu/ws/trunk/surefire-booter/target/surefire-booter-2.6-SNAPSHOT.jar>
to /opt/repos/surefire/jdk=1.5,label=ubuntu/org/apache/maven/surefire/surefire-booter/2.6-SNAPSHOT/surefire-booter-2.6-20100806.154137-38.jar
[INFO] Installing <http://grid.sonatype.org/ci/job/surefire/./jdk=1.5,label=ubuntu/ws/trunk/surefire-api/target/dependency-reduced-pom.xml>
to /opt/repos/surefire/jdk=1.5,label=ubuntu/org/apache/maven/surefire/surefire-api/2.6-SNAPSHOT/surefire-api-2.6-SNAPSHOT.pom
[INFO] Installing <http://grid.sonatype.org/ci/job/surefire/./jdk=1.5,label=ubuntu/ws/trunk/surefire-api/target/surefire-api-2.6-SNAPSHOT.jar>
to /opt/repos/surefire/jdk=1.5,label=ubuntu/org/apache/maven/surefire/surefire-api/2.6-SNAPSHOT/surefire-api-2.6-20100806.154137-38.jar
[INFO] Installing <http://grid.sonatype.org/ci/job/surefire/./jdk=1.5,label=ubuntu/ws/trunk/maven-surefire-common/pom.xml>
to /opt/repos/surefire/jdk=1.5,label=ubuntu/org/apache/maven/surefire/maven-surefire-common/2.6-SNAPSHOT/maven-surefire-common-2.6-SNAPSHOT.pom
[INFO] Installing <http://grid.sonatype.org/ci/job/surefire/./jdk=1.5,label=ubuntu/ws/trunk/maven-surefire-common/target/maven-surefire-common-2.6-SNAPSHOT.jar>
to /opt/repos/surefire/jdk=1.5,label=ubuntu/org/apache/maven/surefire/maven-surefire-common/2.6-SNAPSHOT/maven-surefire-common-2.6-20100806.154137-18.jar
[INFO] Installing <http://grid.sonatype.org/ci/job/surefire/./jdk=1.5,label=ubuntu/ws/trunk/surefire-providers/surefire-testng/pom.xml>
to /opt/repos/surefire/jdk=1.5,label=ubuntu/org/apache/maven/surefire/surefire-testng/2.6-SNAPSHOT/surefire-testng-2.6-SNAPSHOT.pom
[INFO] Installing <http://grid.sonatype.org/ci/job/surefire/./jdk=1.5,label=ubuntu/ws/trunk/surefire-providers/surefire-testng/target/surefire-testng-2.6-SNAPSHOT.jar>
to /opt/repos/surefire/jdk=1.5,label=ubuntu/org/apache/maven/surefire/surefire-testng/2.6-SNAPSHOT/surefire-testng-2.6-20100806.154137-38.jar
[INFO] Installing <http://grid.sonatype.org/ci/job/surefire/./jdk=1.5,label=ubuntu/ws/trunk/surefire-providers/pom.xml>
to /opt/repos/surefire/jdk=1.5,label=ubuntu/org/apache/maven/surefire/surefire-providers/2.6-SNAPSHOT/surefire-providers-2.6-20100806.154137-38.pom
[INFO] Installing <http://grid.sonatype.org/ci/job/surefire/./jdk=1.5,label=ubuntu/ws/trunk/surefire-providers/surefire-junit/pom.xml>
to /opt/repos/surefire/jdk=1.5,label=ubuntu/org/apache/maven/surefire/surefire-junit/2.6-SNAPSHOT/surefire-junit-2.6-SNAPSHOT.pom
[INFO] Installing <http://grid.sonatype.org/ci/job/surefire/./jdk=1.5,label=ubuntu/ws/trunk/surefire-providers/surefire-junit/target/surefire-junit-2.6-SNAPSHOT.jar>
to /opt/repos/surefire/jdk=1.5,label=ubuntu/org/apache/maven/surefire/surefire-junit/2.6-SNAPSHOT/surefire-junit-2.6-20100806.154137-38.jar
[INFO] Installing <http://grid.sonatype.org/ci/job/surefire/./jdk=1.5,label=ubuntu/ws/trunk/surefire-providers/surefire-junit4/pom.xml>
to /opt/repos/surefire/jdk=1.5,label=ubuntu/org/apache/maven/surefire/surefire-junit4/2.6-SNAPSHOT/surefire-junit4-2.6-SNAPSHOT.pom
[INFO] Installing <http://grid.sonatype.org/ci/job/surefire/./jdk=1.5,label=ubuntu/ws/trunk/surefire-providers/surefire-junit4/target/surefire-junit4-2.6-SNAPSHOT.jar>
to /opt/repos/surefire/jdk=1.5,label=ubuntu/org/apache/maven/surefire/surefire-junit4/2.6-SNAPSHOT/surefire-junit4-2.6-20100806.154137-38.jar
[INFO] Installing <http://grid.sonatype.org/ci/job/surefire/./jdk=1.5,label=ubuntu/ws/trunk/surefire-providers/surefire-junit47/pom.xml>
to /opt/repos/surefire/jdk=1.5,label=ubuntu/org/apache/maven/surefire/surefire-junit47/2.6-SNAPSHOT/surefire-junit47-2.6-SNAPSHOT.pom
[INFO] Installing <http://grid.sonatype.org/ci/job/surefire/./jdk=1.5,label=ubuntu/ws/trunk/surefire-providers/surefire-junit47/target/surefire-junit47-2.6-SNAPSHOT.jar>
to /opt/repos/surefire/jdk=1.5,label=ubuntu/org/apache/maven/surefire/surefire-junit47/2.6-SNAPSHOT/surefire-junit47-2.6-20100806.154137-38.jar
[INFO] Installing <http://grid.sonatype.org/ci/job/surefire/./jdk=1.5,label=ubuntu/ws/trunk/surefire-integration-tests/pom.xml>
to /opt/repos/surefire/jdk=1.5,label=ubuntu/org/apache/maven/surefire/surefire-integration-tests/2.6-SNAPSHOT/surefire-integration-tests-2.6-SNAPSHOT.pom
[INFO] Installing <http://grid.sonatype.org/ci/job/surefire/./jdk=1.5,label=ubuntu/ws/trunk/surefire-integration-tests/target/surefire-integration-tests-2.6-SNAPSHOT.jar>
to /opt/repos/surefire/jdk=1.5,label=ubuntu/org/apache/maven/surefire/surefire-integration-tests/2.6-SNAPSHOT/surefire-integration-tests-2.6-SNAPSHOT.jar
[WARNING] DEPRECATED [systemProperties]: Use systemPropertyVariables instead.
[INFO] [failsafe:integration-test {execution: default}]
[INFO] Failsafe report directory: <http://grid.sonatype.org/ci/job/surefire/./jdk=1.5,label=ubuntu/ws/trunk/surefire-integration-tests/target/failsafe-reports>

-------------------------------------------------------
 T E S T S
-------------------------------------------------------
Running org.apache.maven.surefire.its.Surefire44InnerClassTestIT
Tests run: 1, Failures: 0, Errors: 0, Skipped: 0, Time elapsed: 17.603 sec
Running org.apache.maven.surefire.its.UseIsolatedClassLoaderIT
Tests run: 1, Failures: 0, Errors: 0, Skipped: 0, Time elapsed: 16.627 sec
Running org.apache.maven.surefire.its.ClassPathOrderIT
Tests run: 1, Failures: 0, Errors: 0, Skipped: 0, Time elapsed: 18.538 sec
Running org.apache.maven.surefire.its.Surefire613TestCountInParallelIT
Tests run: 1, Failures: 0, Errors: 0, Skipped: 0, Time elapsed: 20.125 sec
Running org.apache.maven.surefire.its.ForkModeIT
Tests run: 5, Failures: 0, Errors: 0, Skipped: 0, Time elapsed: 92.752 sec
Running org.apache.maven.surefire.its.PlexusConflictIT
Tests run: 2, Failures: 0, Errors: 0, Skipped: 0, Time elapsed: 36.274 sec
Running org.apache.maven.surefire.its.UmlautDirIT
Tests run: 2, Failures: 0, Errors: 0, Skipped: 0, Time elapsed: 28.034 sec
Running org.apache.maven.surefire.its.TwoTestCasesIT
Tests run: 4, Failures: 0, Errors: 0, Skipped: 0, Time elapsed: 67.563 sec
Running org.apache.maven.surefire.its.Surefire146ForkPerTestNoSetupIT
Tests run: 1, Failures: 0, Errors: 0, Skipped: 0, Time elapsed: 10.361 sec
Running org.apache.maven.surefire.its.Surefire162CharsetProviderIT
Tests run: 1, Failures: 0, Errors: 0, Skipped: 0, Time elapsed: 15.549 sec
Running org.apache.maven.surefire.its.EnvironmentVariableIT
Tests run: 1, Failures: 0, Errors: 0, Skipped: 0, Time elapsed: 17.954 sec
Running org.apache.maven.surefire.its.JUnit44HamcrestIT
Tests run: 1, Failures: 0, Errors: 0, Skipped: 0, Time elapsed: 17.018 sec
Running org.apache.maven.surefire.its.CheckTestNgJdk14IT
Tests run: 1, Failures: 0, Errors: 0, Skipped: 0, Time elapsed: 15.107 sec
Running org.apache.maven.surefire.its.CheckTestFailIfNoTestsIT
Tests run: 2, Failures: 0, Errors: 0, Skipped: 0, Time elapsed: 17.934 sec
Running org.apache.maven.surefire.its.Surefire621TestCountingJunit3InParallelIT
Tests run: 1, Failures: 0, Errors: 0, Skipped: 0, Time elapsed: 14.592 sec
Running org.apache.maven.surefire.its.Junit47concurrencyIT
Tests run: 1, Failures: 0, Errors: 0, Skipped: 0, Time elapsed: 15.504 sec
Running org.apache.maven.surefire.its.DefaultConfigurationIT
Tests run: 1, Failures: 0, Errors: 0, Skipped: 0, Time elapsed: 11.064 sec
Running org.apache.maven.surefire.its.CheckTestNgPathWithSpacesIT
Tests run: 1, Failures: 0, Errors: 0, Skipped: 0, Time elapsed: 12.772 sec
Running org.apache.maven.surefire.its.CheckTestNgSuiteXmlSingleIT
Tests run: 1, Failures: 0, Errors: 0, Skipped: 0, Time elapsed: 13.113 sec
Running org.apache.maven.surefire.its.CheckTestNgReportTestIT
Tests run: 1, Failures: 0, Errors: 0, Skipped: 0, Time elapsed: 22.507 sec
Running org.apache.maven.surefire.its.JUnit4ForkAlwaysStaticInitPollutionIT
Tests run: 1, Failures: 0, Errors: 0, Skipped: 0, Time elapsed: 18.955 sec
Running org.apache.maven.surefire.its.TimeoutForkedTestIT
Tests run: 1, Failures: 0, Errors: 0, Skipped: 0, Time elapsed: 16.601 sec
Running org.apache.maven.surefire.its.CheckTestFailIfNoTestsForkModeIT
Tests run: 6, Failures: 0, Errors: 0, Skipped: 0, Time elapsed: 66.462 sec
Running org.apache.maven.surefire.its.CheckTestNgGroupThreadParallelIT
Tests run: 1, Failures: 0, Errors: 0, Skipped: 0, Time elapsed: 15.625 sec
Running org.apache.maven.surefire.its.PojoSimpleIT
Tests run: 1, Failures: 1, Errors: 0, Skipped: 0, Time elapsed: 14.841 sec <<< FAILURE!
Running org.apache.maven.surefire.its.ArgLineIT
Tests run: 1, Failures: 0, Errors: 0, Skipped: 0, Time elapsed: 16.037 sec
Running org.apache.maven.surefire.its.Surefire377TestNgAndJUnitTogetherIT
Tests run: 1, Failures: 0, Errors: 0, Skipped: 0, Time elapsed: 16.852 sec
Running org.apache.maven.surefire.its.CheckTestNgSuiteXmlIT
Tests run: 2, Failures: 0, Errors: 0, Skipped: 0, Time elapsed: 19.267 sec
Running org.apache.maven.surefire.its.IncludesExcludesIT
Tests run: 1, Failures: 0, Errors: 0, Skipped: 0, Time elapsed: 13.273 sec
Running org.apache.maven.surefire.its.CheckTestNgBeforeMethodIT
Tests run: 1, Failures: 0, Errors: 0, Skipped: 0, Time elapsed: 7.963 sec
Running org.apache.maven.surefire.its.AbstractTestCaseIT
Tests run: 1, Failures: 0, Errors: 0, Skipped: 0, Time elapsed: 12.719 sec
Running org.apache.maven.surefire.its.CheckTestNgBeforeMethodFailureIT
Tests run: 1, Failures: 0, Errors: 0, Skipped: 0, Time elapsed: 11.322 sec
Running org.apache.maven.surefire.its.PlainOldJavaClasspathIT
Tests run: 1, Failures: 0, Errors: 0, Skipped: 0, Time elapsed: 11.728 sec
Running org.apache.maven.surefire.its.WorkingDirectoryMissingIT
Tests run: 1, Failures: 0, Errors: 0, Skipped: 0, Time elapsed: 9.96 sec
Running org.apache.maven.surefire.its.Junit4IgnoreIT
Tests run: 1, Failures: 0, Errors: 0, Skipped: 0, Time elapsed: 12.356 sec
Running org.apache.maven.surefire.its.AdditionalClasspathIT
Tests run: 1, Failures: 0, Errors: 0, Skipped: 0, Time elapsed: 12.461 sec
Running org.apache.maven.surefire.its.CheckTestNgListenerReporterIT
Tests run: 1, Failures: 0, Errors: 0, Skipped: 0, Time elapsed: 16.891 sec
Running org.apache.maven.surefire.its.SiblingAggregatorIT
Tests run: 1, Failures: 0, Errors: 0, Skipped: 0, Time elapsed: 10.176 sec
Running org.apache.maven.surefire.its.CheckTestNgVersionsIT
Tests run: 6, Failures: 0, Errors: 0, Skipped: 0, Time elapsed: 87.715 sec
Running org.apache.maven.surefire.its.Surefire224WellFormedXmlFailuresIT
Tests run: 1, Failures: 0, Errors: 0, Skipped: 0, Time elapsed: 14.203 sec
Running org.apache.maven.surefire.its.Surefire42NotExtendingTestCaseIT
Tests run: 1, Failures: 0, Errors: 0, Skipped: 0, Time elapsed: 13.544 sec
Running org.apache.maven.surefire.its.ClasspathFilteringIT
Tests run: 1, Failures: 0, Errors: 0, Skipped: 0, Time elapsed: 16.717 sec
Running org.apache.maven.surefire.its.WorkingDirectoryIT
Tests run: 4, Failures: 0, Errors: 0, Skipped: 0, Time elapsed: 41.12 sec
Running org.apache.maven.surefire.its.AggregateReportIT
Tests run: 1, Failures: 0, Errors: 0, Skipped: 0, Time elapsed: 16.848 sec
Running org.apache.maven.surefire.its.Junit4VersionsIT
Tests run: 9, Failures: 0, Errors: 0, Skipped: 0, Time elapsed: 133.53 sec
Running org.apache.maven.surefire.its.CheckSingleTestIT
Tests run: 4, Failures: 0, Errors: 0, Skipped: 0, Time elapsed: 43.699 sec
Running org.apache.maven.surefire.its.CheckTestNgExecuteErrorIT
Tests run: 1, Failures: 0, Errors: 0, Skipped: 0, Time elapsed: 10.352 sec
Running org.apache.maven.surefire.its.Surefire628ConsoleOutputBeforeAndAfterClassIT
Tests run: 1, Failures: 0, Errors: 0, Skipped: 0, Time elapsed: 8.914 sec
Running org.apache.maven.surefire.its.SystemPropertiesTestIT
Tests run: 2, Failures: 0, Errors: 0, Skipped: 0, Time elapsed: 18.066 sec
Running org.apache.maven.surefire.its.ClasspathScopeFilteringIT
Tests run: 1, Failures: 0, Errors: 0, Skipped: 0, Time elapsed: 11.485 sec

Results :

Failed tests: 
  testit(org.apache.maven.surefire.its.PojoSimpleIT)

Tests run: 86, Failures: 1, Errors: 0, Skipped: 0

[INFO] [failsafe:verify {execution: default}]
[INFO] Failsafe report directory: <http://grid.sonatype.org/ci/job/surefire/./jdk=1.5,label=ubuntu/ws/trunk/surefire-integration-tests/target/failsafe-reports>
[INFO] ------------------------------------------------------------------------
[ERROR] BUILD FAILURE
[INFO] ------------------------------------------------------------------------
[INFO] There are test failures.

Please refer to <http://grid.sonatype.org/ci/job/surefire/./jdk=1.5,label=ubuntu/ws/trunk/surefire-integration-tests/target/failsafe-reports>
for the individual test results.
[INFO] ------------------------------------------------------------------------
[INFO] Trace
org.apache.maven.BuildFailureException: There are test failures.

Please refer to <http://grid.sonatype.org/ci/job/surefire/./jdk=1.5,label=ubuntu/ws/trunk/surefire-integration-tests/target/failsafe-reports>
for the individual test results.
	at org.apache.maven.lifecycle.DefaultLifecycleExecutor.executeGoals(DefaultLifecycleExecutor.java:715)
	at org.apache.maven.lifecycle.DefaultLifecycleExecutor.executeGoalWithLifecycle(DefaultLifecycleExecutor.java:556)
	at org.apache.maven.lifecycle.DefaultLifecycleExecutor.executeGoal(DefaultLifecycleExecutor.java:535)
	at org.apache.maven.lifecycle.DefaultLifecycleExecutor.executeGoalAndHandleFailures(DefaultLifecycleExecutor.java:387)
	at org.apache.maven.lifecycle.DefaultLifecycleExecutor.executeTaskSegments(DefaultLifecycleExecutor.java:348)
	at org.apache.maven.lifecycle.DefaultLifecycleExecutor.execute(DefaultLifecycleExecutor.java:180)
	at org.apache.maven.DefaultMaven.doExecute(DefaultMaven.java:328)
	at org.apache.maven.DefaultMaven.execute(DefaultMaven.java:138)
	at org.apache.maven.cli.MavenCli.main(MavenCli.java:362)
	at org.apache.maven.cli.compat.CompatibleMain.main(CompatibleMain.java:60)
	at sun.reflect.NativeMethodAccessorImpl.invoke0(Native Method)
	at sun.reflect.NativeMethodAccessorImpl.invoke(NativeMethodAccessorImpl.java:39)
	at sun.reflect.DelegatingMethodAccessorImpl.invoke(DelegatingMethodAccessorImpl.java:25)
	at java.lang.reflect.Method.invoke(Method.java:585)
	at org.codehaus.classworlds.Launcher.launchEnhanced(Launcher.java:315)
	at org.codehaus.classworlds.Launcher.launch(Launcher.java:255)
	at org.codehaus.classworlds.Launcher.mainWithExitCode(Launcher.java:430)
	at org.codehaus.classworlds.Launcher.main(Launcher.java:375)
Caused by: org.apache.maven.plugin.MojoFailureException: There are test failures.

Please refer to <http://grid.sonatype.org/ci/job/surefire/./jdk=1.5,label=ubuntu/ws/trunk/surefire-integration-tests/target/failsafe-reports>
for the individual test results.
	at org.apache.maven.plugin.failsafe.VerifyMojo.execute(VerifyMojo.java:217)
	at org.apache.maven.plugin.DefaultPluginManager.executeMojo(DefaultPluginManager.java:490)
	at org.apache.maven.lifecycle.DefaultLifecycleExecutor.executeGoals(DefaultLifecycleExecutor.java:694)
	... 17 more
[INFO] ------------------------------------------------------------------------
[INFO] Total time: 23 minutes 10 seconds
[INFO] Finished at: Fri Aug 06 10:04:32 GMT-06:00 2010
[INFO] Final Memory: 38M/85M
[INFO] ------------------------------------------------------------------------


Mime
View raw message