maven-notifications mailing list archives

Site index · List index
Message view « Date » · « Thread »
Top « Date » · « Thread »
From Hudson <Hud...@sonatype.org>
Subject Build failed in Hudson: maven-3.0.x-ITs » 1.5,ubuntu #314
Date Sat, 07 Aug 2010 09:44:48 GMT
See <http://grid.sonatype.org/ci/job/maven-3.0.x-ITs/./jdk=1.5,label=ubuntu/314/>

------------------------------------------
[...truncated 1025 lines...]
	at org.apache.maven.lifecycle.internal.MojoExecutor.execute(MojoExecutor.java:144)
	... 19 more
Caused by: org.apache.maven.plugin.PluginResolutionException: Plugin org.apache.maven.its.plugins:maven-it-plugin-class-loader:2.1-SNAPSHOT
or one of its dependencies could not be resolved: Missing:
----------
1) org.apache.maven.its.plugins.class-loader:dep-c:jar:2.1-SNAPSHOT
  Try downloading the file manually from the project website.
  Then, install it using the command: 
      mvn install:install-file -DgroupId=org.apache.maven.its.plugins.class-loader -DartifactId=dep-c
-Dversion=2.1-SNAPSHOT -Dpackaging=jar -Dfile=/path/to/file
  Alternatively, if you host your own repository you can deploy the file there: 
      mvn deploy:deploy-file -DgroupId=org.apache.maven.its.plugins.class-loader -DartifactId=dep-c
-Dversion=2.1-SNAPSHOT -Dpackaging=jar -Dfile=/path/to/file -Durl=[url] -DrepositoryId=[id]
  Path to dependency: 
  	1) org.apache.maven.its.plugins:maven-it-plugin-class-loader:maven-plugin:2.1-SNAPSHOT
  	2) org.apache.maven.its.plugins.class-loader:dep-c:jar:2.1-SNAPSHOT
----------
1 required artifact is missing.
for artifact: 
  org.apache.maven.its.plugins:maven-it-plugin-class-loader:maven-plugin:2.1-SNAPSHOT
from the specified remote repositories:
  central (file:target/null, releases=true, snapshots=true),
  Nexus (http://repository.sonatype.org:8081/content/groups/sonatype-public-grid, releases=true,
snapshots=false)
	at org.apache.maven.plugin.internal.DefaultPluginDependenciesResolver.resolve(DefaultPluginDependenciesResolver.java:131)
	at org.apache.maven.plugin.internal.DefaultMavenPluginManager.createPluginRealm(DefaultMavenPluginManager.java:328)
	at org.apache.maven.plugin.internal.DefaultMavenPluginManager.setupPluginRealm(DefaultMavenPluginManager.java:276)
	at org.apache.maven.plugin.DefaultBuildPluginManager.getPluginRealm(DefaultBuildPluginManager.java:189)
	at org.apache.maven.plugin.DefaultBuildPluginManager.executeMojo(DefaultBuildPluginManager.java:85)
	... 20 more
Caused by: org.apache.maven.artifact.resolver.MultipleArtifactsNotFoundException: Missing:
----------
1) org.apache.maven.its.plugins.class-loader:dep-c:jar:2.1-SNAPSHOT
  Try downloading the file manually from the project website.
  Then, install it using the command: 
      mvn install:install-file -DgroupId=org.apache.maven.its.plugins.class-loader -DartifactId=dep-c
-Dversion=2.1-SNAPSHOT -Dpackaging=jar -Dfile=/path/to/file
  Alternatively, if you host your own repository you can deploy the file there: 
      mvn deploy:deploy-file -DgroupId=org.apache.maven.its.plugins.class-loader -DartifactId=dep-c
-Dversion=2.1-SNAPSHOT -Dpackaging=jar -Dfile=/path/to/file -Durl=[url] -DrepositoryId=[id]
  Path to dependency: 
  	1) org.apache.maven.its.plugins:maven-it-plugin-class-loader:maven-plugin:2.1-SNAPSHOT
  	2) org.apache.maven.its.plugins.class-loader:dep-c:jar:2.1-SNAPSHOT
----------
1 required artifact is missing.
for artifact: 
  org.apache.maven.its.plugins:maven-it-plugin-class-loader:maven-plugin:2.1-SNAPSHOT
from the specified remote repositories:
  central (file:target/null, releases=true, snapshots=true),
  Nexus (http://repository.sonatype.org:8081/content/groups/sonatype-public-grid, releases=true,
snapshots=false)
	at org.apache.maven.artifact.resolver.DefaultResolutionErrorHandler.throwErrors(DefaultResolutionErrorHandler.java:71)
	at org.apache.maven.plugin.internal.DefaultPluginDependenciesResolver.resolve(DefaultPluginDependenciesResolver.java:127)
	... 24 more
[ERROR] 
[ERROR] Re-run Maven using the -X switch to enable full debug logging.
[ERROR] 
[ERROR] For more information about the errors and possible solutions, please read the following
articles:
[ERROR] [Help 1] http://cwiki.apache.org/confluence/display/MAVEN/PluginResolutionException
EMMA: locking coverage output file [<http://grid.sonatype.org/ci/job/maven-3.0.x-ITs/./jdk=1.5,label=ubuntu/ws/core-integration-tests/target/test-classes/mng-4747/coverage.ec]>
...
EMMA: runtime coverage data merged into [<http://grid.sonatype.org/ci/job/maven-3.0.x-ITs/./jdk=1.5,label=ubuntu/ws/core-integration-tests/target/test-classes/mng-4747/coverage.ec]>
{in 203 ms}
	at org.apache.maven.it.Verifier.executeGoals(Verifier.java:1348)
	at org.apache.maven.it.Verifier.executeGoal(Verifier.java:1191)
	at org.apache.maven.it.Verifier.executeGoal(Verifier.java:1185)
	at org.apache.maven.it.MavenITmng4747JavaAgentUsedByPluginTest.testit(MavenITmng4747JavaAgentUsedByPluginTest.java:57)
	at sun.reflect.NativeMethodAccessorImpl.invoke0(Native Method)
	at sun.reflect.NativeMethodAccessorImpl.invoke(NativeMethodAccessorImpl.java:39)
	at sun.reflect.DelegatingMethodAccessorImpl.invoke(DelegatingMethodAccessorImpl.java:25)
	at java.lang.reflect.Method.invoke(Method.java:585)
	at junit.framework.TestCase.runTest(TestCase.java:164)
	at org.apache.maven.it.AbstractMavenIntegrationTestCase.runTest(AbstractMavenIntegrationTestCase.java:198)
	at junit.framework.TestCase.runBare(TestCase.java:130)
	at junit.framework.TestResult$1.protect(TestResult.java:106)
	at junit.framework.TestResult.runProtected(TestResult.java:124)
	at junit.framework.TestResult.run(TestResult.java:109)
	at junit.framework.TestCase.run(TestCase.java:120)
	at junit.framework.TestSuite.runTest(TestSuite.java:230)
	at junit.framework.TestSuite.run(TestSuite.java:225)
	at junit.framework.TestSuite.runTest(TestSuite.java:230)
	at junit.framework.TestSuite.run(TestSuite.java:225)
	at sun.reflect.NativeMethodAccessorImpl.invoke0(Native Method)
	at sun.reflect.NativeMethodAccessorImpl.invoke(NativeMethodAccessorImpl.java:39)
	at sun.reflect.DelegatingMethodAccessorImpl.invoke(DelegatingMethodAccessorImpl.java:25)
	at java.lang.reflect.Method.invoke(Method.java:585)
	at org.apache.maven.surefire.junit.JUnitTestSet.execute(JUnitTestSet.java:213)
	at org.apache.maven.surefire.suite.AbstractDirectoryTestSuite.executeTestSet(AbstractDirectoryTestSuite.java:140)
	at org.apache.maven.surefire.suite.AbstractDirectoryTestSuite.execute(AbstractDirectoryTestSuite.java:127)
	at org.apache.maven.surefire.Surefire.run(Surefire.java:177)
	at sun.reflect.NativeMethodAccessorImpl.invoke0(Native Method)
	at sun.reflect.NativeMethodAccessorImpl.invoke(NativeMethodAccessorImpl.java:39)
	at sun.reflect.DelegatingMethodAccessorImpl.invoke(DelegatingMethodAccessorImpl.java:25)
	at java.lang.reflect.Method.invoke(Method.java:585)
	at org.apache.maven.surefire.booter.SurefireBooter.runSuitesInProcess(SurefireBooter.java:345)
	at org.apache.maven.surefire.booter.SurefireBooter.main(SurefireBooter.java:1009)
Caused by: org.apache.maven.plugin.PluginExecutionException: Execution test of goal org.apache.maven.its.plugins:maven-it-plugin-class-loader:2.1-SNAPSHOT:load
failed: Plugin org.apache.maven.its.plugins:maven-it-plugin-class-loader:2.1-SNAPSHOT or one
of its dependencies could not be resolved: Missing:
----------
1) org.apache.maven.its.plugins.class-loader:dep-c:jar:2.1-SNAPSHOT
  Try downloading the file manually from the project website.
  Then, install it using the command: 
      mvn install:install-file -DgroupId=org.apache.maven.its.plugins.class-loader -DartifactId=dep-c
-Dversion=2.1-SNAPSHOT -Dpackaging=jar -Dfile=/path/to/file
  Alternatively, if you host your own repository you can deploy the file there: 
      mvn deploy:deploy-file -DgroupId=org.apache.maven.its.plugins.class-loader -DartifactId=dep-c
-Dversion=2.1-SNAPSHOT -Dpackaging=jar -Dfile=/path/to/file -Durl=[url] -DrepositoryId=[id]
  Path to dependency: 
  	1) org.apache.maven.its.plugins:maven-it-plugin-class-loader:maven-plugin:2.1-SNAPSHOT
  	2) org.apache.maven.its.plugins.class-loader:dep-c:jar:2.1-SNAPSHOT
----------
1 required artifact is missing.
for artifact: 
  org.apache.maven.its.plugins:maven-it-plugin-class-loader:maven-plugin:2.1-SNAPSHOT
from the specified remote repositories:
  central (file:target/null, releases=true, snapshots=true),
  Nexus (http://repository.sonatype.org:8081/content/groups/sonatype-public-grid, releases=true,
snapshots=false)
	at org.apache.maven.plugin.DefaultBuildPluginManager.executeMojo(DefaultBuildPluginManager.java:89)
	at org.apache.maven.lifecycle.internal.MojoExecutor.execute(MojoExecutor.java:144)
	... 19 more
Caused by: org.apache.maven.plugin.PluginResolutionException: Plugin org.apache.maven.its.plugins:maven-it-plugin-class-loader:2.1-SNAPSHOT
or one of its dependencies could not be resolved: Missing:
----------
1) org.apache.maven.its.plugins.class-loader:dep-c:jar:2.1-SNAPSHOT
  Try downloading the file manually from the project website.
  Then, install it using the command: 
      mvn install:install-file -DgroupId=org.apache.maven.its.plugins.class-loader -DartifactId=dep-c
-Dversion=2.1-SNAPSHOT -Dpackaging=jar -Dfile=/path/to/file
  Alternatively, if you host your own repository you can deploy the file there: 
      mvn deploy:deploy-file -DgroupId=org.apache.maven.its.plugins.class-loader -DartifactId=dep-c
-Dversion=2.1-SNAPSHOT -Dpackaging=jar -Dfile=/path/to/file -Durl=[url] -DrepositoryId=[id]
  Path to dependency: 
  	1) org.apache.maven.its.plugins:maven-it-plugin-class-loader:maven-plugin:2.1-SNAPSHOT
  	2) org.apache.maven.its.plugins.class-loader:dep-c:jar:2.1-SNAPSHOT
----------
1 required artifact is missing.
for artifact: 
  org.apache.maven.its.plugins:maven-it-plugin-class-loader:maven-plugin:2.1-SNAPSHOT
from the specified remote repositories:
  central (file:target/null, releases=true, snapshots=true),
  Nexus (http://repository.sonatype.org:8081/content/groups/sonatype-public-grid, releases=true,
snapshots=false)
	at org.apache.maven.plugin.internal.DefaultPluginDependenciesResolver.resolve(DefaultPluginDependenciesResolver.java:131)
	at org.apache.maven.plugin.internal.DefaultMavenPluginManager.createPluginRealm(DefaultMavenPluginManager.java:328)
	at org.apache.maven.plugin.internal.DefaultMavenPluginManager.setupPluginRealm(DefaultMavenPluginManager.java:276)
	at org.apache.maven.plugin.DefaultBuildPluginManager.getPluginRealm(DefaultBuildPluginManager.java:189)
	at org.apache.maven.plugin.DefaultBuildPluginManager.executeMojo(DefaultBuildPluginManager.java:85)
	... 20 more
Caused by: org.apache.maven.artifact.resolver.MultipleArtifactsNotFoundException: Missing:
----------
1) org.apache.maven.its.plugins.class-loader:dep-c:jar:2.1-SNAPSHOT
  Try downloading the file manually from the project website.
  Then, install it using the command: 
      mvn install:install-file -DgroupId=org.apache.maven.its.plugins.class-loader -DartifactId=dep-c
-Dversion=2.1-SNAPSHOT -Dpackaging=jar -Dfile=/path/to/file
  Alternatively, if you host your own repository you can deploy the file there: 
      mvn deploy:deploy-file -DgroupId=org.apache.maven.its.plugins.class-loader -DartifactId=dep-c
-Dversion=2.1-SNAPSHOT -Dpackaging=jar -Dfile=/path/to/file -Durl=[url] -DrepositoryId=[id]
  Path to dependency: 
  	1) org.apache.maven.its.plugins:maven-it-plugin-class-loader:maven-plugin:2.1-SNAPSHOT
  	2) org.apache.maven.its.plugins.class-loader:dep-c:jar:2.1-SNAPSHOT
----------
1 required artifact is missing.
for artifact: 
  org.apache.maven.its.plugins:maven-it-plugin-class-loader:maven-plugin:2.1-SNAPSHOT
from the specified remote repositories:
  central (file:target/null, releases=true, snapshots=true),
  Nexus (http://repository.sonatype.org:8081/content/groups/sonatype-public-grid, releases=true,
snapshots=false)
	at org.apache.maven.artifact.resolver.DefaultResolutionErrorHandler.throwErrors(DefaultResolutionErrorHandler.java:71)
	at org.apache.maven.plugin.internal.DefaultPluginDependenciesResolver.resolve(DefaultPluginDependenciesResolver.java:127)
	... 24 more
[ERROR] 
[ERROR] Re-run Maven using the -X switch to enable full debug logging.
[ERROR] 
[ERROR] For more information about the errors and possible solutions, please read the following
articles:
[ERROR] [Help 1] http://cwiki.apache.org/confluence/display/MAVEN/PluginResolutionException
EMMA: locking coverage output file [<http://grid.sonatype.org/ci/job/maven-3.0.x-ITs/./jdk=1.5,label=ubuntu/ws/core-integration-tests/target/test-classes/mng-4747/coverage.ec]>
...
EMMA: runtime coverage data merged into [<http://grid.sonatype.org/ci/job/maven-3.0.x-ITs/./jdk=1.5,label=ubuntu/ws/core-integration-tests/target/test-classes/mng-4747/coverage.ec]>
{in 203 ms}
	at org.apache.maven.it.Verifier.executeGoals(Verifier.java:1348)
	at org.apache.maven.it.Verifier.executeGoal(Verifier.java:1191)
	at org.apache.maven.it.Verifier.executeGoal(Verifier.java:1185)
	at org.apache.maven.it.MavenITmng4747JavaAgentUsedByPluginTest.testit(MavenITmng4747JavaAgentUsedByPluginTest.java:57)
	at sun.reflect.NativeMethodAccessorImpl.invoke0(Native Method)
	at sun.reflect.NativeMethodAccessorImpl.invoke(NativeMethodAccessorImpl.java:39)
	at sun.reflect.DelegatingMethodAccessorImpl.invoke(DelegatingMethodAccessorImpl.java:25)
	at java.lang.reflect.Method.invoke(Method.java:585)
	at junit.framework.TestCase.runTest(TestCase.java:164)
	at org.apache.maven.it.AbstractMavenIntegrationTestCase.runTest(AbstractMavenIntegrationTestCase.java:198)
	at junit.framework.TestCase.runBare(TestCase.java:130)
	at junit.framework.TestResult$1.protect(TestResult.java:106)
	at junit.framework.TestResult.runProtected(TestResult.java:124)
	at junit.framework.TestResult.run(TestResult.java:109)
	at junit.framework.TestCase.run(TestCase.java:120)
	at junit.framework.TestSuite.runTest(TestSuite.java:230)
	at junit.framework.TestSuite.run(TestSuite.java:225)
	at junit.framework.TestSuite.runTest(TestSuite.java:230)
	at junit.framework.TestSuite.run(TestSuite.java:225)
	at sun.reflect.NativeMethodAccessorImpl.invoke0(Native Method)
	at sun.reflect.NativeMethodAccessorImpl.invoke(NativeMethodAccessorImpl.java:39)
	at sun.reflect.DelegatingMethodAccessorImpl.invoke(DelegatingMethodAccessorImpl.java:25)
	at java.lang.reflect.Method.invoke(Method.java:585)
	at org.apache.maven.surefire.junit.JUnitTestSet.execute(JUnitTestSet.java:213)
	at org.apache.maven.surefire.suite.AbstractDirectoryTestSuite.executeTestSet(AbstractDirectoryTestSuite.java:140)
	at org.apache.maven.surefire.suite.AbstractDirectoryTestSuite.execute(AbstractDirectoryTestSuite.java:127)
	at org.apache.maven.surefire.Surefire.run(Surefire.java:177)
	at sun.reflect.NativeMethodAccessorImpl.invoke0(Native Method)
	at sun.reflect.NativeMethodAccessorImpl.invoke(NativeMethodAccessorImpl.java:39)
	at sun.reflect.DelegatingMethodAccessorImpl.invoke(DelegatingMethodAccessorImpl.java:25)
	at java.lang.reflect.Method.invoke(Method.java:585)
	at org.apache.maven.surefire.booter.SurefireBooter.runSuitesInProcess(SurefireBooter.java:345)
	at org.apache.maven.surefire.booter.SurefireBooter.main(SurefireBooter.java:1009)


Results :

Tests in error: 
  testit(org.apache.maven.it.MavenITmng4747JavaAgentUsedByPluginTest)

Tests run: 611, Failures: 0, Errors: 1, Skipped: 0

[INFO] ------------------------------------------------------------------------
[INFO] BUILD FAILURE
[INFO] ------------------------------------------------------------------------
[INFO] Total time: 26:39.805s
[INFO] Finished at: Sat Aug 07 03:44:49 GMT-06:00 2010
[INFO] Final Memory: 7M/64M
[INFO] ------------------------------------------------------------------------
[ERROR] Failed to execute goal org.apache.maven.plugins:maven-surefire-plugin:2.4.3:test (default-test)
on project core-it-suite: There are test failures.

Please refer to <http://grid.sonatype.org/ci/job/maven-3.0.x-ITs/./jdk=1.5,label=ubuntu/ws/core-integration-tests/target/surefire-reports>
for the individual test results.
-> [Help 1]
org.apache.maven.lifecycle.LifecycleExecutionException: Failed to execute goal org.apache.maven.plugins:maven-surefire-plugin:2.4.3:test
(default-test) on project core-it-suite: There are test failures.

Please refer to <http://grid.sonatype.org/ci/job/maven-3.0.x-ITs/./jdk=1.5,label=ubuntu/ws/core-integration-tests/target/surefire-reports>
for the individual test results.
	at org.apache.maven.lifecycle.internal.MojoExecutor.execute(MojoExecutor.java:148)
	at org.apache.maven.lifecycle.internal.MojoExecutor.execute(MojoExecutor.java:87)
	at org.apache.maven.lifecycle.internal.MojoExecutor.execute(MojoExecutor.java:79)
	at org.apache.maven.lifecycle.internal.LifecycleModuleBuilder.buildProject(LifecycleModuleBuilder.java:86)
	at org.apache.maven.lifecycle.internal.LifecycleModuleBuilder.buildProject(LifecycleModuleBuilder.java:58)
	at org.apache.maven.lifecycle.internal.LifecycleStarter.singleThreadedBuild(LifecycleStarter.java:183)
	at org.apache.maven.lifecycle.internal.LifecycleStarter.execute(LifecycleStarter.java:161)
	at org.apache.maven.DefaultMaven.doExecute(DefaultMaven.java:252)
	at org.apache.maven.DefaultMaven.execute(DefaultMaven.java:100)
	at org.apache.maven.cli.MavenCli.execute(MavenCli.java:443)
	at org.apache.maven.cli.MavenCli.doMain(MavenCli.java:166)
	at org.apache.maven.cli.MavenCli.main(MavenCli.java:130)
	at sun.reflect.NativeMethodAccessorImpl.invoke0(Native Method)
	at sun.reflect.NativeMethodAccessorImpl.invoke(NativeMethodAccessorImpl.java:39)
	at sun.reflect.DelegatingMethodAccessorImpl.invoke(DelegatingMethodAccessorImpl.java:25)
	at java.lang.reflect.Method.invoke(Method.java:585)
	at org.codehaus.plexus.classworlds.launcher.Launcher.launchEnhanced(Launcher.java:290)
	at org.codehaus.plexus.classworlds.launcher.Launcher.launch(Launcher.java:230)
	at org.codehaus.plexus.classworlds.launcher.Launcher.mainWithExitCode(Launcher.java:409)
	at org.codehaus.plexus.classworlds.launcher.Launcher.main(Launcher.java:352)
Caused by: org.apache.maven.plugin.MojoFailureException: There are test failures.

Please refer to <http://grid.sonatype.org/ci/job/maven-3.0.x-ITs/./jdk=1.5,label=ubuntu/ws/core-integration-tests/target/surefire-reports>
for the individual test results.
	at org.apache.maven.plugin.surefire.SurefirePlugin.execute(SurefirePlugin.java:575)
	at org.apache.maven.plugin.DefaultBuildPluginManager.executeMojo(DefaultBuildPluginManager.java:110)
	at org.apache.maven.lifecycle.internal.MojoExecutor.execute(MojoExecutor.java:144)
	... 19 more
[ERROR] 
[ERROR] Re-run Maven using the -X switch to enable full debug logging.
[ERROR] 
[ERROR] For more information about the errors and possible solutions, please read the following
articles:
[ERROR] [Help 1] http://cwiki.apache.org/confluence/display/MAVEN/MojoFailureException
Emma: looking for coverage reports in the provided path: core-integration-tests/target/site/emma/coverage.xml


Mime
View raw message