maven-notifications mailing list archives

Site index · List index
Message view « Date » · « Thread »
Top « Date » · « Thread »
From Hudson <Hud...@sonatype.org>
Subject Build failed in Hudson: maven-3.0.x-ITs » 1.5,windows #332
Date Wed, 25 Aug 2010 12:33:23 GMT
See <http://grid.sonatype.org/ci/job/maven-3.0.x-ITs/./jdk=1.5,label=windows/332/changes>

Changes:

[Benjamin Bentmann] o Enabled IT for Maven 3.x

[Benjamin Bentmann] o Ensured IT tests the proper code path

------------------------------------------
[...truncated 5794 lines...]
	at org.sonatype.aether.impl.internal.DefaultRepositorySystem.resolveArtifacts(DefaultRepositorySystem.java:231)
	at org.sonatype.aether.impl.internal.DefaultRepositorySystem.resolveDependencies(DefaultRepositorySystem.java:256)
	at org.apache.maven.plugin.internal.DefaultPluginDependenciesResolver.resolve(DefaultPluginDependenciesResolver.java:155)
	... 53 more
Caused by: org.sonatype.aether.transfer.ArtifactNotFoundException: Could not find artifact
org.apache.maven.its:maven-core-it-support:jar:1.0 in maven-core-it (file:///C:/home/hudson/workspace/maven-3.0.x-ITs/jdk/1.5/label/windows/core-integration-tests/target/test-classes/mng-0449/lifecycle/../repo,
releases=true, snapshots=true, managed=false)
	at org.sonatype.aether.connector.wagon.WagonRepositoryConnector$4.wrap(WagonRepositoryConnector.java:840)
	at org.sonatype.aether.connector.wagon.WagonRepositoryConnector$4.wrap(WagonRepositoryConnector.java:835)
	at org.sonatype.aether.connector.wagon.WagonRepositoryConnector$GetTask.flush(WagonRepositoryConnector.java:600)
	at org.sonatype.aether.connector.wagon.WagonRepositoryConnector$GetTask.flush(WagonRepositoryConnector.java:594)
	at org.sonatype.aether.connector.wagon.WagonRepositoryConnector.get(WagonRepositoryConnector.java:359)
	at org.sonatype.aether.impl.internal.DefaultArtifactResolver.resolveArtifacts(DefaultArtifactResolver.java:350)
	... 56 more
[ERROR] 
[ERROR] Re-run Maven using the -X switch to enable full debug logging.
[ERROR] 
[ERROR] For more information about the errors and possible solutions, please read the following
articles:
[ERROR] [Help 1] http://cwiki.apache.org/confluence/display/MAVEN/ProjectBuildingException
[ERROR] [Help 2] http://cwiki.apache.org/confluence/display/MAVEN/PluginResolutionException

	at org.apache.maven.it.Verifier.executeGoals(Verifier.java:1348)
	at org.apache.maven.it.Verifier.executeGoal(Verifier.java:1191)
	at org.apache.maven.it.Verifier.executeGoal(Verifier.java:1185)
	at org.apache.maven.it.MavenITmng0449PluginVersionResolutionTest.testitLifecycleInvocation(MavenITmng0449PluginVersionResolutionTest.java:66)
	at sun.reflect.NativeMethodAccessorImpl.invoke0(Native Method)
	at sun.reflect.NativeMethodAccessorImpl.invoke(NativeMethodAccessorImpl.java:39)
	at sun.reflect.DelegatingMethodAccessorImpl.invoke(DelegatingMethodAccessorImpl.java:25)
	at java.lang.reflect.Method.invoke(Method.java:585)
	at junit.framework.TestCase.runTest(TestCase.java:164)
	at org.apache.maven.it.AbstractMavenIntegrationTestCase.runTest(AbstractMavenIntegrationTestCase.java:220)
	at junit.framework.TestCase.runBare(TestCase.java:130)
	at junit.framework.TestResult$1.protect(TestResult.java:106)
	at junit.framework.TestResult.runProtected(TestResult.java:124)
	at junit.framework.TestResult.run(TestResult.java:109)
	at junit.framework.TestCase.run(TestCase.java:120)
	at junit.framework.TestSuite.runTest(TestSuite.java:230)
	at junit.framework.TestSuite.run(TestSuite.java:225)
	at junit.framework.TestSuite.runTest(TestSuite.java:230)
	at junit.framework.TestSuite.run(TestSuite.java:225)
	at sun.reflect.NativeMethodAccessorImpl.invoke0(Native Method)
	at sun.reflect.NativeMethodAccessorImpl.invoke(NativeMethodAccessorImpl.java:39)
	at sun.reflect.DelegatingMethodAccessorImpl.invoke(DelegatingMethodAccessorImpl.java:25)
	at java.lang.reflect.Method.invoke(Method.java:585)
	at org.apache.maven.surefire.junit.JUnitTestSet.execute(JUnitTestSet.java:213)
	at org.apache.maven.surefire.suite.AbstractDirectoryTestSuite.executeTestSet(AbstractDirectoryTestSuite.java:140)
	at org.apache.maven.surefire.suite.AbstractDirectoryTestSuite.execute(AbstractDirectoryTestSuite.java:127)
	at org.apache.maven.surefire.Surefire.run(Surefire.java:177)
	at sun.reflect.NativeMethodAccessorImpl.invoke0(Native Method)
	at sun.reflect.NativeMethodAccessorImpl.invoke(NativeMethodAccessorImpl.java:39)
	at sun.reflect.DelegatingMethodAccessorImpl.invoke(DelegatingMethodAccessorImpl.java:25)
	at java.lang.reflect.Method.invoke(Method.java:585)
	at org.apache.maven.surefire.booter.SurefireBooter.runSuitesInProcess(SurefireBooter.java:345)
	at org.apache.maven.surefire.booter.SurefireBooter.main(SurefireBooter.java:1009)

testit0113(org.apache.maven.it.MavenIT0113ServerAuthzAvailableToWagonMgrInPluginTest)  Time
elapsed: 0.752 sec  <<< ERROR!
org.apache.maven.it.VerificationException: Exit code was non-zero: 1; command line and log
= 
C:\home\hudson\workspace\maven-3.0.x-ITs\jdk\1.5\label\windows\core-integration-tests\target\distro\bin\mvn
--global-settings C:\home\hudson\workspace\maven-3.0.x-ITs\jdk\1.5\label\windows\core-integration-tests\target\test-classes\settings.xml
--settings settings.xml -e --batch-mode -Dmaven.repo.local=C:\opt\repos\local-repository validate
[INFO] Error stacktraces are turned on.
[INFO] Scanning for projects...
[INFO]                                                                         
[INFO] ------------------------------------------------------------------------
[INFO] Building test 1.0-SNAPSHOT
[INFO] ------------------------------------------------------------------------
[INFO] 
[INFO] --- maven-it-plugin-uses-wagon:2.1-SNAPSHOT:dump-auth (test) @ test ---
Downloading: file:target/null/org/apache/maven/wagon/wagon-ssh/1.0-beta-2/wagon-ssh-1.0-beta-2.pom
[WARNING] The POM for org.apache.maven.wagon:wagon-ssh:jar:1.0-beta-2 is missing, no dependency
information available
Downloading: file:target/null/org/apache/maven/wagon/wagon-file/1.0-beta-2/wagon-file-1.0-beta-2.pom
[WARNING] The POM for org.apache.maven.wagon:wagon-file:jar:1.0-beta-2 is missing, no dependency
information available
Downloading: file:target/null/org/apache/maven/wagon/wagon-ssh/1.0-beta-2/wagon-ssh-1.0-beta-2.jar
Downloading: file:target/null/org/apache/maven/wagon/wagon-file/1.0-beta-2/wagon-file-1.0-beta-2.jar
[INFO] ------------------------------------------------------------------------
[INFO] BUILD FAILURE
[INFO] ------------------------------------------------------------------------
[INFO] Total time: 0.209s
[INFO] Finished at: Wed Aug 25 05:33:07 PDT 2010
[INFO] Final Memory: 84M/151M
[INFO] ------------------------------------------------------------------------
[ERROR] Failed to execute goal org.apache.maven.its.plugins:maven-it-plugin-uses-wagon:2.1-SNAPSHOT:dump-auth
(test) on project test: Execution test of goal org.apache.maven.its.plugins:maven-it-plugin-uses-wagon:2.1-SNAPSHOT:dump-auth
failed: Plugin org.apache.maven.its.plugins:maven-it-plugin-uses-wagon:2.1-SNAPSHOT or one
of its dependencies could not be resolved: The following artifacts could not be resolved:
org.apache.maven.wagon:wagon-ssh:jar:1.0-beta-2, org.apache.maven.wagon:wagon-file:jar:1.0-beta-2:
Could not find artifact org.apache.maven.wagon:wagon-ssh:jar:1.0-beta-2 in central (file:target/null,
releases=true, snapshots=true, managed=false) -> [Help 1]
org.apache.maven.lifecycle.LifecycleExecutionException: Failed to execute goal org.apache.maven.its.plugins:maven-it-plugin-uses-wagon:2.1-SNAPSHOT:dump-auth
(test) on project test: Execution test of goal org.apache.maven.its.plugins:maven-it-plugin-uses-wagon:2.1-SNAPSHOT:dump-auth
failed: Plugin org.apache.maven.its.plugins:maven-it-plugin-uses-wagon:2.1-SNAPSHOT or one
of its dependencies could not be resolved: The following artifacts could not be resolved:
org.apache.maven.wagon:wagon-ssh:jar:1.0-beta-2, org.apache.maven.wagon:wagon-file:jar:1.0-beta-2:
Could not find artifact org.apache.maven.wagon:wagon-ssh:jar:1.0-beta-2 in central (file:target/null,
releases=true, snapshots=true, managed=false)
	at org.apache.maven.lifecycle.internal.MojoExecutor.execute(MojoExecutor.java:161)
	at org.apache.maven.lifecycle.internal.MojoExecutor.execute(MojoExecutor.java:88)
	at org.apache.maven.lifecycle.internal.MojoExecutor.execute(MojoExecutor.java:80)
	at org.apache.maven.lifecycle.internal.LifecycleModuleBuilder.buildProject(LifecycleModuleBuilder.java:87)
	at org.apache.maven.lifecycle.internal.LifecycleModuleBuilder.buildProject(LifecycleModuleBuilder.java:59)
	at org.apache.maven.lifecycle.internal.LifecycleStarter.singleThreadedBuild(LifecycleStarter.java:183)
	at org.apache.maven.lifecycle.internal.LifecycleStarter.execute(LifecycleStarter.java:161)
	at org.apache.maven.DefaultMaven.doExecute(DefaultMaven.java:310)
	at org.apache.maven.DefaultMaven.execute(DefaultMaven.java:147)
	at org.apache.maven.cli.MavenCli.execute(MavenCli.java:444)
	at org.apache.maven.cli.MavenCli.doMain(MavenCli.java:167)
	at org.apache.maven.cli.MavenCli.doMain(MavenCli.java:149)
	at sun.reflect.GeneratedMethodAccessor7.invoke(Unknown Source)
	at sun.reflect.DelegatingMethodAccessorImpl.invoke(DelegatingMethodAccessorImpl.java:25)
	at java.lang.reflect.Method.invoke(Method.java:585)
	at org.apache.maven.it.Embedded3xLauncher.run(Embedded3xLauncher.java:176)
	at org.apache.maven.it.Verifier.executeGoals(Verifier.java:1326)
	at org.apache.maven.it.Verifier.executeGoal(Verifier.java:1191)
	at org.apache.maven.it.Verifier.executeGoal(Verifier.java:1185)
	at org.apache.maven.it.MavenIT0113ServerAuthzAvailableToWagonMgrInPluginTest.testit0113(MavenIT0113ServerAuthzAvailableToWagonMgrInPluginTest.java:50)
Caused by: org.apache.maven.plugin.PluginExecutionException: Execution test of goal org.apache.maven.its.plugins:maven-it-plugin-uses-wagon:2.1-SNAPSHOT:dump-auth
failed: Plugin org.apache.maven.its.plugins:maven-it-plugin-uses-wagon:2.1-SNAPSHOT or one
of its dependencies could not be resolved: The following artifacts could not be resolved:
org.apache.maven.wagon:wagon-ssh:jar:1.0-beta-2, org.apache.maven.wagon:wagon-file:jar:1.0-beta-2:
Could not find artifact org.apache.maven.wagon:wagon-ssh:jar:1.0-beta-2 in central (file:target/null,
releases=true, snapshots=true, managed=false)
	at org.apache.maven.plugin.DefaultBuildPluginManager.executeMojo(DefaultBuildPluginManager.java:86)
	at org.apache.maven.lifecycle.internal.MojoExecutor.execute(MojoExecutor.java:145)
	... 48 more
Caused by: org.apache.maven.plugin.PluginResolutionException: Plugin org.apache.maven.its.plugins:maven-it-plugin-uses-wagon:2.1-SNAPSHOT
or one of its dependencies could not be resolved: The following artifacts could not be resolved:
org.apache.maven.wagon:wagon-ssh:jar:1.0-beta-2, org.apache.maven.wagon:wagon-file:jar:1.0-beta-2:
Could not find artifact org.apache.maven.wagon:wagon-ssh:jar:1.0-beta-2 in central (file:target/null,
releases=true, snapshots=true, managed=false)
	at org.apache.maven.plugin.internal.DefaultPluginDependenciesResolver.resolve(DefaultPluginDependenciesResolver.java:163)
	at org.apache.maven.plugin.internal.DefaultMavenPluginManager.createPluginRealm(DefaultMavenPluginManager.java:316)
	at org.apache.maven.plugin.internal.DefaultMavenPluginManager.setupPluginRealm(DefaultMavenPluginManager.java:284)
	at org.apache.maven.plugin.DefaultBuildPluginManager.getPluginRealm(DefaultBuildPluginManager.java:186)
	at org.apache.maven.plugin.DefaultBuildPluginManager.executeMojo(DefaultBuildPluginManager.java:82)
	... 49 more
Caused by: org.sonatype.aether.resolution.ArtifactResolutionException: The following artifacts
could not be resolved: org.apache.maven.wagon:wagon-ssh:jar:1.0-beta-2, org.apache.maven.wagon:wagon-file:jar:1.0-beta-2:
Could not find artifact org.apache.maven.wagon:wagon-ssh:jar:1.0-beta-2 in central (file:target/null,
releases=true, snapshots=true, managed=false)
	at org.sonatype.aether.impl.internal.DefaultArtifactResolver.resolveArtifacts(DefaultArtifactResolver.java:424)
	at org.sonatype.aether.impl.internal.DefaultRepositorySystem.resolveArtifacts(DefaultRepositorySystem.java:231)
	at org.sonatype.aether.impl.internal.DefaultRepositorySystem.resolveDependencies(DefaultRepositorySystem.java:256)
	at org.apache.maven.plugin.internal.DefaultPluginDependenciesResolver.resolve(DefaultPluginDependenciesResolver.java:155)
	... 53 more
Caused by: org.sonatype.aether.transfer.ArtifactNotFoundException: Could not find artifact
org.apache.maven.wagon:wagon-ssh:jar:1.0-beta-2 in central (file:target/null, releases=true,
snapshots=true, managed=false)
	at org.sonatype.aether.connector.wagon.WagonRepositoryConnector$4.wrap(WagonRepositoryConnector.java:840)
	at org.sonatype.aether.connector.wagon.WagonRepositoryConnector$4.wrap(WagonRepositoryConnector.java:835)
	at org.sonatype.aether.connector.wagon.WagonRepositoryConnector$GetTask.flush(WagonRepositoryConnector.java:600)
	at org.sonatype.aether.connector.wagon.WagonRepositoryConnector$GetTask.flush(WagonRepositoryConnector.java:594)
	at org.sonatype.aether.connector.wagon.WagonRepositoryConnector.get(WagonRepositoryConnector.java:359)
	at org.sonatype.aether.impl.internal.DefaultArtifactResolver.resolveArtifacts(DefaultArtifactResolver.java:350)
	... 56 more
[ERROR] 
[ERROR] Re-run Maven using the -X switch to enable full debug logging.
[ERROR] 
[ERROR] For more information about the errors and possible solutions, please read the following
articles:
[ERROR] [Help 1] http://cwiki.apache.org/confluence/display/MAVEN/PluginResolutionException

	at org.apache.maven.it.Verifier.executeGoals(Verifier.java:1348)
	at org.apache.maven.it.Verifier.executeGoal(Verifier.java:1191)
	at org.apache.maven.it.Verifier.executeGoal(Verifier.java:1185)
	at org.apache.maven.it.MavenIT0113ServerAuthzAvailableToWagonMgrInPluginTest.testit0113(MavenIT0113ServerAuthzAvailableToWagonMgrInPluginTest.java:50)
	at sun.reflect.NativeMethodAccessorImpl.invoke0(Native Method)
	at sun.reflect.NativeMethodAccessorImpl.invoke(NativeMethodAccessorImpl.java:39)
	at sun.reflect.DelegatingMethodAccessorImpl.invoke(DelegatingMethodAccessorImpl.java:25)
	at java.lang.reflect.Method.invoke(Method.java:585)
	at junit.framework.TestCase.runTest(TestCase.java:164)
	at org.apache.maven.it.AbstractMavenIntegrationTestCase.runTest(AbstractMavenIntegrationTestCase.java:220)
	at junit.framework.TestCase.runBare(TestCase.java:130)
	at junit.framework.TestResult$1.protect(TestResult.java:106)
	at junit.framework.TestResult.runProtected(TestResult.java:124)
	at junit.framework.TestResult.run(TestResult.java:109)
	at junit.framework.TestCase.run(TestCase.java:120)
	at junit.framework.TestSuite.runTest(TestSuite.java:230)
	at junit.framework.TestSuite.run(TestSuite.java:225)
	at junit.framework.TestSuite.runTest(TestSuite.java:230)
	at junit.framework.TestSuite.run(TestSuite.java:225)
	at sun.reflect.NativeMethodAccessorImpl.invoke0(Native Method)
	at sun.reflect.NativeMethodAccessorImpl.invoke(NativeMethodAccessorImpl.java:39)
	at sun.reflect.DelegatingMethodAccessorImpl.invoke(DelegatingMethodAccessorImpl.java:25)
	at java.lang.reflect.Method.invoke(Method.java:585)
	at org.apache.maven.surefire.junit.JUnitTestSet.execute(JUnitTestSet.java:213)
	at org.apache.maven.surefire.suite.AbstractDirectoryTestSuite.executeTestSet(AbstractDirectoryTestSuite.java:140)
	at org.apache.maven.surefire.suite.AbstractDirectoryTestSuite.execute(AbstractDirectoryTestSuite.java:127)
	at org.apache.maven.surefire.Surefire.run(Surefire.java:177)
	at sun.reflect.NativeMethodAccessorImpl.invoke0(Native Method)
	at sun.reflect.NativeMethodAccessorImpl.invoke(NativeMethodAccessorImpl.java:39)
	at sun.reflect.DelegatingMethodAccessorImpl.invoke(DelegatingMethodAccessorImpl.java:25)
	at java.lang.reflect.Method.invoke(Method.java:585)
	at org.apache.maven.surefire.booter.SurefireBooter.runSuitesInProcess(SurefireBooter.java:345)
	at org.apache.maven.surefire.booter.SurefireBooter.main(SurefireBooter.java:1009)


Results :

Tests in error: 
  testitABD(org.apache.maven.it.MavenITmng4768NearestMatchConflictResolutionTest)
  testitADB(org.apache.maven.it.MavenITmng4768NearestMatchConflictResolutionTest)
  testitBAD(org.apache.maven.it.MavenITmng4768NearestMatchConflictResolutionTest)
  testitBDA(org.apache.maven.it.MavenITmng4768NearestMatchConflictResolutionTest)
  testitDAB(org.apache.maven.it.MavenITmng4768NearestMatchConflictResolutionTest)
  testitDBA(org.apache.maven.it.MavenITmng4768NearestMatchConflictResolutionTest)
  testit(org.apache.maven.it.MavenITmng4755FetchRemoteMetadataForVersionRangeTest)
  testit(org.apache.maven.it.MavenITmng4750ResolvedMavenProjectDependencyArtifactsTest)
  testitRepoPolicyAlways(org.apache.maven.it.MavenITmng4745PluginVersionUpdateTest)
  testitRepoPolicyNever(org.apache.maven.it.MavenITmng4745PluginVersionUpdateTest)
  testitForceUpdate(org.apache.maven.it.MavenITmng4745PluginVersionUpdateTest)
  testit(org.apache.maven.it.MavenITmng4729MirrorProxyAuthUsedByProjectBuilderTest)
  testit(org.apache.maven.it.MavenITmng4721OptionalPluginDependencyTest)
  testit(org.apache.maven.it.MavenITmng4720DependencyManagementExclusionMergeTest)
  testit(org.apache.maven.it.MavenITmng4696MavenProjectDependencyArtifactsTest)
  testitADX(org.apache.maven.it.MavenITmng4690InterdependentConflictResolutionTest)
  testitAXD(org.apache.maven.it.MavenITmng4690InterdependentConflictResolutionTest)
  testitDAX(org.apache.maven.it.MavenITmng4690InterdependentConflictResolutionTest)
  testitDXA(org.apache.maven.it.MavenITmng4690InterdependentConflictResolutionTest)
  testitXAD(org.apache.maven.it.MavenITmng4690InterdependentConflictResolutionTest)
  testitXDA(org.apache.maven.it.MavenITmng4690InterdependentConflictResolutionTest)
  testit(org.apache.maven.it.MavenITmng4679SnapshotUpdateInPluginTest)
  testit(org.apache.maven.it.MavenITmng4666CoreRealmImportTest)
  testitJackrabbitBasedImpl(org.apache.maven.it.MavenITmng4360WebDavSupportTest)
  testitSlideBasedImpl(org.apache.maven.it.MavenITmng4360WebDavSupportTest)
  testitMNG3805(org.apache.maven.it.MavenITmng3805ExtensionClassPathOrderingTest)
  testitMNG3482(org.apache.maven.it.MavenITmng3482DependencyPomInterpolationTest)
  testitMNG2234(org.apache.maven.it.MavenITmng2234ActiveProfilesFromSettingsTest)
  testitMNG557(org.apache.maven.it.MavenITmng0557UserSettingsCliOptionTest)
  testitLifecycleInvocation(org.apache.maven.it.MavenITmng0449PluginVersionResolutionTest)
  testit0113(org.apache.maven.it.MavenIT0113ServerAuthzAvailableToWagonMgrInPluginTest)

Tests run: 642, Failures: 0, Errors: 31, Skipped: 0

[INFO] ------------------------------------------------------------------------
[INFO] BUILD FAILURE
[INFO] ------------------------------------------------------------------------
[INFO] Total time: 16:42.481s
[INFO] Finished at: Wed Aug 25 05:33:43 PDT 2010
[INFO] Final Memory: 8M/29M
[INFO] ------------------------------------------------------------------------
[ERROR] Failed to execute goal org.apache.maven.plugins:maven-surefire-plugin:2.4.3:test (default-test)
on project core-it-suite: There are test failures.

Please refer to C:\home\hudson\workspace\maven-3.0.x-ITs\jdk\1.5\label\windows\core-integration-tests\target\surefire-reports
for the individual test results.
-> [Help 1]
org.apache.maven.lifecycle.LifecycleExecutionException: Failed to execute goal org.apache.maven.plugins:maven-surefire-plugin:2.4.3:test
(default-test) on project core-it-suite: There are test failures.

Please refer to C:\home\hudson\workspace\maven-3.0.x-ITs\jdk\1.5\label\windows\core-integration-tests\target\surefire-reports
for the individual test results.
	at org.apache.maven.lifecycle.internal.MojoExecutor.execute(MojoExecutor.java:149)
	at org.apache.maven.lifecycle.internal.MojoExecutor.execute(MojoExecutor.java:88)
	at org.apache.maven.lifecycle.internal.MojoExecutor.execute(MojoExecutor.java:80)
	at org.apache.maven.lifecycle.internal.LifecycleModuleBuilder.buildProject(LifecycleModuleBuilder.java:87)
	at org.apache.maven.lifecycle.internal.LifecycleModuleBuilder.buildProject(LifecycleModuleBuilder.java:59)
	at org.apache.maven.lifecycle.internal.LifecycleStarter.singleThreadedBuild(LifecycleStarter.java:183)
	at org.apache.maven.lifecycle.internal.LifecycleStarter.execute(LifecycleStarter.java:161)
	at org.apache.maven.DefaultMaven.doExecute(DefaultMaven.java:310)
	at org.apache.maven.DefaultMaven.execute(DefaultMaven.java:147)
	at org.apache.maven.cli.MavenCli.execute(MavenCli.java:444)
	at org.apache.maven.cli.MavenCli.doMain(MavenCli.java:167)
	at org.apache.maven.cli.MavenCli.main(MavenCli.java:131)
	at sun.reflect.NativeMethodAccessorImpl.invoke0(Native Method)
	at sun.reflect.NativeMethodAccessorImpl.invoke(NativeMethodAccessorImpl.java:39)
	at sun.reflect.DelegatingMethodAccessorImpl.invoke(DelegatingMethodAccessorImpl.java:25)
	at java.lang.reflect.Method.invoke(Method.java:585)
	at org.codehaus.plexus.classworlds.launcher.Launcher.launchEnhanced(Launcher.java:290)
	at org.codehaus.plexus.classworlds.launcher.Launcher.launch(Launcher.java:230)
	at org.codehaus.plexus.classworlds.launcher.Launcher.mainWithExitCode(Launcher.java:409)
	at org.codehaus.plexus.classworlds.launcher.Launcher.main(Launcher.java:352)
Caused by: org.apache.maven.plugin.MojoFailureException: There are test failures.

Please refer to C:\home\hudson\workspace\maven-3.0.x-ITs\jdk\1.5\label\windows\core-integration-tests\target\surefire-reports
for the individual test results.
	at org.apache.maven.plugin.surefire.SurefirePlugin.execute(SurefirePlugin.java:575)
	at org.apache.maven.plugin.DefaultBuildPluginManager.executeMojo(DefaultBuildPluginManager.java:107)
	at org.apache.maven.lifecycle.internal.MojoExecutor.execute(MojoExecutor.java:145)
	... 19 more
[ERROR] 
[ERROR] Re-run Maven using the -X switch to enable full debug logging.
[ERROR] 
[ERROR] For more information about the errors and possible solutions, please read the following
articles:
[ERROR] [Help 1] http://cwiki.apache.org/confluence/display/MAVEN/MojoFailureException
Emma: looking for coverage reports in the provided path: core-integration-tests/target/site/emma/coverage.xml


Mime
View raw message