maven-notifications mailing list archives

Site index · List index
Message view « Date » · « Thread »
Top « Date » · « Thread »
From "GRiD .ORG" <bui...@lists.sonatype.com>
Subject Build failed in Hudson: maven-scm » java-5x,windows #158
Date Sat, 13 Nov 2010 16:22:07 GMT
See <https://grid.sonatype.org/ci/job/maven-scm/./jdk=java-5x,label=windows/158/changes>

Changes:

[Olivier Lamy] fix junits (oups)
upgrade to last parent version

------------------------------------------
[...truncated 2584 lines...]
[INFO] Installing X:\slave\workspace\maven-scm\jdk\java-5x\label\windows\trunk\maven-scm-providers\maven-scm-provider-vss\target\maven-scm-provider-vss-1.5-SNAPSHOT.jar
to x:\slave\workspace\maven-scm\jdk\java-5x\label\windows\.repository\org\apache\maven\scm\maven-scm-provider-vss\1.5-SNAPSHOT\maven-scm-provider-vss-1.5-SNAPSHOT.jar
[INFO] [deploy:deploy {execution: default-deploy}]
[INFO] Retrieving previous build number from apache.snapshots.https
Uploading: file:/opt/repos/deploy-junk/org/apache/maven/scm/maven-scm-provider-vss/1.5-SNAPSHOT/maven-scm-provider-vss-1.5-20101113.161937-2.jar
66K uploaded  (maven-scm-provider-vss-1.5-20101113.161937-2.jar)
[INFO] Retrieving previous metadata from apache.snapshots.https
[INFO] Uploading repository metadata for: 'snapshot org.apache.maven.scm:maven-scm-provider-vss:1.5-SNAPSHOT'
[INFO] Retrieving previous metadata from apache.snapshots.https
[INFO] Uploading repository metadata for: 'artifact org.apache.maven.scm:maven-scm-provider-vss'
[INFO] Uploading project information for maven-scm-provider-vss 1.5-20101113.161937-2
[INFO] ------------------------------------------------------------------------
[INFO] Building Maven SCM TFS Provider
[INFO]    task-segment: [clean, deploy]
[INFO] ------------------------------------------------------------------------
[INFO] [clean:clean {execution: default-clean}]
[INFO] Deleting X:\slave\workspace\maven-scm\jdk\java-5x\label\windows\trunk\maven-scm-providers\maven-scm-provider-tfs\target
[INFO] [remote-resources:process {execution: default}]
[INFO] [plexus:descriptor {execution: create-component-descriptor}]
[INFO] Discovered 1 component descriptors(s)
[INFO] [resources:resources {execution: default-resources}]
[INFO] Using 'UTF-8' encoding to copy filtered resources.
[INFO] skip non existing resourceDirectory X:\slave\workspace\maven-scm\jdk\java-5x\label\windows\trunk\maven-scm-providers\maven-scm-provider-tfs\src\main\resources
[INFO] Copying 3 resources
[INFO] [compiler:compile {execution: default-compile}]
[INFO] Compiling 21 source files to X:\slave\workspace\maven-scm\jdk\java-5x\label\windows\trunk\maven-scm-providers\maven-scm-provider-tfs\target\classes
[INFO] [resources:testResources {execution: default-testResources}]
[INFO] Using 'UTF-8' encoding to copy filtered resources.
[INFO] Copying 1 resource
[INFO] Copying 3 resources
[INFO] [compiler:testCompile {execution: default-testCompile}]
[INFO] Compiling 13 source files to X:\slave\workspace\maven-scm\jdk\java-5x\label\windows\trunk\maven-scm-providers\maven-scm-provider-tfs\target\test-classes
[INFO] [surefire:test {execution: default-test}]
[INFO] Surefire report directory: X:\slave\workspace\maven-scm\jdk\java-5x\label\windows\trunk\maven-scm-providers\maven-scm-provider-tfs\target\surefire-reports

-------------------------------------------------------
 T E S T S
-------------------------------------------------------
Running org.apache.maven.scm.provider.tfs.command.TfsCommandTest
Tests run: 1, Failures: 0, Errors: 0, Skipped: 0, Time elapsed: 0.215 sec
Running org.apache.maven.scm.provider.tfs.command.TfsEditCommandTest
Tests run: 3, Failures: 0, Errors: 0, Skipped: 0, Time elapsed: 0.066 sec
Running org.apache.maven.scm.provider.tfs.command.TfsListCommandTest
Tests run: 3, Failures: 0, Errors: 0, Skipped: 0, Time elapsed: 0.052 sec
Running org.apache.maven.scm.provider.tfs.command.TfsStatusCommandTest
Tests run: 4, Failures: 0, Errors: 0, Skipped: 0, Time elapsed: 0.057 sec
Running org.apache.maven.scm.provider.tfs.command.TfsAddCommandTest
Tests run: 2, Failures: 0, Errors: 0, Skipped: 0, Time elapsed: 0.02 sec
Running org.apache.maven.scm.provider.tfs.command.TfsCheckOutCommandTest
Tests run: 4, Failures: 0, Errors: 0, Skipped: 0, Time elapsed: 0.059 sec
Running org.apache.maven.scm.provider.tfs.command.TfsTagCommandTest
Tests run: 2, Failures: 0, Errors: 0, Skipped: 0, Time elapsed: 0.04 sec
Running org.apache.maven.scm.provider.tfs.command.TfsUpdateCommandTest
Tests run: 2, Failures: 0, Errors: 0, Skipped: 0, Time elapsed: 0.022 sec
Running org.apache.maven.scm.provider.tfs.command.blame.TfsBlameConsumerTest
Tests run: 1, Failures: 0, Errors: 0, Skipped: 0, Time elapsed: 0.025 sec
Running org.apache.maven.scm.provider.tfs.command.TfsBranchCommandTest
Tests run: 2, Failures: 0, Errors: 0, Skipped: 0, Time elapsed: 0.033 sec
Running org.apache.maven.scm.provider.tfs.command.TfsChangeLogCommandTest
Tests run: 4, Failures: 0, Errors: 0, Skipped: 0, Time elapsed: 0.041 sec
Running org.apache.maven.scm.provider.tfs.command.TfsUnEditCommandTest
Tests run: 2, Failures: 0, Errors: 0, Skipped: 0, Time elapsed: 0.035 sec
Running org.apache.maven.scm.provider.tfs.command.TfsCheckInCommandTest
Tests run: 2, Failures: 0, Errors: 0, Skipped: 0, Time elapsed: 0.02 sec

Results :

Tests run: 32, Failures: 0, Errors: 0, Skipped: 0

[INFO] [jar:jar {execution: default-jar}]
[INFO] Building jar: X:\slave\workspace\maven-scm\jdk\java-5x\label\windows\trunk\maven-scm-providers\maven-scm-provider-tfs\target\maven-scm-provider-tfs-1.5-SNAPSHOT.jar
[INFO] [install:install {execution: default-install}]
[INFO] Installing X:\slave\workspace\maven-scm\jdk\java-5x\label\windows\trunk\maven-scm-providers\maven-scm-provider-tfs\target\maven-scm-provider-tfs-1.5-SNAPSHOT.jar
to x:\slave\workspace\maven-scm\jdk\java-5x\label\windows\.repository\org\apache\maven\scm\maven-scm-provider-tfs\1.5-SNAPSHOT\maven-scm-provider-tfs-1.5-SNAPSHOT.jar
[INFO] [deploy:deploy {execution: default-deploy}]
[INFO] Retrieving previous build number from apache.snapshots.https
Uploading: file:/opt/repos/deploy-junk/org/apache/maven/scm/maven-scm-provider-tfs/1.5-SNAPSHOT/maven-scm-provider-tfs-1.5-20101113.161937-3.jar
40K uploaded  (maven-scm-provider-tfs-1.5-20101113.161937-3.jar)
[INFO] Retrieving previous metadata from apache.snapshots.https
[INFO] Uploading repository metadata for: 'snapshot org.apache.maven.scm:maven-scm-provider-tfs:1.5-SNAPSHOT'
[INFO] Uploading project information for maven-scm-provider-tfs 1.5-20101113.161937-3
[INFO] Retrieving previous metadata from apache.snapshots.https
[INFO] Uploading repository metadata for: 'artifact org.apache.maven.scm:maven-scm-provider-tfs'
[INFO] ------------------------------------------------------------------------
[INFO] SKIPPING Maven SCM Standard Providers
[INFO]    task-segment: [clean, deploy]
[INFO] This project has been banned from further executions due to previous failures.
[INFO] ------------------------------------------------------------------------
[INFO] ------------------------------------------------------------------------
[INFO] SKIPPING Maven SCM Client
[INFO]    task-segment: [clean, deploy]
[INFO] This project has been banned from further executions due to previous failures.
[INFO] ------------------------------------------------------------------------
[INFO] ------------------------------------------------------------------------
[INFO] SKIPPING Maven SCM Plugin
[INFO]    task-segment: [clean, deploy]
[INFO] This project has been banned from further executions due to previous failures.
[INFO] ------------------------------------------------------------------------
[INFO] 
[INFO] 
[INFO] ------------------------------------------------------------------------
[INFO] Reactor Summary:
[INFO] ------------------------------------------------------------------------
[INFO] Maven SCM ............................................. SUCCESS [3.594s]
[INFO] Maven SCM API ......................................... SUCCESS [4.945s]
[INFO] Maven SCM Managers .................................... SUCCESS [0.122s]
[INFO] Maven SCM Manager for Plexus .......................... SUCCESS [1.683s]
[INFO] Maven SCM Test ........................................ SUCCESS [2.037s]
[INFO] Maven SCM Providers ................................... SUCCESS [0.144s]
[INFO] Maven SCM AccuRev Provider ............................ SUCCESS [12.124s]
[INFO] Maven SCM Bazaar Provider ............................. SUCCESS [2.390s]
[INFO] Maven SCM Clearcase Provider .......................... SUCCESS [4.448s]
[INFO] Maven SCM CVS Provider - Parent ....................... SUCCESS [0.120s]
[INFO] Maven SCM CVS Provider TCK tests ...................... SUCCESS [1.533s]
[INFO] Maven SCM CVS Provider - Common library ............... SUCCESS [2.961s]
[INFO] Maven SCM CVS Provider - CVS Executable Impl. ......... FAILED [3.938s]
[INFO] Maven SCM CVS Provider - CVS Java Impl. ............... FAILED [6.303s]
[INFO] Maven SCM Mercurial (Hg) Provider ..................... SUCCESS [2.221s]
[INFO] Maven SCM Git Provider - Parent ....................... SUCCESS [0.120s]
[INFO] Maven SCM Git Provider - Common library ............... SUCCESS [2.649s]
[INFO] Maven SCM git Provider TCK Tests ...................... SUCCESS [1.078s]
[INFO] Maven SCM Git Provider - Git Executable Impl. ......... SUCCESS [3.563s]
[INFO] Maven SCM Local Provider .............................. SUCCESS [4.177s]
[INFO] Maven SCM Perforce Provider ........................... SUCCESS [3.887s]
[INFO] Maven SCM Starteam Provider ........................... SUCCESS [4.677s]
[INFO] Maven SCM Subversion Provider - Parent ................ SUCCESS [0.113s]
[INFO] Maven SCM Subversion Provider - Common library ........ SUCCESS [2.956s]
[INFO] Maven SCM Subversion Provider TCK Tests ............... SUCCESS [1.377s]
[INFO] Maven SCM Subversion Provider - SVN Executable Impl. .. FAILED [58.859s]
[INFO] Maven SCM Synergy Provider ............................ SUCCESS [5.367s]
[INFO] Maven SCM Visual Source Safe Provider ................. SUCCESS [4.680s]
[INFO] Maven SCM TFS Provider ................................ SUCCESS [2.622s]
[INFO] Maven SCM Standard Providers .......................... SKIPPED (dependency build failed
or was skipped)
[INFO] Maven SCM Client ...................................... SKIPPED (dependency build failed
or was skipped)
[INFO] Maven SCM Plugin ...................................... SKIPPED (dependency build failed
or was skipped)
[INFO] ------------------------------------------------------------------------
[INFO] Error for project: Maven SCM CVS Provider - CVS Executable Impl. (during deploy)
[INFO] ------------------------------------------------------------------------
[INFO] There are test failures.

Please refer to X:\slave\workspace\maven-scm\jdk\java-5x\label\windows\trunk\maven-scm-providers\maven-scm-providers-cvs\maven-scm-provider-cvsexe\target\surefire-reports
for the individual test results.
[INFO] ------------------------------------------------------------------------
[INFO] Trace
org.apache.maven.BuildFailureException: There are test failures.

Please refer to X:\slave\workspace\maven-scm\jdk\java-5x\label\windows\trunk\maven-scm-providers\maven-scm-providers-cvs\maven-scm-provider-cvsexe\target\surefire-reports
for the individual test results.
	at org.apache.maven.lifecycle.DefaultLifecycleExecutor.executeGoals(DefaultLifecycleExecutor.java:715)
	at org.apache.maven.lifecycle.DefaultLifecycleExecutor.executeGoalWithLifecycle(DefaultLifecycleExecutor.java:556)
	at org.apache.maven.lifecycle.DefaultLifecycleExecutor.executeGoal(DefaultLifecycleExecutor.java:535)
	at org.apache.maven.lifecycle.DefaultLifecycleExecutor.executeGoalAndHandleFailures(DefaultLifecycleExecutor.java:387)
	at org.apache.maven.lifecycle.DefaultLifecycleExecutor.executeTaskSegments(DefaultLifecycleExecutor.java:348)
	at org.apache.maven.lifecycle.DefaultLifecycleExecutor.execute(DefaultLifecycleExecutor.java:180)
	at org.apache.maven.DefaultMaven.doExecute(DefaultMaven.java:328)
	at org.apache.maven.DefaultMaven.execute(DefaultMaven.java:138)
	at org.apache.maven.cli.MavenCli.main(MavenCli.java:362)
	at org.apache.maven.cli.compat.CompatibleMain.main(CompatibleMain.java:60)
	at sun.reflect.NativeMethodAccessorImpl.invoke0(Native Method)
	at sun.reflect.NativeMethodAccessorImpl.invoke(NativeMethodAccessorImpl.java:39)
	at sun.reflect.DelegatingMethodAccessorImpl.invoke(DelegatingMethodAccessorImpl.java:25)
	at java.lang.reflect.Method.invoke(Method.java:592)
	at org.codehaus.classworlds.Launcher.launchEnhanced(Launcher.java:315)
	at org.codehaus.classworlds.Launcher.launch(Launcher.java:255)
	at org.codehaus.classworlds.Launcher.mainWithExitCode(Launcher.java:430)
	at org.codehaus.classworlds.Launcher.main(Launcher.java:375)
Caused by: org.apache.maven.plugin.MojoFailureException: There are test failures.

Please refer to X:\slave\workspace\maven-scm\jdk\java-5x\label\windows\trunk\maven-scm-providers\maven-scm-providers-cvs\maven-scm-provider-cvsexe\target\surefire-reports
for the individual test results.
	at org.apache.maven.plugin.surefire.SurefirePlugin.execute(SurefirePlugin.java:629)
	at org.apache.maven.plugin.DefaultPluginManager.executeMojo(DefaultPluginManager.java:490)
	at org.apache.maven.lifecycle.DefaultLifecycleExecutor.executeGoals(DefaultLifecycleExecutor.java:694)
	... 17 more
[INFO] ------------------------------------------------------------------------
[INFO] Error for project: Maven SCM CVS Provider - CVS Java Impl. (during deploy)
[INFO] ------------------------------------------------------------------------
[INFO] There are test failures.

Please refer to X:\slave\workspace\maven-scm\jdk\java-5x\label\windows\trunk\maven-scm-providers\maven-scm-providers-cvs\maven-scm-provider-cvsjava\target\surefire-reports
for the individual test results.
[INFO] ------------------------------------------------------------------------
[INFO] Trace
org.apache.maven.BuildFailureException: There are test failures.

Please refer to X:\slave\workspace\maven-scm\jdk\java-5x\label\windows\trunk\maven-scm-providers\maven-scm-providers-cvs\maven-scm-provider-cvsjava\target\surefire-reports
for the individual test results.
	at org.apache.maven.lifecycle.DefaultLifecycleExecutor.executeGoals(DefaultLifecycleExecutor.java:715)
	at org.apache.maven.lifecycle.DefaultLifecycleExecutor.executeGoalWithLifecycle(DefaultLifecycleExecutor.java:556)
	at org.apache.maven.lifecycle.DefaultLifecycleExecutor.executeGoal(DefaultLifecycleExecutor.java:535)
	at org.apache.maven.lifecycle.DefaultLifecycleExecutor.executeGoalAndHandleFailures(DefaultLifecycleExecutor.java:387)
	at org.apache.maven.lifecycle.DefaultLifecycleExecutor.executeTaskSegments(DefaultLifecycleExecutor.java:348)
	at org.apache.maven.lifecycle.DefaultLifecycleExecutor.execute(DefaultLifecycleExecutor.java:180)
	at org.apache.maven.DefaultMaven.doExecute(DefaultMaven.java:328)
	at org.apache.maven.DefaultMaven.execute(DefaultMaven.java:138)
	at org.apache.maven.cli.MavenCli.main(MavenCli.java:362)
	at org.apache.maven.cli.compat.CompatibleMain.main(CompatibleMain.java:60)
	at sun.reflect.NativeMethodAccessorImpl.invoke0(Native Method)
	at sun.reflect.NativeMethodAccessorImpl.invoke(NativeMethodAccessorImpl.java:39)
	at sun.reflect.DelegatingMethodAccessorImpl.invoke(DelegatingMethodAccessorImpl.java:25)
	at java.lang.reflect.Method.invoke(Method.java:592)
	at org.codehaus.classworlds.Launcher.launchEnhanced(Launcher.java:315)
	at org.codehaus.classworlds.Launcher.launch(Launcher.java:255)
	at org.codehaus.classworlds.Launcher.mainWithExitCode(Launcher.java:430)
	at org.codehaus.classworlds.Launcher.main(Launcher.java:375)
Caused by: org.apache.maven.plugin.MojoFailureException: There are test failures.

Please refer to X:\slave\workspace\maven-scm\jdk\java-5x\label\windows\trunk\maven-scm-providers\maven-scm-providers-cvs\maven-scm-provider-cvsjava\target\surefire-reports
for the individual test results.
	at org.apache.maven.plugin.surefire.SurefirePlugin.execute(SurefirePlugin.java:629)
	at org.apache.maven.plugin.DefaultPluginManager.executeMojo(DefaultPluginManager.java:490)
	at org.apache.maven.lifecycle.DefaultLifecycleExecutor.executeGoals(DefaultLifecycleExecutor.java:694)
	... 17 more
[INFO] ------------------------------------------------------------------------
[INFO] Error for project: Maven SCM Subversion Provider - SVN Executable Impl. (during deploy)
[INFO] ------------------------------------------------------------------------
[INFO] There are test failures.

Please refer to X:\slave\workspace\maven-scm\jdk\java-5x\label\windows\trunk\maven-scm-providers\maven-scm-providers-svn\maven-scm-provider-svnexe\target\surefire-reports
for the individual test results.
[INFO] ------------------------------------------------------------------------
[INFO] Trace
org.apache.maven.BuildFailureException: There are test failures.

Please refer to X:\slave\workspace\maven-scm\jdk\java-5x\label\windows\trunk\maven-scm-providers\maven-scm-providers-svn\maven-scm-provider-svnexe\target\surefire-reports
for the individual test results.
	at org.apache.maven.lifecycle.DefaultLifecycleExecutor.executeGoals(DefaultLifecycleExecutor.java:715)
	at org.apache.maven.lifecycle.DefaultLifecycleExecutor.executeGoalWithLifecycle(DefaultLifecycleExecutor.java:556)
	at org.apache.maven.lifecycle.DefaultLifecycleExecutor.executeGoal(DefaultLifecycleExecutor.java:535)
	at org.apache.maven.lifecycle.DefaultLifecycleExecutor.executeGoalAndHandleFailures(DefaultLifecycleExecutor.java:387)
	at org.apache.maven.lifecycle.DefaultLifecycleExecutor.executeTaskSegments(DefaultLifecycleExecutor.java:348)
	at org.apache.maven.lifecycle.DefaultLifecycleExecutor.execute(DefaultLifecycleExecutor.java:180)
	at org.apache.maven.DefaultMaven.doExecute(DefaultMaven.java:328)
	at org.apache.maven.DefaultMaven.execute(DefaultMaven.java:138)
	at org.apache.maven.cli.MavenCli.main(MavenCli.java:362)
	at org.apache.maven.cli.compat.CompatibleMain.main(CompatibleMain.java:60)
	at sun.reflect.NativeMethodAccessorImpl.invoke0(Native Method)
	at sun.reflect.NativeMethodAccessorImpl.invoke(NativeMethodAccessorImpl.java:39)
	at sun.reflect.DelegatingMethodAccessorImpl.invoke(DelegatingMethodAccessorImpl.java:25)
	at java.lang.reflect.Method.invoke(Method.java:592)
	at org.codehaus.classworlds.Launcher.launchEnhanced(Launcher.java:315)
	at org.codehaus.classworlds.Launcher.launch(Launcher.java:255)
	at org.codehaus.classworlds.Launcher.mainWithExitCode(Launcher.java:430)
	at org.codehaus.classworlds.Launcher.main(Launcher.java:375)
Caused by: org.apache.maven.plugin.MojoFailureException: There are test failures.

Please refer to X:\slave\workspace\maven-scm\jdk\java-5x\label\windows\trunk\maven-scm-providers\maven-scm-providers-svn\maven-scm-provider-svnexe\target\surefire-reports
for the individual test results.
	at org.apache.maven.plugin.surefire.SurefirePlugin.execute(SurefirePlugin.java:629)
	at org.apache.maven.plugin.DefaultPluginManager.executeMojo(DefaultPluginManager.java:490)
	at org.apache.maven.lifecycle.DefaultLifecycleExecutor.executeGoals(DefaultLifecycleExecutor.java:694)
	... 17 more
[INFO] ------------------------------------------------------------------------
[INFO] BUILD ERRORS
[INFO] ------------------------------------------------------------------------
[INFO] Total time: 2 minutes 25 seconds
[INFO] Finished at: Sat Nov 13 08:21:58 PST 2010
[INFO] Final Memory: 40M/63M
[INFO] ------------------------------------------------------------------------
Recording test results


Mime
View raw message