maven-notifications mailing list archives

Site index · List index
Message view « Date » · « Thread »
Top « Date » · « Thread »
From "GRiD .ORG" <bui...@lists.sonatype.com>
Subject Build failed in Hudson: maven-plugins-ITs » java-5x,ubuntu #558
Date Sun, 28 Nov 2010 07:04:57 GMT
See <https://grid.sonatype.org/ci/job/maven-plugins-ITs/./jdk=java-5x,label=ubuntu/558/changes>

Changes:

[Benjamin Bentmann] o Indicated since version for new effective-site goal

[Benjamin Bentmann] o Properly declared read-only mojo parameters

[Olivier Lamy] [MINVOKER-110] It tests must be runnable in parrallel.

------------------------------------------
Started by upstream project "maven-plugins-ITs" build number 558
Node context:
  os.version=2.6.32-25-server
  os.arch=amd64
  os.family=unix
  os.name=linux
Building remotely on slave-ubuntu-2
Updating http://svn.apache.org/repos/asf/maven/plugins/trunk
U         maven-site-plugin/src/main/java/org/apache/maven/plugins/site/EffectiveSiteMojo.java
U         maven-site-plugin/src/main/java/org/apache/maven/plugins/site/AbstractSiteRenderingMojo.java
U         maven-site-plugin/src/main/java/org/apache/maven/plugins/site/AbstractSiteMojo.java
U         maven-invoker-plugin/src/main/java/org/apache/maven/plugin/invoker/AbstractInvokerMojo.java
U         maven-invoker-plugin/pom.xml
At revision 1039836
[trunk] $ /home/hudson/slave/tools/maven-2.2x/bin/mvn -Dlabel=ubuntu -Djdk=java-5x -Dmaven.repo.local=<https://grid.sonatype.org/ci/job/maven-plugins-ITs/./jdk=java-5x,label=ubuntu/ws/.repository>
clean deploy -B -U -e -V -fae -Prun-its
+ Error stacktraces are turned on.
Apache Maven 2.2.1 (r801777; 2009-08-06 14:16:01-0500)
Java version: 1.5.0_22
Java home: /opt/grid/slave/tools/java-5x/jre
Default locale: en_US, platform encoding: UTF-8
OS name: "linux" version: "2.6.32-25-server" arch: "amd64" Family: "unix"
[INFO] Scanning for projects...
[INFO] ------------------------------------------------------------------------
[ERROR] BUILD FAILURE
[INFO] ------------------------------------------------------------------------
[INFO] The projects in the reactor contain a cyclic reference: Edge between 'Vertex{label='org.apache.maven.plugins:maven-invoker-plugin'}'
and 'Vertex{label='org.apache.maven.plugins:maven-compiler-plugin'}' introduces to cycle in
the graph org.apache.maven.plugins:maven-compiler-plugin --> org.apache.maven.plugins:maven-invoker-plugin
--> org.apache.maven.plugins:maven-compiler-plugin
[INFO] ------------------------------------------------------------------------
[INFO] Trace
org.apache.maven.BuildFailureException: The projects in the reactor contain a cyclic reference:
Edge between 'Vertex{label='org.apache.maven.plugins:maven-invoker-plugin'}' and 'Vertex{label='org.apache.maven.plugins:maven-compiler-plugin'}'
introduces to cycle in the graph org.apache.maven.plugins:maven-compiler-plugin --> org.apache.maven.plugins:maven-invoker-plugin
--> org.apache.maven.plugins:maven-compiler-plugin
	at org.apache.maven.DefaultMaven.doExecute(DefaultMaven.java:295)
	at org.apache.maven.DefaultMaven.execute(DefaultMaven.java:138)
	at org.apache.maven.cli.MavenCli.main(MavenCli.java:362)
	at org.apache.maven.cli.compat.CompatibleMain.main(CompatibleMain.java:60)
	at sun.reflect.NativeMethodAccessorImpl.invoke0(Native Method)
	at sun.reflect.NativeMethodAccessorImpl.invoke(NativeMethodAccessorImpl.java:39)
	at sun.reflect.DelegatingMethodAccessorImpl.invoke(DelegatingMethodAccessorImpl.java:25)
	at java.lang.reflect.Method.invoke(Method.java:592)
	at org.codehaus.classworlds.Launcher.launchEnhanced(Launcher.java:315)
	at org.codehaus.classworlds.Launcher.launch(Launcher.java:255)
	at org.codehaus.classworlds.Launcher.mainWithExitCode(Launcher.java:430)
	at org.codehaus.classworlds.Launcher.main(Launcher.java:375)
Caused by: hidden.org.codehaus.plexus.util.dag.CycleDetectedException: Edge between 'Vertex{label='org.apache.maven.plugins:maven-invoker-plugin'}'
and 'Vertex{label='org.apache.maven.plugins:maven-compiler-plugin'}' introduces to cycle in
the graph org.apache.maven.plugins:maven-compiler-plugin --> org.apache.maven.plugins:maven-invoker-plugin
--> org.apache.maven.plugins:maven-compiler-plugin
	at hidden.org.codehaus.plexus.util.dag.DAG.addEdge(DAG.java:143)
	at hidden.org.codehaus.plexus.util.dag.DAG.addEdge(DAG.java:123)
	at org.apache.maven.project.ProjectSorter.addEdgeWithParentCheck(ProjectSorter.java:362)
	at org.apache.maven.project.ProjectSorter.<init>(ProjectSorter.java:146)
	at org.apache.maven.execution.ReactorManager.<init>(ReactorManager.java:99)
	at org.apache.maven.DefaultMaven.doExecute(DefaultMaven.java:288)
	... 11 more
[INFO] ------------------------------------------------------------------------
[INFO] Total time: 1 second
[INFO] Finished at: Sun Nov 28 01:04:57 CST 2010
[INFO] Final Memory: 14M/54M
[INFO] ------------------------------------------------------------------------


Mime
View raw message