maven-notifications mailing list archives

Site index · List index
Message view « Date » · « Thread »
Top « Date » · « Thread »
From "GRiD .ORG" <bui...@lists.sonatype.com>
Subject Build failed in Hudson: maven-plugins-UTs » java-5x,windows #806
Date Mon, 01 Nov 2010 17:12:07 GMT
See <https://grid.sonatype.org/ci/job/maven-plugins-UTs/./jdk=java-5x,label=windows/806/changes>

Changes:

[Jason van Zyl] o retiring maven-eclipse-plugin

[Jason van Zyl] o retiring maven-one-plugin

[Jason van Zyl] o retiring maven-stage-plugin

[Jason van Zyl] o retiring maven-stage-plugin

------------------------------------------
Started by upstream project "maven-plugins-UTs" build number 806
Node context:
  os.version=6.1
  os.arch=x86
  os.family=windows
  os.name=windows 7
Building remotely on slave-win-1
Updating http://svn.apache.org/repos/asf/maven/plugins/trunk
D         maven-eclipse-plugin
D         maven-idea-plugin
D         maven-stage-plugin
D         maven-one-plugin
At revision 1029750
[trunk] $ x:\slave\tools\maven-2.2x\bin\mvn.bat -Dlabel=windows -Djdk=java-5x -Dmaven.repo.local=<https://grid.sonatype.org/ci/job/maven-plugins-UTs/./jdk=java-5x,label=windows/ws/.repository>
clean install -B -U -e -V -fae
+ Error stacktraces are turned on.
Apache Maven 2.2.1 (r801777; 2009-08-06 12:16:01-0700)
Java version: 1.5.0_22
Java home: x:\slave\tools\java-5x\jre
Default locale: en_US, platform encoding: Cp1252
OS name: "windows 7" version: "6.1" arch: "x86" Family: "windows"
[INFO] Scanning for projects...
[INFO] ------------------------------------------------------------------------
[ERROR] FATAL ERROR
[INFO] ------------------------------------------------------------------------
[INFO] Error building POM (may not be this project's POM).


Project ID: unknown

Reason: Could not find the model file 'X:\slave\workspace\maven-plugins-UTs\jdk\java-5x\label\windows\trunk\maven-eclipse-plugin\pom.xml'.
for project unknown


[INFO] ------------------------------------------------------------------------
[INFO] Trace
org.apache.maven.reactor.MavenExecutionException: Could not find the model file 'X:\slave\workspace\maven-plugins-UTs\jdk\java-5x\label\windows\trunk\maven-eclipse-plugin\pom.xml'.
for project unknown
	at org.apache.maven.DefaultMaven.getProjects(DefaultMaven.java:404)
	at org.apache.maven.DefaultMaven.doExecute(DefaultMaven.java:272)
	at org.apache.maven.DefaultMaven.execute(DefaultMaven.java:138)
	at org.apache.maven.cli.MavenCli.main(MavenCli.java:362)
	at org.apache.maven.cli.compat.CompatibleMain.main(CompatibleMain.java:60)
	at sun.reflect.NativeMethodAccessorImpl.invoke0(Native Method)
	at sun.reflect.NativeMethodAccessorImpl.invoke(NativeMethodAccessorImpl.java:39)
	at sun.reflect.DelegatingMethodAccessorImpl.invoke(DelegatingMethodAccessorImpl.java:25)
	at java.lang.reflect.Method.invoke(Method.java:592)
	at org.codehaus.classworlds.Launcher.launchEnhanced(Launcher.java:315)
	at org.codehaus.classworlds.Launcher.launch(Launcher.java:255)
	at org.codehaus.classworlds.Launcher.mainWithExitCode(Launcher.java:430)
	at org.codehaus.classworlds.Launcher.main(Launcher.java:375)
Caused by: org.apache.maven.project.ProjectBuildingException: Could not find the model file
'X:\slave\workspace\maven-plugins-UTs\jdk\java-5x\label\windows\trunk\maven-eclipse-plugin\pom.xml'.
for project unknown
	at org.apache.maven.project.DefaultMavenProjectBuilder.readModel(DefaultMavenProjectBuilder.java:1575)
	at org.apache.maven.project.DefaultMavenProjectBuilder.buildFromSourceFileInternal(DefaultMavenProjectBuilder.java:506)
	at org.apache.maven.project.DefaultMavenProjectBuilder.build(DefaultMavenProjectBuilder.java:200)
	at org.apache.maven.DefaultMaven.getProject(DefaultMaven.java:604)
	at org.apache.maven.DefaultMaven.collectProjects(DefaultMaven.java:487)
	at org.apache.maven.DefaultMaven.collectProjects(DefaultMaven.java:560)
	at org.apache.maven.DefaultMaven.getProjects(DefaultMaven.java:391)
	... 12 more
Caused by: java.io.FileNotFoundException: X:\slave\workspace\maven-plugins-UTs\jdk\java-5x\label\windows\trunk\maven-eclipse-plugin\pom.xml
(The system cannot find the file specified)
	at java.io.FileInputStream.open(Native Method)
	at java.io.FileInputStream.<init>(FileInputStream.java:106)
	at hidden.org.codehaus.plexus.util.xml.XmlReader.<init>(XmlReader.java:124)
	at hidden.org.codehaus.plexus.util.xml.XmlStreamReader.<init>(XmlStreamReader.java:67)
	at hidden.org.codehaus.plexus.util.ReaderFactory.newXmlReader(ReaderFactory.java:118)
	at org.apache.maven.project.DefaultMavenProjectBuilder.readModel(DefaultMavenProjectBuilder.java:1570)
	... 18 more
[INFO] ------------------------------------------------------------------------
[INFO] Total time: < 1 second
[INFO] Finished at: Mon Nov 01 10:12:05 PDT 2010
[INFO] Final Memory: 2M/4M
[INFO] ------------------------------------------------------------------------


Mime
View raw message