maven-notifications mailing list archives

Site index · List index
Message view « Date » · « Thread »
Top « Date » · « Thread »
From "GRiD .ORG" <bui...@lists.sonatype.com>
Subject Build failed in Hudson: maven-plugins-ITs » java-5x,ubuntu #551
Date Thu, 18 Nov 2010 08:27:50 GMT
See <https://grid.sonatype.org/ci/job/maven-plugins-ITs/./jdk=java-5x,label=ubuntu/551/changes>

Changes:

[Vincent Siveton] MPIR-128: Add a link to a repository location in Project Summary

o added a download section

[Vincent Siveton] MPIR-207: Add a distribution management report

o added new report

[Vincent Siveton] o code simplification

[Vincent Siveton] [MPIR-80] added minimum JDK Rev to project summary

o display JDK rev only if the project seems a Java project

[Vincent Siveton] MPIR-206: Generalize configuration for text reports

o added customBundle which load a customI18N object
o updated documentation

------------------------------------------
[...truncated 5422 lines...]
[INFO] Webapp assembled in [2 msecs]
Tests run: 2, Failures: 0, Errors: 0, Skipped: 0, Time elapsed: 0.073 sec
Running org.apache.maven.plugin.war.WarManifestMojoTest
Tests run: 6, Failures: 0, Errors: 0, Skipped: 0, Time elapsed: 0.195 sec
Running org.apache.maven.plugin.war.util.PathSetTest
Tests run: 5, Failures: 0, Errors: 0, Skipped: 0, Time elapsed: 0.005 sec
Running org.apache.maven.plugin.war.util.WarUtilsTest
Tests run: 1, Failures: 0, Errors: 0, Skipped: 0, Time elapsed: 0.002 sec
Running org.apache.maven.plugin.war.overlay.OverlayManagerTest
Tests run: 5, Failures: 0, Errors: 0, Skipped: 0, Time elapsed: 0.139 sec
Running org.apache.maven.plugin.war.WarDependenciesAnalysisTest
[INFO] Exploding webapp
[INFO] Assembling webapp [maven-war-plugin-test] in [/opt/grid/slave/workspace/maven-plugins-ITs/jdk/java-5x/label/ubuntu/trunk/maven-war-plugin/target/test-classes/unit/dependenciesanalysis/test-dir/no-change]
[INFO] Processing war project
[INFO] Copying webapp resources [/opt/grid/slave/workspace/maven-plugins-ITs/jdk/java-5x/label/ubuntu/trunk/maven-war-plugin/target/test-classes/unit/dependenciesanalysis/test-dir/no-change-test-data/source]
[INFO] Webapp assembled in [6 msecs]
[INFO] Exploding webapp
[INFO] Assembling webapp [maven-war-plugin-test] in [/opt/grid/slave/workspace/maven-plugins-ITs/jdk/java-5x/label/ubuntu/trunk/maven-war-plugin/target/test-classes/unit/dependenciesanalysis/test-dir/no-change]
[INFO] Processing war project
[INFO] Copying webapp resources [/opt/grid/slave/workspace/maven-plugins-ITs/jdk/java-5x/label/ubuntu/trunk/maven-war-plugin/target/test-classes/unit/dependenciesanalysis/test-dir/no-change-test-data/source]
[INFO] Webapp assembled in [2 msecs]
[INFO] Exploding webapp
[INFO] Assembling webapp [maven-war-plugin-test] in [/opt/grid/slave/workspace/maven-plugins-ITs/jdk/java-5x/label/ubuntu/trunk/maven-war-plugin/target/test-classes/unit/dependenciesanalysis/test-dir/remove-dependency]
[INFO] Processing war project
[INFO] Copying webapp resources [/opt/grid/slave/workspace/maven-plugins-ITs/jdk/java-5x/label/ubuntu/trunk/maven-war-plugin/target/test-classes/unit/dependenciesanalysis/test-dir/remove-dependency-test-data/source]
[INFO] Webapp assembled in [5 msecs]
[INFO] Exploding webapp
[INFO] Assembling webapp [maven-war-plugin-test] in [/opt/grid/slave/workspace/maven-plugins-ITs/jdk/java-5x/label/ubuntu/trunk/maven-war-plugin/target/test-classes/unit/dependenciesanalysis/test-dir/remove-dependency]
[INFO] Dependency [Dependency {groupId=org.sample.jar, artifactId=lib-test, version=1.0, type=jar}]
has been removed from the project.
[INFO] Processing war project
[INFO] Copying webapp resources [/opt/grid/slave/workspace/maven-plugins-ITs/jdk/java-5x/label/ubuntu/trunk/maven-war-plugin/target/test-classes/unit/dependenciesanalysis/test-dir/remove-dependency-test-data/source]
[INFO] Webapp assembled in [2 msecs]
[INFO] Exploding webapp
[INFO] Assembling webapp [maven-war-plugin-test] in [/opt/grid/slave/workspace/maven-plugins-ITs/jdk/java-5x/label/ubuntu/trunk/maven-war-plugin/target/test-classes/unit/dependenciesanalysis/test-dir/dependency-update-version]
[INFO] Processing war project
[INFO] Copying webapp resources [/opt/grid/slave/workspace/maven-plugins-ITs/jdk/java-5x/label/ubuntu/trunk/maven-war-plugin/target/test-classes/unit/dependenciesanalysis/test-dir/dependency-update-version-test-data/source]
[INFO] Webapp assembled in [4 msecs]
[INFO] Exploding webapp
[INFO] Assembling webapp [maven-war-plugin-test] in [/opt/grid/slave/workspace/maven-plugins-ITs/jdk/java-5x/label/ubuntu/trunk/maven-war-plugin/target/test-classes/unit/dependenciesanalysis/test-dir/dependency-update-version]
[INFO] Version of dependency [Dependency {groupId=org.sample.jar, artifactId=lib-test, version=2.0,
type=jar}] has changed (1.0 -> 2.0).
[INFO] Processing war project
[INFO] Copying webapp resources [/opt/grid/slave/workspace/maven-plugins-ITs/jdk/java-5x/label/ubuntu/trunk/maven-war-plugin/target/test-classes/unit/dependenciesanalysis/test-dir/dependency-update-version-test-data/source]
[INFO] Webapp assembled in [3 msecs]
[INFO] Exploding webapp
[INFO] Assembling webapp [maven-war-plugin-test] in [/opt/grid/slave/workspace/maven-plugins-ITs/jdk/java-5x/label/ubuntu/trunk/maven-war-plugin/target/test-classes/unit/dependenciesanalysis/test-dir/dependency-now-provided]
[INFO] Processing war project
[INFO] Copying webapp resources [/opt/grid/slave/workspace/maven-plugins-ITs/jdk/java-5x/label/ubuntu/trunk/maven-war-plugin/target/test-classes/unit/dependenciesanalysis/test-dir/dependency-now-provided-test-data/source]
[INFO] Webapp assembled in [6 msecs]
[INFO] Exploding webapp
[INFO] Assembling webapp [maven-war-plugin-test] in [/opt/grid/slave/workspace/maven-plugins-ITs/jdk/java-5x/label/ubuntu/trunk/maven-war-plugin/target/test-classes/unit/dependenciesanalysis/test-dir/dependency-now-provided]
[INFO] Scope of dependency [Dependency {groupId=org.sample.jar, artifactId=lib-test, version=1.0,
type=jar}] has changed (runtime -> provided).
[INFO] Processing war project
[INFO] Copying webapp resources [/opt/grid/slave/workspace/maven-plugins-ITs/jdk/java-5x/label/ubuntu/trunk/maven-war-plugin/target/test-classes/unit/dependenciesanalysis/test-dir/dependency-now-provided-test-data/source]
[INFO] Webapp assembled in [3 msecs]
Tests run: 4, Failures: 0, Errors: 0, Skipped: 0, Time elapsed: 0.25 sec

Results :

Tests run: 83, Failures: 0, Errors: 0, Skipped: 0

[INFO] [jar:jar {execution: default-jar}]
[INFO] Building jar: /opt/grid/slave/workspace/maven-plugins-ITs/jdk/java-5x/label/ubuntu/trunk/maven-war-plugin/target/maven-war-plugin-2.2-SNAPSHOT.jar
[INFO] [plugin:addPluginArtifactMetadata {execution: default-addPluginArtifactMetadata}]
[INFO] [invoker:install {execution: integration-test}]
[INFO] Installing /opt/grid/slave/workspace/maven-plugins-ITs/jdk/java-5x/label/ubuntu/trunk/maven-war-plugin/pom.xml
to /opt/grid/slave/workspace/maven-plugins-ITs/jdk/java-5x/label/ubuntu/trunk/maven-war-plugin/target/local-repo/org/apache/maven/plugins/maven-war-plugin/2.2-SNAPSHOT/maven-war-plugin-2.2-SNAPSHOT.pom
[INFO] Installing /opt/grid/slave/workspace/maven-plugins-ITs/jdk/java-5x/label/ubuntu/trunk/maven-war-plugin/target/maven-war-plugin-2.2-SNAPSHOT.jar
to /opt/grid/slave/workspace/maven-plugins-ITs/jdk/java-5x/label/ubuntu/trunk/maven-war-plugin/target/local-repo/org/apache/maven/plugins/maven-war-plugin/2.2-SNAPSHOT/maven-war-plugin-2.2-SNAPSHOT.jar
[INFO] [invoker:run {execution: integration-test}]
[INFO] Building: MWAR-143/pom.xml
[INFO] ..SUCCESS (20.1 s)
[INFO] Building: scoped-dependency-same-artifact/pom.xml
[INFO] ..SUCCESS (5.7 s)
[INFO] Building: MWAR-96/pom.xml
[INFO] ..SUCCESS (4.0 s)
[INFO] Building: MWAR-62/pom.xml
[INFO] ..SUCCESS (2.8 s)
[INFO] Building: MWAR-129/pom.xml
[INFO] ..SUCCESS (3.0 s)
[INFO] Building: simple-war-no-webxml/pom.xml
[INFO] ..SUCCESS (4.9 s)
[INFO] Building: simple-war-project/pom.xml
[INFO] ..SUCCESS (3.9 s)
[INFO] Building: MWAR-139/pom.xml
[INFO] ..SUCCESS (3.6 s)
[INFO] Building: web-resources-filtering/pom.xml
[INFO] ..SUCCESS (5.0 s)
[INFO] Building: MWAR-131/pom.xml
[INFO] ..SUCCESS (22.0 s)
[INFO] Building: default/pom.xml
[INFO] ..SUCCESS (6.1 s)
[INFO] Building: MWAR-133/pom.xml
[INFO] ..SUCCESS (2.9 s)
[INFO] ---------------------------------------
[INFO] Execution Summary:
[INFO]   Builds Passing: 12
[INFO]   Builds Failing: 0
[INFO]   Builds Skipped: 0
[INFO] ---------------------------------------
[INFO] [install:install {execution: default-install}]
[INFO] Installing /opt/grid/slave/workspace/maven-plugins-ITs/jdk/java-5x/label/ubuntu/trunk/maven-war-plugin/target/maven-war-plugin-2.2-SNAPSHOT.jar
to <https://grid.sonatype.org/ci/job/maven-plugins-ITs/./jdk=java-5x,label=ubuntu/ws/.repository/org/apache/maven/plugins/maven-war-plugin/2.2-SNAPSHOT/maven-war-plugin-2.2-SNAPSHOT.jar>
[INFO] [deploy:deploy {execution: default-deploy}]
[INFO] Retrieving previous build number from apache.snapshots.https
Uploading: http://repository.sonatype.org:8081/content/repositories/maven.snapshots/org/apache/maven/plugins/maven-war-plugin/2.2-SNAPSHOT/maven-war-plugin-2.2-20101118.070352-60.jar
75K uploaded  (maven-war-plugin-2.2-20101118.070352-60.jar)
[INFO] Retrieving previous metadata from apache.snapshots.https
[INFO] Uploading repository metadata for: 'artifact org.apache.maven.plugins:maven-war-plugin'
[INFO] Retrieving previous metadata from apache.snapshots.https
[INFO] Uploading repository metadata for: 'org.apache.maven.plugins'
[INFO] Uploading project information for maven-war-plugin 2.2-20101118.070352-60
[INFO] Retrieving previous metadata from apache.snapshots.https
[INFO] Uploading repository metadata for: 'snapshot org.apache.maven.plugins:maven-war-plugin:2.2-SNAPSHOT'
[INFO] ------------------------------------------------------------------------
[INFO] Building Maven Plugins Aggregator
[INFO]    task-segment: [clean, deploy]
[INFO] ------------------------------------------------------------------------
[INFO] [clean:clean {execution: default-clean}]
[INFO] Deleting file set: /opt/grid/slave/workspace/maven-plugins-ITs/jdk/java-5x/label/ubuntu/trunk/target
(included: [**], excluded: [])
[INFO] [remote-resources:process {execution: default}]
[INFO] [site:attach-descriptor {execution: default-attach-descriptor}]
[INFO] [install:install {execution: default-install}]
[INFO] Installing /opt/grid/slave/workspace/maven-plugins-ITs/jdk/java-5x/label/ubuntu/trunk/pom.xml
to <https://grid.sonatype.org/ci/job/maven-plugins-ITs/./jdk=java-5x,label=ubuntu/ws/.repository/org/apache/maven/plugins/maven-plugins-aggregator/1-SNAPSHOT/maven-plugins-aggregator-1-SNAPSHOT.pom>
[INFO] [deploy:deploy {execution: default-deploy}]
[INFO] Retrieving previous build number from apache.snapshots.https
Uploading: http://repository.sonatype.org:8081/content/repositories/maven.snapshots/org/apache/maven/plugins/maven-plugins-aggregator/1-SNAPSHOT/maven-plugins-aggregator-1-20101118.070352-107.pom
3K uploaded  (maven-plugins-aggregator-1-20101118.070352-107.pom)
[INFO] Retrieving previous metadata from apache.snapshots.https
[INFO] Uploading repository metadata for: 'artifact org.apache.maven.plugins:maven-plugins-aggregator'
[INFO] Retrieving previous metadata from apache.snapshots.https
[INFO] Uploading repository metadata for: 'snapshot org.apache.maven.plugins:maven-plugins-aggregator:1-SNAPSHOT'
[INFO] 
[INFO] 
[INFO] ------------------------------------------------------------------------
[INFO] Reactor Summary:
[INFO] ------------------------------------------------------------------------
[INFO] Maven Plugins ......................................... SUCCESS [23.380s]
[INFO] Maven Invoker Plugin .................................. SUCCESS [5:44.576s]
[INFO] Maven Ant Plugin ...................................... SUCCESS [2:25.353s]
[INFO] Maven AntRun Plugin ................................... SUCCESS [1:20.054s]
[INFO] Maven Eclipse Plugin .................................. SUCCESS [9:44.406s]
[INFO] Maven Changelog Plugin ................................ SUCCESS [45.808s]
[INFO] Maven Changes Report Plugin ........................... SUCCESS [1:13.757s]
[INFO] Maven Checkstyle Plugin ............................... SUCCESS [2:18.319s]
[INFO] Maven Clean Plugin .................................... SUCCESS [43.526s]
[INFO] Maven Compiler Plugin ................................. SUCCESS [50.453s]
[INFO] Maven Dependency Plugin ............................... SUCCESS [4:18.549s]
[INFO] Maven Deploy Plugin ................................... SUCCESS [1:50.054s]
[INFO] Maven DOAP Plugin ..................................... SUCCESS [25.381s]
[INFO] Maven Documentation Checker Plugin .................... SUCCESS [31.954s]
[INFO] Maven EAR Plugin ...................................... FAILED [1:01.564s]
[INFO] Maven EJB Plugin ...................................... SUCCESS [56.050s]
[INFO] Maven GPG Plugin ...................................... SUCCESS [42.195s]
[INFO] Maven Help Plugin ..................................... SUCCESS [49.663s]
[INFO] Maven IDEA Plugin ..................................... SUCCESS [18.046s]
[INFO] Maven Install Plugin .................................. SUCCESS [1:33.067s]
[INFO] Maven JAR Plugin ...................................... SUCCESS [2:00.420s]
[INFO] Maven Jarsigner Plugin ................................ SUCCESS [1:01.792s]
[INFO] Maven Shade Plugin .................................... SUCCESS [2:49.916s]
[INFO] Maven Javadoc Plugin .................................. FAILED [5:50.357s]
[INFO] Maven Linkcheck Plugin ................................ SUCCESS [5.201s]
[INFO] Maven One Plugin ...................................... SUCCESS [6.002s]
[INFO] Maven Patch Plugin .................................... SUCCESS [20.808s]
[INFO] Maven PDF Plugin ...................................... SUCCESS [1:29.933s]
[INFO] Maven PMD Plugin ...................................... SUCCESS [44.446s]
[INFO] Maven RAR Plugin ...................................... SUCCESS [15.411s]
[INFO] Maven Reactor Plugin .................................. SUCCESS [6.843s]
[INFO] Maven Repository Plugin ............................... SUCCESS [1:11.824s]
[INFO] Maven Resources Plugin ................................ SUCCESS [1:06.451s]
[INFO] Maven Site Plugin ..................................... SUCCESS [25:52.423s]
[INFO] Maven Source Plugin ................................... SUCCESS [47.224s]
[INFO] Maven Stage Plugin .................................... SUCCESS [13.223s]
[INFO] Maven Toolchains Plugin ............................... SUCCESS [4.955s]
[INFO] Maven Verifier Plugin ................................. SUCCESS [13.974s]
[INFO] Maven WAR Plugin ...................................... SUCCESS [1:48.834s]
[INFO] Maven Plugins Aggregator .............................. SUCCESS [3.012s]
[INFO] ------------------------------------------------------------------------
[INFO] Error for project: Maven EAR Plugin (during deploy)
[INFO] ------------------------------------------------------------------------
[INFO] : org.apache.maven.plugin.invoker.InvokerSession@1359808a
1 build failed.
[INFO] ------------------------------------------------------------------------
[INFO] Trace
org.apache.maven.BuildFailureException: 1 build failed.
	at org.apache.maven.lifecycle.DefaultLifecycleExecutor.executeGoals(DefaultLifecycleExecutor.java:715)
	at org.apache.maven.lifecycle.DefaultLifecycleExecutor.executeGoalWithLifecycle(DefaultLifecycleExecutor.java:556)
	at org.apache.maven.lifecycle.DefaultLifecycleExecutor.executeGoal(DefaultLifecycleExecutor.java:535)
	at org.apache.maven.lifecycle.DefaultLifecycleExecutor.executeGoalAndHandleFailures(DefaultLifecycleExecutor.java:387)
	at org.apache.maven.lifecycle.DefaultLifecycleExecutor.executeTaskSegments(DefaultLifecycleExecutor.java:348)
	at org.apache.maven.lifecycle.DefaultLifecycleExecutor.execute(DefaultLifecycleExecutor.java:180)
	at org.apache.maven.DefaultMaven.doExecute(DefaultMaven.java:328)
	at org.apache.maven.DefaultMaven.execute(DefaultMaven.java:138)
	at org.apache.maven.cli.MavenCli.main(MavenCli.java:362)
	at org.apache.maven.cli.compat.CompatibleMain.main(CompatibleMain.java:60)
	at sun.reflect.NativeMethodAccessorImpl.invoke0(Native Method)
	at sun.reflect.NativeMethodAccessorImpl.invoke(NativeMethodAccessorImpl.java:39)
	at sun.reflect.DelegatingMethodAccessorImpl.invoke(DelegatingMethodAccessorImpl.java:25)
	at java.lang.reflect.Method.invoke(Method.java:592)
	at org.codehaus.classworlds.Launcher.launchEnhanced(Launcher.java:315)
	at org.codehaus.classworlds.Launcher.launch(Launcher.java:255)
	at org.codehaus.classworlds.Launcher.mainWithExitCode(Launcher.java:430)
	at org.codehaus.classworlds.Launcher.main(Launcher.java:375)
Caused by: org.apache.maven.plugin.MojoFailureException: 1 build failed.
	at org.apache.maven.plugin.invoker.InvokerSession.handleFailures(InvokerSession.java:244)
	at org.apache.maven.plugin.invoker.InvokerMojo.processResults(InvokerMojo.java:58)
	at org.apache.maven.plugin.invoker.AbstractInvokerMojo.execute(AbstractInvokerMojo.java:601)
	at org.apache.maven.plugin.DefaultPluginManager.executeMojo(DefaultPluginManager.java:490)
	at org.apache.maven.lifecycle.DefaultLifecycleExecutor.executeGoals(DefaultLifecycleExecutor.java:694)
	... 17 more
[INFO] ------------------------------------------------------------------------
[INFO] Error for project: Maven Javadoc Plugin (during deploy)
[INFO] ------------------------------------------------------------------------
[INFO] There are test failures.

Please refer to /opt/grid/slave/workspace/maven-plugins-ITs/jdk/java-5x/label/ubuntu/trunk/maven-javadoc-plugin/target/surefire-reports
for the individual test results.
[INFO] ------------------------------------------------------------------------
[INFO] Trace
org.apache.maven.BuildFailureException: There are test failures.

Please refer to /opt/grid/slave/workspace/maven-plugins-ITs/jdk/java-5x/label/ubuntu/trunk/maven-javadoc-plugin/target/surefire-reports
for the individual test results.
	at org.apache.maven.lifecycle.DefaultLifecycleExecutor.executeGoals(DefaultLifecycleExecutor.java:715)
	at org.apache.maven.lifecycle.DefaultLifecycleExecutor.executeGoalWithLifecycle(DefaultLifecycleExecutor.java:556)
	at org.apache.maven.lifecycle.DefaultLifecycleExecutor.executeGoal(DefaultLifecycleExecutor.java:535)
	at org.apache.maven.lifecycle.DefaultLifecycleExecutor.executeGoalAndHandleFailures(DefaultLifecycleExecutor.java:387)
	at org.apache.maven.lifecycle.DefaultLifecycleExecutor.executeTaskSegments(DefaultLifecycleExecutor.java:348)
	at org.apache.maven.lifecycle.DefaultLifecycleExecutor.execute(DefaultLifecycleExecutor.java:180)
	at org.apache.maven.DefaultMaven.doExecute(DefaultMaven.java:328)
	at org.apache.maven.DefaultMaven.execute(DefaultMaven.java:138)
	at org.apache.maven.cli.MavenCli.main(MavenCli.java:362)
	at org.apache.maven.cli.compat.CompatibleMain.main(CompatibleMain.java:60)
	at sun.reflect.NativeMethodAccessorImpl.invoke0(Native Method)
	at sun.reflect.NativeMethodAccessorImpl.invoke(NativeMethodAccessorImpl.java:39)
	at sun.reflect.DelegatingMethodAccessorImpl.invoke(DelegatingMethodAccessorImpl.java:25)
	at java.lang.reflect.Method.invoke(Method.java:592)
	at org.codehaus.classworlds.Launcher.launchEnhanced(Launcher.java:315)
	at org.codehaus.classworlds.Launcher.launch(Launcher.java:255)
	at org.codehaus.classworlds.Launcher.mainWithExitCode(Launcher.java:430)
	at org.codehaus.classworlds.Launcher.main(Launcher.java:375)
Caused by: org.apache.maven.plugin.MojoFailureException: There are test failures.

Please refer to /opt/grid/slave/workspace/maven-plugins-ITs/jdk/java-5x/label/ubuntu/trunk/maven-javadoc-plugin/target/surefire-reports
for the individual test results.
	at org.apache.maven.plugin.surefire.SurefirePlugin.execute(SurefirePlugin.java:575)
	at org.apache.maven.plugin.DefaultPluginManager.executeMojo(DefaultPluginManager.java:490)
	at org.apache.maven.lifecycle.DefaultLifecycleExecutor.executeGoals(DefaultLifecycleExecutor.java:694)
	... 17 more
[INFO] ------------------------------------------------------------------------
[INFO] BUILD ERRORS
[INFO] ------------------------------------------------------------------------
[INFO] Total time: 84 minutes 12 seconds
[INFO] Finished at: Thu Nov 18 02:27:49 CST 2010
[INFO] Final Memory: 111M/217M
[INFO] ------------------------------------------------------------------------


Mime
View raw message