maven-notifications mailing list archives

Site index · List index
Message view « Date » · « Thread »
Top « Date » · « Thread »
From "GRiD .ORG" <bui...@lists.sonatype.com>
Subject Build failed in Hudson: maven-scm » java-5x,ubuntu #186
Date Sun, 09 Jan 2011 18:42:14 GMT
See <https://grid.sonatype.org/ci/job/maven-scm/./jdk=java-5x,label=ubuntu/186/changes>

Changes:

[Olivier Lamy] [SCM-591] Move to Java 1.5 : configure modello to generate 1.5 generics

[Olivier Lamy] [SCM-591] Move to Java 1.5 : fix some generics warning in bazaar provider

[Olivier Lamy] [SCM-591] Move to Java 1.5 : status command

[Olivier Lamy] [SCM-591] Move to Java 1.5 : remove no more needed SuppressWarning

[Olivier Lamy] [SCM-591] Move to Java 1.5 : in diff result use CharSequence rather than a
direct implementation fix junit compilation

[Olivier Lamy] [SCM-591] Move to Java 1.5 : in diff result use CharSequence rather than a
direct implementation

[Olivier Lamy] [SCM-591] Move to Java 1.5 : update command

[Olivier Lamy] [SCM-591] Move to Java 1.5 : unedit command

[Olivier Lamy] [SCM-591] Move to Java 1.5 : tag command

------------------------------------------
[...truncated 2890 lines...]
[INFO] --- maven-site-plugin:3.0-beta-3:attach-descriptor (attach-descriptor) @ maven-scm-provider-vss
---
[INFO] 
[INFO] --- maven-install-plugin:2.3:install (default-install) @ maven-scm-provider-vss ---
[INFO] Installing /opt/grid/slave/workspace/maven-scm/jdk/java-5x/label/ubuntu/trunk/maven-scm-providers/maven-scm-provider-vss/target/maven-scm-provider-vss-1.5-SNAPSHOT.jar
to <https://grid.sonatype.org/ci/job/maven-scm/./jdk=java-5x,label=ubuntu/ws/.repository/org/apache/maven/scm/maven-scm-provider-vss/1.5-SNAPSHOT/maven-scm-provider-vss-1.5-SNAPSHOT.jar>
[INFO] Installing /opt/grid/slave/workspace/maven-scm/jdk/java-5x/label/ubuntu/trunk/maven-scm-providers/maven-scm-provider-vss/pom.xml
to <https://grid.sonatype.org/ci/job/maven-scm/./jdk=java-5x,label=ubuntu/ws/.repository/org/apache/maven/scm/maven-scm-provider-vss/1.5-SNAPSHOT/maven-scm-provider-vss-1.5-SNAPSHOT.pom>
[INFO] Installing /opt/grid/slave/workspace/maven-scm/jdk/java-5x/label/ubuntu/trunk/maven-scm-providers/maven-scm-provider-vss/target/maven-scm-provider-vss-1.5-SNAPSHOT-site.xml
to <https://grid.sonatype.org/ci/job/maven-scm/./jdk=java-5x,label=ubuntu/ws/.repository/org/apache/maven/scm/maven-scm-provider-vss/1.5-SNAPSHOT/maven-scm-provider-vss-1.5-SNAPSHOT-site.xml>
[INFO] 
[INFO] --- maven-deploy-plugin:2.5:deploy (default-deploy) @ maven-scm-provider-vss ---
Downloading: http://repository.sonatype.org:8081/content/repositories/maven.snapshots/org/apache/maven/scm/maven-scm-provider-vss/1.5-SNAPSHOT/maven-metadata.xml
Downloaded: http://repository.sonatype.org:8081/content/repositories/maven.snapshots/org/apache/maven/scm/maven-scm-provider-vss/1.5-SNAPSHOT/maven-metadata.xml
(999 B at 9.1 KB/sec)
Uploading: http://repository.sonatype.org:8081/content/repositories/maven.snapshots/org/apache/maven/scm/maven-scm-provider-vss/1.5-SNAPSHOT/maven-scm-provider-vss-1.5-20110109.184154-29.jar
Uploaded: http://repository.sonatype.org:8081/content/repositories/maven.snapshots/org/apache/maven/scm/maven-scm-provider-vss/1.5-SNAPSHOT/maven-scm-provider-vss-1.5-20110109.184154-29.jar
(67 KB at 92.6 KB/sec)
Uploading: http://repository.sonatype.org:8081/content/repositories/maven.snapshots/org/apache/maven/scm/maven-scm-provider-vss/1.5-SNAPSHOT/maven-scm-provider-vss-1.5-20110109.184154-29.pom
Uploaded: http://repository.sonatype.org:8081/content/repositories/maven.snapshots/org/apache/maven/scm/maven-scm-provider-vss/1.5-SNAPSHOT/maven-scm-provider-vss-1.5-20110109.184154-29.pom
(3 KB at 1.0 KB/sec)
Downloading: http://repository.sonatype.org:8081/content/repositories/maven.snapshots/org/apache/maven/scm/maven-scm-provider-vss/maven-metadata.xml
Downloaded: http://repository.sonatype.org:8081/content/repositories/maven.snapshots/org/apache/maven/scm/maven-scm-provider-vss/maven-metadata.xml
(436 B at 2.2 KB/sec)
Uploading: http://repository.sonatype.org:8081/content/repositories/maven.snapshots/org/apache/maven/scm/maven-scm-provider-vss/1.5-SNAPSHOT/maven-metadata.xml
Uploaded: http://repository.sonatype.org:8081/content/repositories/maven.snapshots/org/apache/maven/scm/maven-scm-provider-vss/1.5-SNAPSHOT/maven-metadata.xml
(999 B at 2.0 KB/sec)
Uploading: http://repository.sonatype.org:8081/content/repositories/maven.snapshots/org/apache/maven/scm/maven-scm-provider-vss/maven-metadata.xml
Uploaded: http://repository.sonatype.org:8081/content/repositories/maven.snapshots/org/apache/maven/scm/maven-scm-provider-vss/maven-metadata.xml
(436 B at 1.2 KB/sec)
Uploading: http://repository.sonatype.org:8081/content/repositories/maven.snapshots/org/apache/maven/scm/maven-scm-provider-vss/1.5-SNAPSHOT/maven-scm-provider-vss-1.5-20110109.184154-29-site.xml
Uploaded: http://repository.sonatype.org:8081/content/repositories/maven.snapshots/org/apache/maven/scm/maven-scm-provider-vss/1.5-SNAPSHOT/maven-scm-provider-vss-1.5-20110109.184154-29-site.xml
(589 B at 1.8 KB/sec)
Uploading: http://repository.sonatype.org:8081/content/repositories/maven.snapshots/org/apache/maven/scm/maven-scm-provider-vss/1.5-SNAPSHOT/maven-metadata.xml
Uploaded: http://repository.sonatype.org:8081/content/repositories/maven.snapshots/org/apache/maven/scm/maven-scm-provider-vss/1.5-SNAPSHOT/maven-metadata.xml
(999 B at 2.1 KB/sec)
[INFO]                                                                         
[INFO] ------------------------------------------------------------------------
[INFO] Building Maven SCM TFS Provider 1.5-SNAPSHOT
[INFO] ------------------------------------------------------------------------
[INFO] 
[INFO] --- maven-clean-plugin:2.4.1:clean (default-clean) @ maven-scm-provider-tfs ---
[INFO] Deleting /opt/grid/slave/workspace/maven-scm/jdk/java-5x/label/ubuntu/trunk/maven-scm-providers/maven-scm-provider-tfs/target
[INFO] 
[INFO] --- maven-remote-resources-plugin:1.1:process (default) @ maven-scm-provider-tfs ---
[INFO] 
[INFO] --- plexus-maven-plugin:1.3.8:descriptor (create-component-descriptor) @ maven-scm-provider-tfs
---
[INFO] Discovered 1 component descriptors(s)
[INFO] 
[INFO] --- maven-resources-plugin:2.4:resources (default-resources) @ maven-scm-provider-tfs
---
[INFO] Using 'UTF-8' encoding to copy filtered resources.
[INFO] skip non existing resourceDirectory /opt/grid/slave/workspace/maven-scm/jdk/java-5x/label/ubuntu/trunk/maven-scm-providers/maven-scm-provider-tfs/src/main/resources
[INFO] Copying 3 resources
[INFO] 
[INFO] --- maven-compiler-plugin:2.3.2:compile (default-compile) @ maven-scm-provider-tfs
---
[INFO] Compiling 21 source files to /opt/grid/slave/workspace/maven-scm/jdk/java-5x/label/ubuntu/trunk/maven-scm-providers/maven-scm-provider-tfs/target/classes
[INFO] 
[INFO] --- maven-resources-plugin:2.4:testResources (default-testResources) @ maven-scm-provider-tfs
---
[INFO] Using 'UTF-8' encoding to copy filtered resources.
[INFO] Copying 1 resource
[INFO] Copying 3 resources
[INFO] 
[INFO] --- maven-compiler-plugin:2.3.2:testCompile (default-testCompile) @ maven-scm-provider-tfs
---
[INFO] Compiling 13 source files to /opt/grid/slave/workspace/maven-scm/jdk/java-5x/label/ubuntu/trunk/maven-scm-providers/maven-scm-provider-tfs/target/test-classes
[INFO] 
[INFO] --- maven-surefire-plugin:2.7.1:test (default-test) @ maven-scm-provider-tfs ---
[INFO] Surefire report directory: /opt/grid/slave/workspace/maven-scm/jdk/java-5x/label/ubuntu/trunk/maven-scm-providers/maven-scm-provider-tfs/target/surefire-reports

-------------------------------------------------------
 T E S T S
-------------------------------------------------------
Running org.apache.maven.scm.provider.tfs.command.TfsAddCommandTest
Tests run: 2, Failures: 0, Errors: 0, Skipped: 0, Time elapsed: 0.265 sec
Running org.apache.maven.scm.provider.tfs.command.TfsTagCommandTest
Tests run: 2, Failures: 0, Errors: 0, Skipped: 0, Time elapsed: 0.086 sec
Running org.apache.maven.scm.provider.tfs.command.TfsCommandTest
Tests run: 1, Failures: 0, Errors: 0, Skipped: 0, Time elapsed: 0.047 sec
Running org.apache.maven.scm.provider.tfs.command.TfsChangeLogCommandTest
Tests run: 4, Failures: 0, Errors: 0, Skipped: 0, Time elapsed: 0.168 sec
Running org.apache.maven.scm.provider.tfs.command.TfsStatusCommandTest
Tests run: 4, Failures: 0, Errors: 0, Skipped: 0, Time elapsed: 0.115 sec
Running org.apache.maven.scm.provider.tfs.command.TfsListCommandTest
Tests run: 3, Failures: 0, Errors: 0, Skipped: 0, Time elapsed: 0.094 sec
Running org.apache.maven.scm.provider.tfs.command.TfsCheckInCommandTest
Tests run: 2, Failures: 0, Errors: 0, Skipped: 0, Time elapsed: 0.059 sec
Running org.apache.maven.scm.provider.tfs.command.TfsUnEditCommandTest
Tests run: 2, Failures: 0, Errors: 0, Skipped: 0, Time elapsed: 0.047 sec
Running org.apache.maven.scm.provider.tfs.command.TfsBranchCommandTest
Tests run: 2, Failures: 0, Errors: 0, Skipped: 0, Time elapsed: 0.035 sec
Running org.apache.maven.scm.provider.tfs.command.TfsCheckOutCommandTest
Tests run: 4, Failures: 0, Errors: 0, Skipped: 0, Time elapsed: 0.075 sec
Running org.apache.maven.scm.provider.tfs.command.TfsEditCommandTest
Tests run: 3, Failures: 0, Errors: 0, Skipped: 0, Time elapsed: 0.057 sec
Running org.apache.maven.scm.provider.tfs.command.TfsUpdateCommandTest
Tests run: 2, Failures: 0, Errors: 0, Skipped: 0, Time elapsed: 0.04 sec
Running org.apache.maven.scm.provider.tfs.command.blame.TfsBlameConsumerTest
Tests run: 1, Failures: 0, Errors: 0, Skipped: 0, Time elapsed: 0.023 sec

Results :

Tests run: 32, Failures: 0, Errors: 0, Skipped: 0

[INFO] 
[INFO] --- maven-jar-plugin:2.3:jar (default-jar) @ maven-scm-provider-tfs ---
[INFO] Building jar: /opt/grid/slave/workspace/maven-scm/jdk/java-5x/label/ubuntu/trunk/maven-scm-providers/maven-scm-provider-tfs/target/maven-scm-provider-tfs-1.5-SNAPSHOT.jar
[INFO] 
[INFO] --- maven-site-plugin:3.0-beta-3:attach-descriptor (attach-descriptor) @ maven-scm-provider-tfs
---
[INFO] 
[INFO] --- maven-install-plugin:2.3:install (default-install) @ maven-scm-provider-tfs ---
[INFO] Installing /opt/grid/slave/workspace/maven-scm/jdk/java-5x/label/ubuntu/trunk/maven-scm-providers/maven-scm-provider-tfs/target/maven-scm-provider-tfs-1.5-SNAPSHOT.jar
to <https://grid.sonatype.org/ci/job/maven-scm/./jdk=java-5x,label=ubuntu/ws/.repository/org/apache/maven/scm/maven-scm-provider-tfs/1.5-SNAPSHOT/maven-scm-provider-tfs-1.5-SNAPSHOT.jar>
[INFO] Installing /opt/grid/slave/workspace/maven-scm/jdk/java-5x/label/ubuntu/trunk/maven-scm-providers/maven-scm-provider-tfs/pom.xml
to <https://grid.sonatype.org/ci/job/maven-scm/./jdk=java-5x,label=ubuntu/ws/.repository/org/apache/maven/scm/maven-scm-provider-tfs/1.5-SNAPSHOT/maven-scm-provider-tfs-1.5-SNAPSHOT.pom>
[INFO] 
[INFO] --- maven-deploy-plugin:2.5:deploy (default-deploy) @ maven-scm-provider-tfs ---
Downloading: http://repository.sonatype.org:8081/content/repositories/maven.snapshots/org/apache/maven/scm/maven-scm-provider-tfs/1.5-SNAPSHOT/maven-metadata.xml
Downloaded: http://repository.sonatype.org:8081/content/repositories/maven.snapshots/org/apache/maven/scm/maven-scm-provider-tfs/1.5-SNAPSHOT/maven-metadata.xml
(789 B at 2.9 KB/sec)
Uploading: http://repository.sonatype.org:8081/content/repositories/maven.snapshots/org/apache/maven/scm/maven-scm-provider-tfs/1.5-SNAPSHOT/maven-scm-provider-tfs-1.5-20110109.184205-30.jar
Uploaded: http://repository.sonatype.org:8081/content/repositories/maven.snapshots/org/apache/maven/scm/maven-scm-provider-tfs/1.5-SNAPSHOT/maven-scm-provider-tfs-1.5-20110109.184205-30.jar
(41 KB at 64.1 KB/sec)
Uploading: http://repository.sonatype.org:8081/content/repositories/maven.snapshots/org/apache/maven/scm/maven-scm-provider-tfs/1.5-SNAPSHOT/maven-scm-provider-tfs-1.5-20110109.184205-30.pom
Uploaded: http://repository.sonatype.org:8081/content/repositories/maven.snapshots/org/apache/maven/scm/maven-scm-provider-tfs/1.5-SNAPSHOT/maven-scm-provider-tfs-1.5-20110109.184205-30.pom
(3 KB at 7.6 KB/sec)
Downloading: http://repository.sonatype.org:8081/content/repositories/maven.snapshots/org/apache/maven/scm/maven-scm-provider-tfs/maven-metadata.xml
Downloaded: http://repository.sonatype.org:8081/content/repositories/maven.snapshots/org/apache/maven/scm/maven-scm-provider-tfs/maven-metadata.xml
(396 B at 2.1 KB/sec)
Uploading: http://repository.sonatype.org:8081/content/repositories/maven.snapshots/org/apache/maven/scm/maven-scm-provider-tfs/1.5-SNAPSHOT/maven-metadata.xml
Uploaded: http://repository.sonatype.org:8081/content/repositories/maven.snapshots/org/apache/maven/scm/maven-scm-provider-tfs/1.5-SNAPSHOT/maven-metadata.xml
(789 B at 2.4 KB/sec)
Uploading: http://repository.sonatype.org:8081/content/repositories/maven.snapshots/org/apache/maven/scm/maven-scm-provider-tfs/maven-metadata.xml
Uploaded: http://repository.sonatype.org:8081/content/repositories/maven.snapshots/org/apache/maven/scm/maven-scm-provider-tfs/maven-metadata.xml
(396 B at 1.1 KB/sec)
[INFO]                                                                         
[INFO] ------------------------------------------------------------------------
[INFO] Skipping Maven SCM Standard Providers
[INFO] This project has been banned from the build due to previous failures.
[INFO] ------------------------------------------------------------------------
[INFO]                                                                         
[INFO] ------------------------------------------------------------------------
[INFO] Skipping Maven SCM Client
[INFO] This project has been banned from the build due to previous failures.
[INFO] ------------------------------------------------------------------------
[INFO]                                                                         
[INFO] ------------------------------------------------------------------------
[INFO] Skipping Maven SCM Plugin
[INFO] This project has been banned from the build due to previous failures.
[INFO] ------------------------------------------------------------------------
[INFO] ------------------------------------------------------------------------
[INFO] Reactor Summary:
[INFO] 
[INFO] Maven SCM ......................................... SUCCESS [16.181s]
[INFO] Maven SCM API ..................................... SUCCESS [17.763s]
[INFO] Maven SCM Managers ................................ SUCCESS [3.817s]
[INFO] Maven SCM Manager for Plexus ...................... SUCCESS [6.735s]
[INFO] Maven SCM Test .................................... SUCCESS [9.928s]
[INFO] Maven SCM Providers ............................... SUCCESS [2.848s]
[INFO] Maven SCM AccuRev Provider ........................ SUCCESS [18.945s]
[INFO] Maven SCM Bazaar Provider ......................... SUCCESS [13.925s]
[INFO] Maven SCM Clearcase Provider ...................... SUCCESS [14.378s]
[INFO] Maven SCM CVS Provider - Parent ................... SUCCESS [4.502s]
[INFO] Maven SCM CVS Provider TCK tests .................. SUCCESS [8.442s]
[INFO] Maven SCM CVS Provider - Common library ........... SUCCESS [9.852s]
[INFO] Maven SCM CVS Provider - CVS Executable Impl. ..... SUCCESS [18.328s]
[INFO] Maven SCM CVS Provider - CVS Java Impl. ........... SUCCESS [16.412s]
[INFO] Maven SCM Mercurial (Hg) Provider ................. SUCCESS [7.576s]
[INFO] Maven SCM Git Provider - Parent ................... SUCCESS [2.530s]
[INFO] Maven SCM Git Provider - Common library ........... SUCCESS [7.710s]
[INFO] Maven SCM git Provider TCK Tests .................. SUCCESS [7.484s]
[INFO] Maven SCM Git Provider - Git Executable Impl. ..... SUCCESS [10.187s]
[INFO] Maven SCM Local Provider .......................... SUCCESS [10.158s]
[INFO] Maven SCM Perforce Provider ....................... FAILURE [5.894s]
[INFO] Maven SCM Starteam Provider ....................... SUCCESS [13.150s]
[INFO] Maven SCM Subversion Provider - Parent ............ SUCCESS [2.856s]
[INFO] Maven SCM Subversion Provider - Common library .... SUCCESS [10.434s]
[INFO] Maven SCM Subversion Provider TCK Tests ........... SUCCESS [6.031s]
[INFO] Maven SCM Subversion Provider - SVN Executable Impl.  FAILURE [23.639s]
[INFO] Maven SCM Synergy Provider ........................ SUCCESS [9.821s]
[INFO] Maven SCM Visual Source Safe Provider ............. SUCCESS [11.586s]
[INFO] Maven SCM TFS Provider ............................ SUCCESS [7.234s]
[INFO] Maven SCM Standard Providers ...................... SKIPPED
[INFO] Maven SCM Client .................................. SKIPPED
[INFO] Maven SCM Plugin .................................. SKIPPED
[INFO] ------------------------------------------------------------------------
[INFO] BUILD FAILURE
[INFO] ------------------------------------------------------------------------
[INFO] Total time: 5:02.047s
[INFO] Finished at: Sun Jan 09 12:42:07 CST 2011
[INFO] Final Memory: 40M/416M
[INFO] ------------------------------------------------------------------------
[ERROR] Failed to execute goal org.apache.maven.plugins:maven-surefire-plugin:2.7.1:test (default-test)
on project maven-scm-provider-perforce: There are test failures.
[ERROR] 
[ERROR] Please refer to /opt/grid/slave/workspace/maven-scm/jdk/java-5x/label/ubuntu/trunk/maven-scm-providers/maven-scm-provider-perforce/target/surefire-reports
for the individual test results.
[ERROR] -> [Help 1]
org.apache.maven.lifecycle.LifecycleExecutionException: Failed to execute goal org.apache.maven.plugins:maven-surefire-plugin:2.7.1:test
(default-test) on project maven-scm-provider-perforce: There are test failures.

Please refer to /opt/grid/slave/workspace/maven-scm/jdk/java-5x/label/ubuntu/trunk/maven-scm-providers/maven-scm-provider-perforce/target/surefire-reports
for the individual test results.
	at org.apache.maven.lifecycle.internal.MojoExecutor.execute(MojoExecutor.java:199)
	at org.apache.maven.lifecycle.internal.MojoExecutor.execute(MojoExecutor.java:148)
	at org.apache.maven.lifecycle.internal.MojoExecutor.execute(MojoExecutor.java:140)
	at org.apache.maven.lifecycle.internal.LifecycleModuleBuilder.buildProject(LifecycleModuleBuilder.java:84)
	at org.apache.maven.lifecycle.internal.LifecycleModuleBuilder.buildProject(LifecycleModuleBuilder.java:59)
	at org.apache.maven.lifecycle.internal.LifecycleStarter.singleThreadedBuild(LifecycleStarter.java:183)
	at org.apache.maven.lifecycle.internal.LifecycleStarter.execute(LifecycleStarter.java:161)
	at org.apache.maven.DefaultMaven.doExecute(DefaultMaven.java:316)
	at org.apache.maven.DefaultMaven.execute(DefaultMaven.java:153)
	at org.apache.maven.cli.MavenCli.execute(MavenCli.java:451)
	at org.apache.maven.cli.MavenCli.doMain(MavenCli.java:188)
	at org.apache.maven.cli.MavenCli.main(MavenCli.java:134)
	at sun.reflect.NativeMethodAccessorImpl.invoke0(Native Method)
	at sun.reflect.NativeMethodAccessorImpl.invoke(NativeMethodAccessorImpl.java:39)
	at sun.reflect.DelegatingMethodAccessorImpl.invoke(DelegatingMethodAccessorImpl.java:25)
	at java.lang.reflect.Method.invoke(Method.java:592)
	at org.codehaus.plexus.classworlds.launcher.Launcher.launchEnhanced(Launcher.java:290)
	at org.codehaus.plexus.classworlds.launcher.Launcher.launch(Launcher.java:230)
	at org.codehaus.plexus.classworlds.launcher.Launcher.mainWithExitCode(Launcher.java:409)
	at org.codehaus.plexus.classworlds.launcher.Launcher.main(Launcher.java:352)
Caused by: org.apache.maven.plugin.MojoFailureException: There are test failures.

Please refer to /opt/grid/slave/workspace/maven-scm/jdk/java-5x/label/ubuntu/trunk/maven-scm-providers/maven-scm-provider-perforce/target/surefire-reports
for the individual test results.
	at org.apache.maven.plugin.surefire.SurefireHelper.reportExecution(SurefireHelper.java:74)
	at org.apache.maven.plugin.surefire.SurefirePlugin.execute(SurefirePlugin.java:631)
	at org.apache.maven.plugin.DefaultBuildPluginManager.executeMojo(DefaultBuildPluginManager.java:107)
	at org.apache.maven.lifecycle.internal.MojoExecutor.execute(MojoExecutor.java:195)
	... 19 more
[ERROR] Failed to execute goal org.apache.maven.plugins:maven-surefire-plugin:2.7.1:test (default-test)
on project maven-scm-provider-svnexe: There are test failures.
[ERROR] 
[ERROR] Please refer to /opt/grid/slave/workspace/maven-scm/jdk/java-5x/label/ubuntu/trunk/maven-scm-providers/maven-scm-providers-svn/maven-scm-provider-svnexe/target/surefire-reports
for the individual test results.
[ERROR] -> [Help 1]
org.apache.maven.lifecycle.LifecycleExecutionException: Failed to execute goal org.apache.maven.plugins:maven-surefire-plugin:2.7.1:test
(default-test) on project maven-scm-provider-svnexe: There are test failures.

Please refer to /opt/grid/slave/workspace/maven-scm/jdk/java-5x/label/ubuntu/trunk/maven-scm-providers/maven-scm-providers-svn/maven-scm-provider-svnexe/target/surefire-reports
for the individual test results.
	at org.apache.maven.lifecycle.internal.MojoExecutor.execute(MojoExecutor.java:199)
	at org.apache.maven.lifecycle.internal.MojoExecutor.execute(MojoExecutor.java:148)
	at org.apache.maven.lifecycle.internal.MojoExecutor.execute(MojoExecutor.java:140)
	at org.apache.maven.lifecycle.internal.LifecycleModuleBuilder.buildProject(LifecycleModuleBuilder.java:84)
	at org.apache.maven.lifecycle.internal.LifecycleModuleBuilder.buildProject(LifecycleModuleBuilder.java:59)
	at org.apache.maven.lifecycle.internal.LifecycleStarter.singleThreadedBuild(LifecycleStarter.java:183)
	at org.apache.maven.lifecycle.internal.LifecycleStarter.execute(LifecycleStarter.java:161)
	at org.apache.maven.DefaultMaven.doExecute(DefaultMaven.java:316)
	at org.apache.maven.DefaultMaven.execute(DefaultMaven.java:153)
	at org.apache.maven.cli.MavenCli.execute(MavenCli.java:451)
	at org.apache.maven.cli.MavenCli.doMain(MavenCli.java:188)
	at org.apache.maven.cli.MavenCli.main(MavenCli.java:134)
	at sun.reflect.NativeMethodAccessorImpl.invoke0(Native Method)
	at sun.reflect.NativeMethodAccessorImpl.invoke(NativeMethodAccessorImpl.java:39)
	at sun.reflect.DelegatingMethodAccessorImpl.invoke(DelegatingMethodAccessorImpl.java:25)
	at java.lang.reflect.Method.invoke(Method.java:592)
	at org.codehaus.plexus.classworlds.launcher.Launcher.launchEnhanced(Launcher.java:290)
	at org.codehaus.plexus.classworlds.launcher.Launcher.launch(Launcher.java:230)
	at org.codehaus.plexus.classworlds.launcher.Launcher.mainWithExitCode(Launcher.java:409)
	at org.codehaus.plexus.classworlds.launcher.Launcher.main(Launcher.java:352)
Caused by: org.apache.maven.plugin.MojoFailureException: There are test failures.

Please refer to /opt/grid/slave/workspace/maven-scm/jdk/java-5x/label/ubuntu/trunk/maven-scm-providers/maven-scm-providers-svn/maven-scm-provider-svnexe/target/surefire-reports
for the individual test results.
	at org.apache.maven.plugin.surefire.SurefireHelper.reportExecution(SurefireHelper.java:74)
	at org.apache.maven.plugin.surefire.SurefirePlugin.execute(SurefirePlugin.java:631)
	at org.apache.maven.plugin.DefaultBuildPluginManager.executeMojo(DefaultBuildPluginManager.java:107)
	at org.apache.maven.lifecycle.internal.MojoExecutor.execute(MojoExecutor.java:195)
	... 19 more
[ERROR] 
[ERROR] Re-run Maven using the -X switch to enable full debug logging.
[ERROR] 
[ERROR] For more information about the errors and possible solutions, please read the following
articles:
[ERROR] [Help 1] http://cwiki.apache.org/confluence/display/MAVEN/MojoFailureException
[ERROR] 
[ERROR] After correcting the problems, you can resume the build with the command
[ERROR]   mvn <goals> -rf :maven-scm-provider-perforce
Recording test results


Mime
View raw message