maven-notifications mailing list archives

Site index · List index
Message view « Date » · « Thread »
Top « Date » · « Thread »
From "GRiD .ORG" <bui...@lists.sonatype.com>
Subject Build failed in Hudson: surefire » java-5x,windows #218
Date Thu, 13 Jan 2011 21:17:09 GMT
See <https://grid.sonatype.org/ci/job/surefire/./jdk=java-5x,label=windows/218/changes>

Changes:

[Kristian Rosenvold] [SUREFIRE-500] Changed log status from failure to error

[Kristian Rosenvold] [SUREFIRE-500] puzzling NoClassDefFoundError instead of meaningfull stacktrace

Fixed with integration test

------------------------------------------
[...truncated 697 lines...]
[INFO] Retrieving previous metadata from apache.snapshots.https
[INFO] Uploading repository metadata for: 'org.apache.maven.plugins'
[INFO] Uploading project information for maven-surefire-report-plugin 2.7.2-20110113.210202-28
[INFO] ------------------------------------------------------------------------
[INFO] Building Maven Surefire Integration Tests
[INFO]    task-segment: [clean, deploy]
[INFO] ------------------------------------------------------------------------
[INFO] [clean:clean {execution: default-clean}]
[INFO] Deleting X:\slave\workspace\surefire\jdk\java-5x\label\windows\trunk\surefire-integration-tests\target
[INFO] [enforcer:enforce {execution: require-maven-2.1.0}]
[INFO] [remote-resources:process {execution: default}]
[INFO] [resources:resources {execution: default-resources}]
[INFO] Using 'UTF-8' encoding to copy filtered resources.
[INFO] skip non existing resourceDirectory X:\slave\workspace\surefire\jdk\java-5x\label\windows\trunk\surefire-integration-tests\src\main\resources
[INFO] Copying 3 resources
[INFO] [compiler:compile {execution: default-compile}]
[INFO] No sources to compile
[INFO] [help:effective-settings {execution: settings.xml}]
[INFO] Effective-settings written to: X:\slave\workspace\surefire\jdk\java-5x\label\windows\trunk\surefire-integration-tests\target\private\settings.xml
[INFO] [resources:testResources {execution: default-testResources}]
[INFO] Using 'UTF-8' encoding to copy filtered resources.
[INFO] Copying 198 resources
[INFO] Copying 3 resources
[INFO] [compiler:testCompile {execution: default-testCompile}]
[INFO] Compiling 71 source files to X:\slave\workspace\surefire\jdk\java-5x\label\windows\trunk\surefire-integration-tests\target\test-classes
[WARNING] DEPRECATED [systemProperties]: Use systemPropertyVariables instead.
[INFO] [surefire:test {execution: default-test}]
[INFO] Surefire report directory: X:\slave\workspace\surefire\jdk\java-5x\label\windows\trunk\surefire-integration-tests\target\surefire-reports

-------------------------------------------------------
 T E S T S
-------------------------------------------------------
Running org.apache.maven.surefire.its.SetUpForIntegrationTest
Tests run: 1, Failures: 0, Errors: 0, Skipped: 0, Time elapsed: 0.072 sec

Results :

Tests run: 1, Failures: 0, Errors: 0, Skipped: 0

[INFO] [jar:jar {execution: default-jar}]
[INFO] Building jar: X:\slave\workspace\surefire\jdk\java-5x\label\windows\trunk\surefire-integration-tests\target\surefire-integration-tests-2.7.2-SNAPSHOT.jar
[INFO] [invoker:install {execution: default}]
[INFO] Installing X:\slave\workspace\surefire\jdk\java-5x\label\windows\trunk\maven-surefire-report-plugin\pom.xml
to X:\slave\workspace\surefire\jdk\java-5x\label\windows\trunk\surefire-integration-tests\target\it-repo\org\apache\maven\plugins\maven-surefire-report-plugin\2.7.2-SNAPSHOT\maven-surefire-report-plugin-2.7.2-SNAPSHOT.pom
[INFO] Installing X:\slave\workspace\surefire\jdk\java-5x\label\windows\trunk\maven-surefire-report-plugin\target\maven-surefire-report-plugin-2.7.2-SNAPSHOT.jar
to X:\slave\workspace\surefire\jdk\java-5x\label\windows\trunk\surefire-integration-tests\target\it-repo\org\apache\maven\plugins\maven-surefire-report-plugin\2.7.2-SNAPSHOT\maven-surefire-report-plugin-2.7.2-20110113.210202-28.jar
[INFO] Installing x:\slave\workspace\surefire\jdk\java-5x\label\windows\trunk\pom.xml to X:\slave\workspace\surefire\jdk\java-5x\label\windows\trunk\surefire-integration-tests\target\it-repo\org\apache\maven\surefire\surefire\2.7.2-SNAPSHOT\surefire-2.7.2-20110113.210202-28.pom
[INFO] Installing X:\slave\workspace\surefire\jdk\java-5x\label\windows\trunk\maven-surefire-plugin\pom.xml
to X:\slave\workspace\surefire\jdk\java-5x\label\windows\trunk\surefire-integration-tests\target\it-repo\org\apache\maven\plugins\maven-surefire-plugin\2.7.2-SNAPSHOT\maven-surefire-plugin-2.7.2-SNAPSHOT.pom
[INFO] Installing X:\slave\workspace\surefire\jdk\java-5x\label\windows\trunk\maven-surefire-plugin\target\maven-surefire-plugin-2.7.2-SNAPSHOT.jar
to X:\slave\workspace\surefire\jdk\java-5x\label\windows\trunk\surefire-integration-tests\target\it-repo\org\apache\maven\plugins\maven-surefire-plugin\2.7.2-SNAPSHOT\maven-surefire-plugin-2.7.2-20110113.210202-28.jar
[INFO] Installing X:\slave\workspace\surefire\jdk\java-5x\label\windows\trunk\surefire-booter\pom.xml
to X:\slave\workspace\surefire\jdk\java-5x\label\windows\trunk\surefire-integration-tests\target\it-repo\org\apache\maven\surefire\surefire-booter\2.7.2-SNAPSHOT\surefire-booter-2.7.2-SNAPSHOT.pom
[INFO] Installing X:\slave\workspace\surefire\jdk\java-5x\label\windows\trunk\surefire-booter\target\surefire-booter-2.7.2-SNAPSHOT.jar
to X:\slave\workspace\surefire\jdk\java-5x\label\windows\trunk\surefire-integration-tests\target\it-repo\org\apache\maven\surefire\surefire-booter\2.7.2-SNAPSHOT\surefire-booter-2.7.2-20110113.210202-28.jar
[INFO] Installing X:\slave\workspace\surefire\jdk\java-5x\label\windows\trunk\surefire-api\dependency-reduced-pom.xml
to X:\slave\workspace\surefire\jdk\java-5x\label\windows\trunk\surefire-integration-tests\target\it-repo\org\apache\maven\surefire\surefire-api\2.7.2-SNAPSHOT\surefire-api-2.7.2-SNAPSHOT.pom
[INFO] Installing X:\slave\workspace\surefire\jdk\java-5x\label\windows\trunk\surefire-api\target\surefire-api-2.7.2-SNAPSHOT.jar
to X:\slave\workspace\surefire\jdk\java-5x\label\windows\trunk\surefire-integration-tests\target\it-repo\org\apache\maven\surefire\surefire-api\2.7.2-SNAPSHOT\surefire-api-2.7.2-20110113.210202-28.jar
[INFO] Installing X:\slave\workspace\surefire\jdk\java-5x\label\windows\trunk\maven-surefire-common\pom.xml
to X:\slave\workspace\surefire\jdk\java-5x\label\windows\trunk\surefire-integration-tests\target\it-repo\org\apache\maven\surefire\maven-surefire-common\2.7.2-SNAPSHOT\maven-surefire-common-2.7.2-SNAPSHOT.pom
[INFO] Installing X:\slave\workspace\surefire\jdk\java-5x\label\windows\trunk\maven-surefire-common\target\maven-surefire-common-2.7.2-SNAPSHOT.jar
to X:\slave\workspace\surefire\jdk\java-5x\label\windows\trunk\surefire-integration-tests\target\it-repo\org\apache\maven\surefire\maven-surefire-common\2.7.2-SNAPSHOT\maven-surefire-common-2.7.2-20110113.210202-28.jar
[INFO] Installing X:\slave\workspace\surefire\jdk\java-5x\label\windows\trunk\surefire-providers\surefire-testng\pom.xml
to X:\slave\workspace\surefire\jdk\java-5x\label\windows\trunk\surefire-integration-tests\target\it-repo\org\apache\maven\surefire\surefire-testng\2.7.2-SNAPSHOT\surefire-testng-2.7.2-SNAPSHOT.pom
[INFO] Installing X:\slave\workspace\surefire\jdk\java-5x\label\windows\trunk\surefire-providers\surefire-testng\target\surefire-testng-2.7.2-SNAPSHOT.jar
to X:\slave\workspace\surefire\jdk\java-5x\label\windows\trunk\surefire-integration-tests\target\it-repo\org\apache\maven\surefire\surefire-testng\2.7.2-SNAPSHOT\surefire-testng-2.7.2-20110113.210202-28.jar
[INFO] Installing X:\slave\workspace\surefire\jdk\java-5x\label\windows\trunk\surefire-providers\pom.xml
to X:\slave\workspace\surefire\jdk\java-5x\label\windows\trunk\surefire-integration-tests\target\it-repo\org\apache\maven\surefire\surefire-providers\2.7.2-SNAPSHOT\surefire-providers-2.7.2-20110113.210202-28.pom
[INFO] Installing X:\slave\workspace\surefire\jdk\java-5x\label\windows\trunk\surefire-providers\surefire-junit3\dependency-reduced-pom.xml
to X:\slave\workspace\surefire\jdk\java-5x\label\windows\trunk\surefire-integration-tests\target\it-repo\org\apache\maven\surefire\surefire-junit3\2.7.2-SNAPSHOT\surefire-junit3-2.7.2-SNAPSHOT.pom
[INFO] Installing X:\slave\workspace\surefire\jdk\java-5x\label\windows\trunk\surefire-providers\surefire-junit3\target\surefire-junit3-2.7.2-SNAPSHOT.jar
to X:\slave\workspace\surefire\jdk\java-5x\label\windows\trunk\surefire-integration-tests\target\it-repo\org\apache\maven\surefire\surefire-junit3\2.7.2-SNAPSHOT\surefire-junit3-2.7.2-20110113.210202-28.jar
[INFO] Installing X:\slave\workspace\surefire\jdk\java-5x\label\windows\trunk\surefire-providers\surefire-junit4\dependency-reduced-pom.xml
to X:\slave\workspace\surefire\jdk\java-5x\label\windows\trunk\surefire-integration-tests\target\it-repo\org\apache\maven\surefire\surefire-junit4\2.7.2-SNAPSHOT\surefire-junit4-2.7.2-SNAPSHOT.pom
[INFO] Installing X:\slave\workspace\surefire\jdk\java-5x\label\windows\trunk\surefire-providers\surefire-junit4\target\surefire-junit4-2.7.2-SNAPSHOT.jar
to X:\slave\workspace\surefire\jdk\java-5x\label\windows\trunk\surefire-integration-tests\target\it-repo\org\apache\maven\surefire\surefire-junit4\2.7.2-SNAPSHOT\surefire-junit4-2.7.2-20110113.210202-28.jar
[INFO] Installing X:\slave\workspace\surefire\jdk\java-5x\label\windows\trunk\surefire-providers\surefire-junit47\dependency-reduced-pom.xml
to X:\slave\workspace\surefire\jdk\java-5x\label\windows\trunk\surefire-integration-tests\target\it-repo\org\apache\maven\surefire\surefire-junit47\2.7.2-SNAPSHOT\surefire-junit47-2.7.2-SNAPSHOT.pom
[INFO] Installing X:\slave\workspace\surefire\jdk\java-5x\label\windows\trunk\surefire-providers\surefire-junit47\target\surefire-junit47-2.7.2-SNAPSHOT.jar
to X:\slave\workspace\surefire\jdk\java-5x\label\windows\trunk\surefire-integration-tests\target\it-repo\org\apache\maven\surefire\surefire-junit47\2.7.2-SNAPSHOT\surefire-junit47-2.7.2-20110113.210202-28.jar
[INFO] Installing X:\slave\workspace\surefire\jdk\java-5x\label\windows\trunk\surefire-integration-tests\pom.xml
to X:\slave\workspace\surefire\jdk\java-5x\label\windows\trunk\surefire-integration-tests\target\it-repo\org\apache\maven\surefire\surefire-integration-tests\2.7.2-SNAPSHOT\surefire-integration-tests-2.7.2-SNAPSHOT.pom
[INFO] Installing X:\slave\workspace\surefire\jdk\java-5x\label\windows\trunk\surefire-integration-tests\target\surefire-integration-tests-2.7.2-SNAPSHOT.jar
to X:\slave\workspace\surefire\jdk\java-5x\label\windows\trunk\surefire-integration-tests\target\it-repo\org\apache\maven\surefire\surefire-integration-tests\2.7.2-SNAPSHOT\surefire-integration-tests-2.7.2-SNAPSHOT.jar
[WARNING] DEPRECATED [systemProperties]: Use systemPropertyVariables instead.
[INFO] [failsafe:integration-test {execution: default}]
[INFO] Failsafe report directory: X:\slave\workspace\surefire\jdk\java-5x\label\windows\trunk\surefire-integration-tests\target\failsafe-reports

-------------------------------------------------------
 T E S T S
-------------------------------------------------------
Running org.apache.maven.surefire.its.AbstractTestCaseIT
Tests run: 1, Failures: 0, Errors: 0, Skipped: 0, Time elapsed: 9.794 sec
Running org.apache.maven.surefire.its.AdditionalClasspathIT
Tests run: 2, Failures: 0, Errors: 0, Skipped: 0, Time elapsed: 7.745 sec
Running org.apache.maven.surefire.its.AggregateReportIT
Tests run: 3, Failures: 0, Errors: 0, Skipped: 0, Time elapsed: 9.38 sec
Running org.apache.maven.surefire.its.ArgLineIT
Tests run: 4, Failures: 0, Errors: 0, Skipped: 0, Time elapsed: 4.986 sec
Running org.apache.maven.surefire.its.CheckSingleTestIT
Tests run: 8, Failures: 0, Errors: 0, Skipped: 0, Time elapsed: 21.979 sec
Running org.apache.maven.surefire.its.CheckTestFailIfNoTestsForkModeIT
Tests run: 14, Failures: 0, Errors: 0, Skipped: 0, Time elapsed: 33.585 sec
Running org.apache.maven.surefire.its.CheckTestFailIfNoTestsIT
Tests run: 16, Failures: 0, Errors: 0, Skipped: 0, Time elapsed: 7.856 sec
Running org.apache.maven.surefire.its.CheckTestNgBeforeMethodFailureIT
Tests run: 17, Failures: 0, Errors: 0, Skipped: 0, Time elapsed: 6.655 sec
Running org.apache.maven.surefire.its.CheckTestNgBeforeMethodIT
Tests run: 18, Failures: 0, Errors: 0, Skipped: 0, Time elapsed: 5.703 sec
Running org.apache.maven.surefire.its.CheckTestNgExecuteErrorIT
Tests run: 19, Failures: 0, Errors: 0, Skipped: 0, Time elapsed: 5.716 sec
Running org.apache.maven.surefire.its.CheckTestNgGroupThreadParallelIT
Tests run: 20, Failures: 0, Errors: 0, Skipped: 0, Time elapsed: 6.427 sec
Running org.apache.maven.surefire.its.CheckTestNgJdk14IT
Tests run: 21, Failures: 0, Errors: 0, Skipped: 0, Time elapsed: 7.37 sec
Running org.apache.maven.surefire.its.CheckTestNgListenerReporterIT
Tests run: 22, Failures: 0, Errors: 0, Skipped: 0, Time elapsed: 6.158 sec
Running org.apache.maven.surefire.its.CheckTestNgPathWithSpacesIT
Tests run: 23, Failures: 0, Errors: 0, Skipped: 0, Time elapsed: 8.057 sec
Running org.apache.maven.surefire.its.CheckTestNgReportTestIT
Tests run: 24, Failures: 0, Errors: 0, Skipped: 0, Time elapsed: 8.284 sec
Running org.apache.maven.surefire.its.CheckTestNgSuiteXmlIT
Tests run: 26, Failures: 0, Errors: 0, Skipped: 0, Time elapsed: 12.095 sec
Running org.apache.maven.surefire.its.CheckTestNgSuiteXmlSingleIT
Tests run: 27, Failures: 0, Errors: 0, Skipped: 0, Time elapsed: 5.288 sec
Running org.apache.maven.surefire.its.CheckTestNgVersionsIT
Tests run: 43, Failures: 0, Errors: 0, Skipped: 0, Time elapsed: 110.171 sec
Running org.apache.maven.surefire.its.ClasspathFilteringIT
Tests run: 44, Failures: 0, Errors: 0, Skipped: 0, Time elapsed: 6.223 sec
Running org.apache.maven.surefire.its.ClassPathOrderIT
Tests run: 45, Failures: 0, Errors: 0, Skipped: 0, Time elapsed: 6.654 sec
Running org.apache.maven.surefire.its.ClasspathScopeFilteringIT
Tests run: 46, Failures: 0, Errors: 0, Skipped: 0, Time elapsed: 5.202 sec
Running org.apache.maven.surefire.its.DefaultConfigurationIT
Tests run: 47, Failures: 0, Errors: 0, Skipped: 0, Time elapsed: 5.204 sec
Running org.apache.maven.surefire.its.EnvironmentVariableIT
Tests run: 48, Failures: 0, Errors: 0, Skipped: 0, Time elapsed: 6.056 sec
Running org.apache.maven.surefire.its.ForkConsoleOutputIT
Tests run: 52, Failures: 0, Errors: 0, Skipped: 0, Time elapsed: 35.171 sec
Running org.apache.maven.surefire.its.ForkModeIT
Tests run: 57, Failures: 0, Errors: 0, Skipped: 0, Time elapsed: 26.455 sec
Running org.apache.maven.surefire.its.IncludesExcludesIT
Tests run: 58, Failures: 0, Errors: 0, Skipped: 0, Time elapsed: 6.298 sec
Running org.apache.maven.surefire.its.JUnit44DepIT
Tests run: 60, Failures: 0, Errors: 0, Skipped: 0, Time elapsed: 12.061 sec
Running org.apache.maven.surefire.its.JUnit44HamcrestIT
Tests run: 61, Failures: 0, Errors: 0, Skipped: 0, Time elapsed: 5.96 sec
Running org.apache.maven.surefire.its.Junit47concurrencyIT
Tests run: 62, Failures: 0, Errors: 0, Skipped: 0, Time elapsed: 7.351 sec
Running org.apache.maven.surefire.its.JUnit4ForkAlwaysStaticInitPollutionIT
Tests run: 63, Failures: 0, Errors: 0, Skipped: 0, Time elapsed: 7.224 sec
Running org.apache.maven.surefire.its.Junit4IgnoreIT
Tests run: 64, Failures: 0, Errors: 0, Skipped: 0, Time elapsed: 8.434 sec
Running org.apache.maven.surefire.its.JUnit4RunListenerIT
Tests run: 66, Failures: 0, Errors: 0, Skipped: 0, Time elapsed: 12.026 sec
Running org.apache.maven.surefire.its.Junit4VersionsIT
Tests run: 75, Failures: 0, Errors: 0, Skipped: 0, Time elapsed: 51.926 sec
Running org.apache.maven.surefire.its.NoRunnableTestsInClassIT
Tests run: 76, Failures: 0, Errors: 0, Skipped: 0, Time elapsed: 6.9 sec
Running org.apache.maven.surefire.its.PlainOldJavaClasspathIT
Tests run: 77, Failures: 0, Errors: 0, Skipped: 0, Time elapsed: 6.209 sec
Running org.apache.maven.surefire.its.PlexusConflictIT
Tests run: 79, Failures: 0, Errors: 0, Skipped: 0, Time elapsed: 10.849 sec
Running org.apache.maven.surefire.its.PojoSimpleIT
Tests run: 80, Failures: 0, Errors: 0, Skipped: 0, Time elapsed: 4.71 sec
Running org.apache.maven.surefire.its.ReportersIT
Tests run: 81, Failures: 0, Errors: 0, Skipped: 0, Time elapsed: 6.233 sec
Running org.apache.maven.surefire.its.ResultCountingIT
Tests run: 84, Failures: 0, Errors: 0, Skipped: 0, Time elapsed: 15.613 sec
Running org.apache.maven.surefire.its.RunOrderIT
Tests run: 87, Failures: 0, Errors: 0, Skipped: 0, Time elapsed: 14.554 sec
Running org.apache.maven.surefire.its.SiblingAggregatorIT
Tests run: 88, Failures: 0, Errors: 0, Skipped: 0, Time elapsed: 4.861 sec
Running org.apache.maven.surefire.its.Surefire141PluggableProvidersIT
Tests run: 89, Failures: 0, Errors: 0, Skipped: 0, Time elapsed: 12.033 sec
Running org.apache.maven.surefire.its.Surefire146ForkPerTestNoSetupIT
Tests run: 90, Failures: 0, Errors: 0, Skipped: 0, Time elapsed: 5.653 sec
Running org.apache.maven.surefire.its.Surefire162CharsetProviderIT
Tests run: 91, Failures: 0, Errors: 0, Skipped: 0, Time elapsed: 5.723 sec
Running org.apache.maven.surefire.its.Surefire224WellFormedXmlFailuresIT
Tests run: 92, Failures: 0, Errors: 0, Skipped: 0, Time elapsed: 5.2 sec
Running org.apache.maven.surefire.its.Surefire377TestNgAndJUnitTogetherIT
Tests run: 93, Failures: 0, Errors: 0, Skipped: 0, Time elapsed: 6.18 sec
Running org.apache.maven.surefire.its.Surefire408ManualProviderSelectionIT
Tests run: 94, Failures: 0, Errors: 0, Skipped: 0, Time elapsed: 5.625 sec
Running org.apache.maven.surefire.its.Surefire42NotExtendingTestCaseIT
Tests run: 95, Failures: 0, Errors: 0, Skipped: 0, Time elapsed: 5.706 sec
Running org.apache.maven.surefire.its.Surefire44InnerClassTestIT
Tests run: 96, Failures: 0, Errors: 0, Skipped: 0, Time elapsed: 5.607 sec
Running org.apache.maven.surefire.its.Surefire500PuzzlingErrorIT
Tests run: 97, Failures: 1, Errors: 0, Skipped: 0, Time elapsed: 5.289 sec <<< FAILURE!
Running org.apache.maven.surefire.its.Surefire510TestClassPathForkModesIT
Tests run: 99, Failures: 1, Errors: 0, Skipped: 0, Time elapsed: 11.238 sec <<< FAILURE!
Running org.apache.maven.surefire.its.Surefire613TestCountInParallelIT
Tests run: 100, Failures: 1, Errors: 0, Skipped: 0, Time elapsed: 7.177 sec <<< FAILURE!
Running org.apache.maven.surefire.its.Surefire621TestCountingJunit3InParallelIT
Tests run: 101, Failures: 1, Errors: 0, Skipped: 0, Time elapsed: 6.706 sec <<< FAILURE!
Running org.apache.maven.surefire.its.Surefire628ConsoleOutputBeforeAndAfterClassIT
Tests run: 102, Failures: 1, Errors: 0, Skipped: 0, Time elapsed: 6.028 sec <<< FAILURE!
Running org.apache.maven.surefire.its.Surefire673MockitoIT
Tests run: 103, Failures: 1, Errors: 0, Skipped: 0, Time elapsed: 6.41 sec <<< FAILURE!
Running org.apache.maven.surefire.its.Surefire674BuildFailingWhenErrorsIT
Tests run: 104, Failures: 1, Errors: 0, Skipped: 0, Time elapsed: 5.747 sec <<< FAILURE!
Running org.apache.maven.surefire.its.SystemPropertiesTestIT
Tests run: 106, Failures: 1, Errors: 0, Skipped: 0, Time elapsed: 10.961 sec <<<
FAILURE!
Running org.apache.maven.surefire.its.TimeoutForkedTestIT
Tests run: 107, Failures: 1, Errors: 0, Skipped: 0, Time elapsed: 17.341 sec <<<
FAILURE!
Running org.apache.maven.surefire.its.TwoTestCasesIT
Tests run: 111, Failures: 1, Errors: 0, Skipped: 0, Time elapsed: 25.183 sec <<<
FAILURE!
Running org.apache.maven.surefire.its.UmlautDirIT
Tests run: 113, Failures: 1, Errors: 0, Skipped: 0, Time elapsed: 11.78 sec <<< FAILURE!
Running org.apache.maven.surefire.its.UseIsolatedClassLoaderIT
Tests run: 114, Failures: 1, Errors: 0, Skipped: 0, Time elapsed: 5.954 sec <<< FAILURE!
Running org.apache.maven.surefire.its.WorkingDirectoryIT
Tests run: 118, Failures: 1, Errors: 0, Skipped: 0, Time elapsed: 20.814 sec <<<
FAILURE!
Running org.apache.maven.surefire.its.WorkingDirectoryMissingIT
Tests run: 119, Failures: 1, Errors: 0, Skipped: 0, Time elapsed: 6.767 sec <<< FAILURE!

Results :

Failed tests: 
  testBuildFailingWhenErrors(org.apache.maven.surefire.its.Surefire500PuzzlingErrorIT)

Tests run: 119, Failures: 1, Errors: 0, Skipped: 0

[INFO] [failsafe:verify {execution: default}]
[INFO] Failsafe report directory: X:\slave\workspace\surefire\jdk\java-5x\label\windows\trunk\surefire-integration-tests\target\failsafe-reports
[INFO] ------------------------------------------------------------------------
[ERROR] BUILD FAILURE
[INFO] ------------------------------------------------------------------------
[INFO] There are test failures.

Please refer to X:\slave\workspace\surefire\jdk\java-5x\label\windows\trunk\surefire-integration-tests\target\failsafe-reports
for the individual test results.
[INFO] ------------------------------------------------------------------------
[INFO] Trace
org.apache.maven.BuildFailureException: There are test failures.

Please refer to X:\slave\workspace\surefire\jdk\java-5x\label\windows\trunk\surefire-integration-tests\target\failsafe-reports
for the individual test results.
	at org.apache.maven.lifecycle.DefaultLifecycleExecutor.executeGoals(DefaultLifecycleExecutor.java:715)
	at org.apache.maven.lifecycle.DefaultLifecycleExecutor.executeGoalWithLifecycle(DefaultLifecycleExecutor.java:556)
	at org.apache.maven.lifecycle.DefaultLifecycleExecutor.executeGoal(DefaultLifecycleExecutor.java:535)
	at org.apache.maven.lifecycle.DefaultLifecycleExecutor.executeGoalAndHandleFailures(DefaultLifecycleExecutor.java:387)
	at org.apache.maven.lifecycle.DefaultLifecycleExecutor.executeTaskSegments(DefaultLifecycleExecutor.java:348)
	at org.apache.maven.lifecycle.DefaultLifecycleExecutor.execute(DefaultLifecycleExecutor.java:180)
	at org.apache.maven.DefaultMaven.doExecute(DefaultMaven.java:328)
	at org.apache.maven.DefaultMaven.execute(DefaultMaven.java:138)
	at org.apache.maven.cli.MavenCli.main(MavenCli.java:362)
	at org.apache.maven.cli.compat.CompatibleMain.main(CompatibleMain.java:60)
	at sun.reflect.NativeMethodAccessorImpl.invoke0(Native Method)
	at sun.reflect.NativeMethodAccessorImpl.invoke(NativeMethodAccessorImpl.java:39)
	at sun.reflect.DelegatingMethodAccessorImpl.invoke(DelegatingMethodAccessorImpl.java:25)
	at java.lang.reflect.Method.invoke(Method.java:592)
	at org.codehaus.classworlds.Launcher.launchEnhanced(Launcher.java:315)
	at org.codehaus.classworlds.Launcher.launch(Launcher.java:255)
	at org.codehaus.classworlds.Launcher.mainWithExitCode(Launcher.java:430)
	at org.codehaus.classworlds.Launcher.main(Launcher.java:375)
Caused by: org.apache.maven.plugin.MojoFailureException: There are test failures.

Please refer to X:\slave\workspace\surefire\jdk\java-5x\label\windows\trunk\surefire-integration-tests\target\failsafe-reports
for the individual test results.
	at org.apache.maven.plugin.surefire.SurefireHelper.reportExecution(SurefireHelper.java:74)
	at org.apache.maven.plugin.failsafe.VerifyMojo.execute(VerifyMojo.java:205)
	at org.apache.maven.plugin.DefaultPluginManager.executeMojo(DefaultPluginManager.java:490)
	at org.apache.maven.lifecycle.DefaultLifecycleExecutor.executeGoals(DefaultLifecycleExecutor.java:694)
	... 17 more
[INFO] ------------------------------------------------------------------------
[INFO] Total time: 15 minutes 23 seconds
[INFO] Finished at: Thu Jan 13 13:17:07 PST 2011
[INFO] Final Memory: 46M/63M
[INFO] ------------------------------------------------------------------------


Mime
View raw message