maven-notifications mailing list archives

Site index · List index
Message view « Date » · « Thread »
Top « Date » · « Thread »
From "GRiD .ORG" <bui...@lists.sonatype.com>
Subject Build failed in Hudson: maven-3.0.x-ITs » java-5x,ubuntu #433
Date Wed, 05 Jan 2011 20:57:06 GMT
See <https://grid.sonatype.org/ci/job/maven-3.0.x-ITs/./jdk=java-5x,label=ubuntu/433/>

------------------------------------------
[...truncated 990 lines...]
/opt/grid/slave/workspace/maven-3.0.x-ITs/jdk/java-5x/label/ubuntu/core-integration-tests/target/distro/bin/mvn
--global-settings /opt/grid/slave/workspace/maven-3.0.x-ITs/jdk/java-5x/label/ubuntu/core-integration-tests/target/test-classes/settings.xml
--settings settings.xml -Pprofile-2 -e --batch-mode -DincludeProfile=true -Dmaven.repo.local=<https://grid.sonatype.org/ci/job/maven-3.0.x-ITs/./jdk=java-5x,label=ubuntu/ws/.repository>
validate
[INFO] Error stacktraces are turned on.
[INFO] Scanning for projects...
[INFO]                                                                         
[INFO] ------------------------------------------------------------------------
[INFO] Building Maven Integration Test :: it0021 1.0-SNAPSHOT
[INFO] ------------------------------------------------------------------------
[ERROR] Java heap space -> [Help 1]
java.lang.OutOfMemoryError: Java heap space
[ERROR] 
[ERROR] Re-run Maven using the -X switch to enable full debug logging.
[ERROR] 
[ERROR] For more information about the errors and possible solutions, please read the following
articles:
[ERROR] [Help 1] http://cwiki.apache.org/confluence/display/MAVEN/OutOfMemoryError
	at org.apache.maven.it.Verifier.executeGoals(Verifier.java:1390)
	at org.apache.maven.it.Verifier.executeGoal(Verifier.java:1233)
	at org.apache.maven.it.Verifier.executeGoal(Verifier.java:1227)
	at org.apache.maven.it.MavenIT0021PomProfileTest.testit0021(MavenIT0021PomProfileTest.java:52)

testit0019(org.apache.maven.it.MavenIT0019PluginVersionMngtBySuperPomTest)  Time elapsed:
0.973 sec  <<< ERROR!
org.apache.maven.it.VerificationException: Exit code was non-zero: 1; command line and log
= 
/opt/grid/slave/workspace/maven-3.0.x-ITs/jdk/java-5x/label/ubuntu/core-integration-tests/target/distro/bin/mvn
--global-settings /opt/grid/slave/workspace/maven-3.0.x-ITs/jdk/java-5x/label/ubuntu/core-integration-tests/target/test-classes/settings.xml
-e --batch-mode -Dmaven.repo.local=<https://grid.sonatype.org/ci/job/maven-3.0.x-ITs/./jdk=java-5x,label=ubuntu/ws/.repository>
process-resources
[INFO] Error stacktraces are turned on.
[INFO] Scanning for projects...
[WARNING] 
[WARNING] Some problems were encountered while building the effective model for org.apache.maven.its.it0019:maven-it-it0019:jar:1.0
[WARNING] 'build.plugins.plugin.version' for org.apache.maven.plugins:maven-resources-plugin
is missing. @ line 34, column 15
[WARNING] 
[WARNING] It is highly recommended to fix these problems because they threaten the stability
of your build.
[WARNING] 
[WARNING] For this reason, future Maven versions might no longer support building such malformed
projects.
[WARNING] 
[INFO]                                                                         
[INFO] ------------------------------------------------------------------------
[INFO] Building Maven Integration Test :: it0019 1.0
[INFO] ------------------------------------------------------------------------
[ERROR] Java heap space -> [Help 1]
java.lang.OutOfMemoryError: Java heap space
[ERROR] 
[ERROR] Re-run Maven using the -X switch to enable full debug logging.
[ERROR] 
[ERROR] For more information about the errors and possible solutions, please read the following
articles:
[ERROR] [Help 1] http://cwiki.apache.org/confluence/display/MAVEN/OutOfMemoryError
	at org.apache.maven.it.Verifier.executeGoals(Verifier.java:1390)
	at org.apache.maven.it.Verifier.executeGoal(Verifier.java:1233)
	at org.apache.maven.it.Verifier.executeGoal(Verifier.java:1227)
	at org.apache.maven.it.MavenIT0019PluginVersionMngtBySuperPomTest.testit0019(MavenIT0019PluginVersionMngtBySuperPomTest.java:45)

testit0018(org.apache.maven.it.MavenIT0018DependencyManagementTest)  Time elapsed: 1.979 sec
 <<< ERROR!
org.apache.maven.it.VerificationException: Exit code was non-zero: 1; command line and log
= 
/opt/grid/slave/workspace/maven-3.0.x-ITs/jdk/java-5x/label/ubuntu/core-integration-tests/target/distro/bin/mvn
--global-settings /opt/grid/slave/workspace/maven-3.0.x-ITs/jdk/java-5x/label/ubuntu/core-integration-tests/target/test-classes/settings.xml
--settings settings.xml -e --batch-mode -Dmaven.repo.local=<https://grid.sonatype.org/ci/job/maven-3.0.x-ITs/./jdk=java-5x,label=ubuntu/ws/.repository>
org.apache.maven.its.plugins:maven-it-plugin-dependency-resolution:2.1-SNAPSHOT:compile
[INFO] Error stacktraces are turned on.
[INFO] Scanning for projects...
[INFO]                                                                         
[INFO] ------------------------------------------------------------------------
[INFO] Building Maven Integration Test :: it0018 1.0
[INFO] ------------------------------------------------------------------------
Downloading: file:target/null/org/apache/maven/its/it0018/sub-project/1/sub-project-1.pom
Downloading: file:///opt/grid/slave/workspace/maven-3.0.x-ITs/jdk/java-5x/label/ubuntu/core-integration-tests/target/test-classes/it0018/repo/org/apache/maven/its/it0018/sub-project/1/sub-project-1.pom
Downloaded: file:///opt/grid/slave/workspace/maven-3.0.x-ITs/jdk/java-5x/label/ubuntu/core-integration-tests/target/test-classes/it0018/repo/org/apache/maven/its/it0018/sub-project/1/sub-project-1.pom
(2 KB)
Downloading: file:target/null/org/apache/maven/its/it0018/parent/1/parent-1.pom
[ERROR] Java heap space -> [Help 1]
java.lang.OutOfMemoryError: Java heap space
[ERROR] 
[ERROR] Re-run Maven using the -X switch to enable full debug logging.
[ERROR] 
[ERROR] For more information about the errors and possible solutions, please read the following
articles:
[ERROR] [Help 1] http://cwiki.apache.org/confluence/display/MAVEN/OutOfMemoryError
	at org.apache.maven.it.Verifier.executeGoals(Verifier.java:1390)
	at org.apache.maven.it.Verifier.executeGoal(Verifier.java:1233)
	at org.apache.maven.it.Verifier.executeGoal(Verifier.java:1227)
	at org.apache.maven.it.MavenIT0018DependencyManagementTest.testit0018(MavenIT0018DependencyManagementTest.java:50)

testit0012(org.apache.maven.it.MavenIT0012PomInterpolationTest)  Time elapsed: 0.737 sec 
<<< ERROR!
org.apache.maven.it.VerificationException: Exit code was non-zero: 1; command line and log
= 
/opt/grid/slave/workspace/maven-3.0.x-ITs/jdk/java-5x/label/ubuntu/core-integration-tests/target/distro/bin/mvn
--global-settings /opt/grid/slave/workspace/maven-3.0.x-ITs/jdk/java-5x/label/ubuntu/core-integration-tests/target/test-classes/settings.xml
-e --batch-mode -Dmaven.repo.local=<https://grid.sonatype.org/ci/job/maven-3.0.x-ITs/./jdk=java-5x,label=ubuntu/ws/.repository>
org.apache.maven.its.plugins:maven-it-plugin-touch:touch
[INFO] Error stacktraces are turned on.
[INFO] Scanning for projects...
[ERROR] Java heap space -> [Help 1]
java.lang.OutOfMemoryError: Java heap space
[ERROR] 
[ERROR] Re-run Maven using the -X switch to enable full debug logging.
[ERROR] 
[ERROR] For more information about the errors and possible solutions, please read the following
articles:
[ERROR] [Help 1] http://cwiki.apache.org/confluence/display/MAVEN/OutOfMemoryError
	at org.apache.maven.it.Verifier.executeGoals(Verifier.java:1390)
	at org.apache.maven.it.Verifier.executeGoal(Verifier.java:1233)
	at org.apache.maven.it.Verifier.executeGoal(Verifier.java:1227)
	at org.apache.maven.it.MavenIT0012PomInterpolationTest.testit0012(MavenIT0012PomInterpolationTest.java:46)

testit0011(org.apache.maven.it.MavenIT0011DefaultVersionByDependencyManagementTest)  Time
elapsed: 0.765 sec  <<< ERROR!
org.apache.maven.it.VerificationException: Exit code was non-zero: 1; command line and log
= 
/opt/grid/slave/workspace/maven-3.0.x-ITs/jdk/java-5x/label/ubuntu/core-integration-tests/target/distro/bin/mvn
--global-settings /opt/grid/slave/workspace/maven-3.0.x-ITs/jdk/java-5x/label/ubuntu/core-integration-tests/target/test-classes/settings.xml
--settings settings.xml -e --batch-mode -Dmaven.repo.local=<https://grid.sonatype.org/ci/job/maven-3.0.x-ITs/./jdk=java-5x,label=ubuntu/ws/.repository>
validate
[INFO] Error stacktraces are turned on.
[INFO] Scanning for projects...
[INFO]                                                                         
[INFO] ------------------------------------------------------------------------
[INFO] Building Maven Integration Test :: it0011 1.0
[INFO] ------------------------------------------------------------------------
[ERROR] Java heap space -> [Help 1]
java.lang.OutOfMemoryError: Java heap space
[ERROR] 
[ERROR] Re-run Maven using the -X switch to enable full debug logging.
[ERROR] 
[ERROR] For more information about the errors and possible solutions, please read the following
articles:
[ERROR] [Help 1] http://cwiki.apache.org/confluence/display/MAVEN/OutOfMemoryError
	at org.apache.maven.it.Verifier.executeGoals(Verifier.java:1390)
	at org.apache.maven.it.Verifier.executeGoal(Verifier.java:1233)
	at org.apache.maven.it.Verifier.executeGoal(Verifier.java:1227)
	at org.apache.maven.it.MavenIT0011DefaultVersionByDependencyManagementTest.testit0011(MavenIT0011DefaultVersionByDependencyManagementTest.java:50)

testit0010(org.apache.maven.it.MavenIT0010DependencyClosureResolutionTest)  Time elapsed:
2.292 sec  <<< ERROR!
org.apache.maven.it.VerificationException: Exit code was non-zero: 1; command line and log
= 
/opt/grid/slave/workspace/maven-3.0.x-ITs/jdk/java-5x/label/ubuntu/core-integration-tests/target/distro/bin/mvn
--global-settings /opt/grid/slave/workspace/maven-3.0.x-ITs/jdk/java-5x/label/ubuntu/core-integration-tests/target/test-classes/settings.xml
--settings settings.xml -e --batch-mode -Dmaven.repo.local=<https://grid.sonatype.org/ci/job/maven-3.0.x-ITs/./jdk=java-5x,label=ubuntu/ws/.repository>
validate
[INFO] Error stacktraces are turned on.
[INFO] Scanning for projects...
[INFO]                                                                         
[INFO] ------------------------------------------------------------------------
[INFO] Building Maven Integration Test :: it0010 1.0
[INFO] ------------------------------------------------------------------------
Downloading: file:target/null/org/apache/maven/its/it0010/a/0.1/a-0.1.pom
Downloading: file:///opt/grid/slave/workspace/maven-3.0.x-ITs/jdk/java-5x/label/ubuntu/core-integration-tests/target/test-classes/it0010/repo/org/apache/maven/its/it0010/a/0.1/a-0.1.pom
Downloaded: file:///opt/grid/slave/workspace/maven-3.0.x-ITs/jdk/java-5x/label/ubuntu/core-integration-tests/target/test-classes/it0010/repo/org/apache/maven/its/it0010/a/0.1/a-0.1.pom
(2 KB at 1338.9 KB/sec)
Downloading: file:target/null/org/apache/maven/its/it0010/parent/1.0/parent-1.0.pom
Downloading: file:///opt/grid/slave/workspace/maven-3.0.x-ITs/jdk/java-5x/label/ubuntu/core-integration-tests/target/test-classes/it0010/repo/org/apache/maven/its/it0010/parent/1.0/parent-1.0.pom
Downloaded: file:///opt/grid/slave/workspace/maven-3.0.x-ITs/jdk/java-5x/label/ubuntu/core-integration-tests/target/test-classes/it0010/repo/org/apache/maven/its/it0010/parent/1.0/parent-1.0.pom
(2 KB at 1441.4 KB/sec)
[ERROR] Java heap space -> [Help 1]
java.lang.OutOfMemoryError: Java heap space
[ERROR] 
[ERROR] Re-run Maven using the -X switch to enable full debug logging.
[ERROR] 
[ERROR] For more information about the errors and possible solutions, please read the following
articles:
[ERROR] [Help 1] http://cwiki.apache.org/confluence/display/MAVEN/OutOfMemoryError
	at org.apache.maven.it.Verifier.executeGoals(Verifier.java:1390)
	at org.apache.maven.it.Verifier.executeGoal(Verifier.java:1233)
	at org.apache.maven.it.Verifier.executeGoal(Verifier.java:1227)
	at org.apache.maven.it.MavenIT0010DependencyClosureResolutionTest.testit0010(MavenIT0010DependencyClosureResolutionTest.java:53)

testit0009(org.apache.maven.it.MavenIT0009GoalConfigurationTest)  Time elapsed: 0.792 sec
 <<< ERROR!
org.apache.maven.it.VerificationException: Exit code was non-zero: 1; command line and log
= 
/opt/grid/slave/workspace/maven-3.0.x-ITs/jdk/java-5x/label/ubuntu/core-integration-tests/target/distro/bin/mvn
--global-settings /opt/grid/slave/workspace/maven-3.0.x-ITs/jdk/java-5x/label/ubuntu/core-integration-tests/target/test-classes/settings.xml
-e --batch-mode -Dmaven.repo.local=<https://grid.sonatype.org/ci/job/maven-3.0.x-ITs/./jdk=java-5x,label=ubuntu/ws/.repository>
validate
[INFO] Error stacktraces are turned on.
[INFO] Scanning for projects...
[INFO]                                                                         
[INFO] ------------------------------------------------------------------------
[INFO] Building Maven Integration Test :: it0009 1.0
[INFO] ------------------------------------------------------------------------
[ERROR] Java heap space -> [Help 1]
java.lang.OutOfMemoryError: Java heap space
[ERROR] 
[ERROR] Re-run Maven using the -X switch to enable full debug logging.
[ERROR] 
[ERROR] For more information about the errors and possible solutions, please read the following
articles:
[ERROR] [Help 1] http://cwiki.apache.org/confluence/display/MAVEN/OutOfMemoryError
	at org.apache.maven.it.Verifier.executeGoals(Verifier.java:1390)
	at org.apache.maven.it.Verifier.executeGoal(Verifier.java:1233)
	at org.apache.maven.it.Verifier.executeGoal(Verifier.java:1227)
	at org.apache.maven.it.MavenIT0009GoalConfigurationTest.testit0009(MavenIT0009GoalConfigurationTest.java:47)

testit0008(org.apache.maven.it.MavenIT0008SimplePluginTest)  Time elapsed: 1.585 sec  <<<
ERROR!
org.apache.maven.it.VerificationException: Exit code was non-zero: 1; command line and log
= 
/opt/grid/slave/workspace/maven-3.0.x-ITs/jdk/java-5x/label/ubuntu/core-integration-tests/target/distro/bin/mvn
--global-settings /opt/grid/slave/workspace/maven-3.0.x-ITs/jdk/java-5x/label/ubuntu/core-integration-tests/target/test-classes/settings.xml
-e --batch-mode -Dmaven.repo.local=<https://grid.sonatype.org/ci/job/maven-3.0.x-ITs/./jdk=java-5x,label=ubuntu/ws/.repository>
process-sources
[INFO] Error stacktraces are turned on.
[INFO] Scanning for projects...
[INFO]                                                                         
[INFO] ------------------------------------------------------------------------
[INFO] Building Maven Integration Test :: it0008 1.0
[INFO] ------------------------------------------------------------------------
[INFO] 
[INFO] --- maven-it-plugin-touch:2.1-SNAPSHOT:touch (default) @ test ---
[ERROR] Java heap space -> [Help 1]
java.lang.OutOfMemoryError: Java heap space
[ERROR] 
[ERROR] Re-run Maven using the -X switch to enable full debug logging.
[ERROR] 
[ERROR] For more information about the errors and possible solutions, please read the following
articles:
[ERROR] [Help 1] http://cwiki.apache.org/confluence/display/MAVEN/OutOfMemoryError
	at org.apache.maven.it.Verifier.executeGoals(Verifier.java:1390)
	at org.apache.maven.it.Verifier.executeGoal(Verifier.java:1233)
	at org.apache.maven.it.Verifier.executeGoal(Verifier.java:1227)
	at org.apache.maven.it.MavenIT0008SimplePluginTest.testit0008(MavenIT0008SimplePluginTest.java:50)


Results :

Tests in error: 
  testit0032(org.apache.maven.it.MavenIT0032MavenPrerequisiteTest)
  testit0030(org.apache.maven.it.MavenIT0030DepPomDepMngtInheritanceTest)
  testit0025(org.apache.maven.it.MavenIT0025MultipleExecutionLevelConfigsTest)
  testit0023(org.apache.maven.it.MavenIT0023SettingsProfileTest)
  testit0021(org.apache.maven.it.MavenIT0021PomProfileTest)
  testit0019(org.apache.maven.it.MavenIT0019PluginVersionMngtBySuperPomTest)
  testit0018(org.apache.maven.it.MavenIT0018DependencyManagementTest)
  testit0012(org.apache.maven.it.MavenIT0012PomInterpolationTest)
  testit0011(org.apache.maven.it.MavenIT0011DefaultVersionByDependencyManagementTest)
  testit0010(org.apache.maven.it.MavenIT0010DependencyClosureResolutionTest)
  testit0009(org.apache.maven.it.MavenIT0009GoalConfigurationTest)
  testit0008(org.apache.maven.it.MavenIT0008SimplePluginTest)

Tests run: 685, Failures: 0, Errors: 12, Skipped: 0

Exception in thread "Thread-2" java.lang.OutOfMemoryError: Java heap space
[INFO] ------------------------------------------------------------------------
[INFO] BUILD FAILURE
[INFO] ------------------------------------------------------------------------
[INFO] Total time: 14:38.746s
[INFO] Finished at: Wed Jan 05 14:57:05 CST 2011
[INFO] Final Memory: 20M/381M
[INFO] ------------------------------------------------------------------------
[ERROR] Failed to execute goal org.apache.maven.plugins:maven-surefire-plugin:2.4.3:test (default-test)
on project core-it-suite: There are test failures.
[ERROR] 
[ERROR] Please refer to /opt/grid/slave/workspace/maven-3.0.x-ITs/jdk/java-5x/label/ubuntu/core-integration-tests/target/surefire-reports
for the individual test results.
[ERROR] -> [Help 1]
org.apache.maven.lifecycle.LifecycleExecutionException: Failed to execute goal org.apache.maven.plugins:maven-surefire-plugin:2.4.3:test
(default-test) on project core-it-suite: There are test failures.

Please refer to /opt/grid/slave/workspace/maven-3.0.x-ITs/jdk/java-5x/label/ubuntu/core-integration-tests/target/surefire-reports
for the individual test results.
	at org.apache.maven.lifecycle.internal.MojoExecutor.execute(MojoExecutor.java:213)
	at org.apache.maven.lifecycle.internal.MojoExecutor.execute(MojoExecutor.java:153)
	at org.apache.maven.lifecycle.internal.MojoExecutor.execute(MojoExecutor.java:145)
	at org.apache.maven.lifecycle.internal.LifecycleModuleBuilder.buildProject(LifecycleModuleBuilder.java:84)
	at org.apache.maven.lifecycle.internal.LifecycleModuleBuilder.buildProject(LifecycleModuleBuilder.java:59)
	at org.apache.maven.lifecycle.internal.LifecycleStarter.singleThreadedBuild(LifecycleStarter.java:183)
	at org.apache.maven.lifecycle.internal.LifecycleStarter.execute(LifecycleStarter.java:161)
	at org.apache.maven.DefaultMaven.doExecute(DefaultMaven.java:319)
	at org.apache.maven.DefaultMaven.execute(DefaultMaven.java:156)
	at org.apache.maven.cli.MavenCli.execute(MavenCli.java:534)
	at org.apache.maven.cli.MavenCli.doMain(MavenCli.java:196)
	at org.apache.maven.cli.MavenCli.main(MavenCli.java:141)
	at sun.reflect.NativeMethodAccessorImpl.invoke0(Native Method)
	at sun.reflect.NativeMethodAccessorImpl.invoke(NativeMethodAccessorImpl.java:39)
	at sun.reflect.DelegatingMethodAccessorImpl.invoke(DelegatingMethodAccessorImpl.java:25)
	at java.lang.reflect.Method.invoke(Method.java:592)
	at org.codehaus.plexus.classworlds.launcher.Launcher.launchEnhanced(Launcher.java:290)
	at org.codehaus.plexus.classworlds.launcher.Launcher.launch(Launcher.java:230)
	at org.codehaus.plexus.classworlds.launcher.Launcher.mainWithExitCode(Launcher.java:409)
	at org.codehaus.plexus.classworlds.launcher.Launcher.main(Launcher.java:352)
Caused by: org.apache.maven.plugin.MojoFailureException: There are test failures.

Please refer to /opt/grid/slave/workspace/maven-3.0.x-ITs/jdk/java-5x/label/ubuntu/core-integration-tests/target/surefire-reports
for the individual test results.
	at org.apache.maven.plugin.surefire.SurefirePlugin.execute(SurefirePlugin.java:575)
	at org.apache.maven.plugin.DefaultBuildPluginManager.executeMojo(DefaultBuildPluginManager.java:107)
	at org.apache.maven.lifecycle.internal.MojoExecutor.execute(MojoExecutor.java:209)
	... 19 more
[ERROR] 
[ERROR] Re-run Maven using the -X switch to enable full debug logging.
[ERROR] 
[ERROR] For more information about the errors and possible solutions, please read the following
articles:
[ERROR] [Help 1] http://cwiki.apache.org/confluence/display/MAVEN/MojoFailureException
Emma: looking for coverage reports in the provided path: core-integration-tests/target/site/emma/coverage.xml


Mime
View raw message