maven-notifications mailing list archives

Site index · List index
Message view « Date » · « Thread »
Top « Date » · « Thread »
From "GRiD .ORG" <bui...@lists.sonatype.com>
Subject Build failed in Hudson: surefire » java-5x,ubuntu #219
Date Fri, 14 Jan 2011 10:25:57 GMT
See <https://grid.sonatype.org/ci/job/surefire/./jdk=java-5x,label=ubuntu/219/changes>

Changes:

[Kristian Rosenvold] o Fixing the build on grid, take1

------------------------------------------
[...truncated 687 lines...]
[INFO] Retrieving previous metadata from apache.snapshots.https
[INFO] Uploading repository metadata for: 'org.apache.maven.plugins'
[INFO] Uploading project information for maven-surefire-report-plugin 2.7.2-20110114.100134-29
[INFO] ------------------------------------------------------------------------
[INFO] Building Maven Surefire Integration Tests
[INFO]    task-segment: [clean, deploy]
[INFO] ------------------------------------------------------------------------
[INFO] [clean:clean {execution: default-clean}]
[INFO] Deleting /opt/grid/slave/workspace/surefire/jdk/java-5x/label/ubuntu/trunk/surefire-integration-tests/target
[INFO] [enforcer:enforce {execution: require-maven-2.1.0}]
[INFO] [remote-resources:process {execution: default}]
[INFO] [resources:resources {execution: default-resources}]
[INFO] Using 'UTF-8' encoding to copy filtered resources.
[INFO] skip non existing resourceDirectory /opt/grid/slave/workspace/surefire/jdk/java-5x/label/ubuntu/trunk/surefire-integration-tests/src/main/resources
[INFO] Copying 3 resources
[INFO] [compiler:compile {execution: default-compile}]
[INFO] No sources to compile
[INFO] [help:effective-settings {execution: settings.xml}]
[INFO] Effective-settings written to: /opt/grid/slave/workspace/surefire/jdk/java-5x/label/ubuntu/trunk/surefire-integration-tests/target/private/settings.xml
[INFO] [resources:testResources {execution: default-testResources}]
[INFO] Using 'UTF-8' encoding to copy filtered resources.
[INFO] Copying 198 resources
[INFO] Copying 3 resources
[INFO] [compiler:testCompile {execution: default-testCompile}]
[INFO] Compiling 71 source files to /opt/grid/slave/workspace/surefire/jdk/java-5x/label/ubuntu/trunk/surefire-integration-tests/target/test-classes
[WARNING] DEPRECATED [systemProperties]: Use systemPropertyVariables instead.
[INFO] [surefire:test {execution: default-test}]
[INFO] Surefire report directory: /opt/grid/slave/workspace/surefire/jdk/java-5x/label/ubuntu/trunk/surefire-integration-tests/target/surefire-reports

-------------------------------------------------------
 T E S T S
-------------------------------------------------------
Running org.apache.maven.surefire.its.SetUpForIntegrationTest
Tests run: 1, Failures: 0, Errors: 0, Skipped: 0, Time elapsed: 0.102 sec

Results :

Tests run: 1, Failures: 0, Errors: 0, Skipped: 0

[INFO] [jar:jar {execution: default-jar}]
[INFO] Building jar: /opt/grid/slave/workspace/surefire/jdk/java-5x/label/ubuntu/trunk/surefire-integration-tests/target/surefire-integration-tests-2.7.2-SNAPSHOT.jar
[INFO] [invoker:install {execution: default}]
[INFO] Installing /opt/grid/slave/workspace/surefire/jdk/java-5x/label/ubuntu/trunk/maven-surefire-report-plugin/pom.xml
to /opt/grid/slave/workspace/surefire/jdk/java-5x/label/ubuntu/trunk/surefire-integration-tests/target/it-repo/org/apache/maven/plugins/maven-surefire-report-plugin/2.7.2-SNAPSHOT/maven-surefire-report-plugin-2.7.2-SNAPSHOT.pom
[INFO] Installing /opt/grid/slave/workspace/surefire/jdk/java-5x/label/ubuntu/trunk/maven-surefire-report-plugin/target/maven-surefire-report-plugin-2.7.2-SNAPSHOT.jar
to /opt/grid/slave/workspace/surefire/jdk/java-5x/label/ubuntu/trunk/surefire-integration-tests/target/it-repo/org/apache/maven/plugins/maven-surefire-report-plugin/2.7.2-SNAPSHOT/maven-surefire-report-plugin-2.7.2-20110114.100134-29.jar
[INFO] Installing /opt/grid/slave/workspace/surefire/jdk/java-5x/label/ubuntu/trunk/pom.xml
to /opt/grid/slave/workspace/surefire/jdk/java-5x/label/ubuntu/trunk/surefire-integration-tests/target/it-repo/org/apache/maven/surefire/surefire/2.7.2-SNAPSHOT/surefire-2.7.2-20110114.100134-29.pom
[INFO] Installing /opt/grid/slave/workspace/surefire/jdk/java-5x/label/ubuntu/trunk/maven-surefire-plugin/pom.xml
to /opt/grid/slave/workspace/surefire/jdk/java-5x/label/ubuntu/trunk/surefire-integration-tests/target/it-repo/org/apache/maven/plugins/maven-surefire-plugin/2.7.2-SNAPSHOT/maven-surefire-plugin-2.7.2-SNAPSHOT.pom
[INFO] Installing /opt/grid/slave/workspace/surefire/jdk/java-5x/label/ubuntu/trunk/maven-surefire-plugin/target/maven-surefire-plugin-2.7.2-SNAPSHOT.jar
to /opt/grid/slave/workspace/surefire/jdk/java-5x/label/ubuntu/trunk/surefire-integration-tests/target/it-repo/org/apache/maven/plugins/maven-surefire-plugin/2.7.2-SNAPSHOT/maven-surefire-plugin-2.7.2-20110114.100134-29.jar
[INFO] Installing /opt/grid/slave/workspace/surefire/jdk/java-5x/label/ubuntu/trunk/surefire-booter/pom.xml
to /opt/grid/slave/workspace/surefire/jdk/java-5x/label/ubuntu/trunk/surefire-integration-tests/target/it-repo/org/apache/maven/surefire/surefire-booter/2.7.2-SNAPSHOT/surefire-booter-2.7.2-SNAPSHOT.pom
[INFO] Installing /opt/grid/slave/workspace/surefire/jdk/java-5x/label/ubuntu/trunk/surefire-booter/target/surefire-booter-2.7.2-SNAPSHOT.jar
to /opt/grid/slave/workspace/surefire/jdk/java-5x/label/ubuntu/trunk/surefire-integration-tests/target/it-repo/org/apache/maven/surefire/surefire-booter/2.7.2-SNAPSHOT/surefire-booter-2.7.2-20110114.100134-29.jar
[INFO] Installing /opt/grid/slave/workspace/surefire/jdk/java-5x/label/ubuntu/trunk/surefire-api/dependency-reduced-pom.xml
to /opt/grid/slave/workspace/surefire/jdk/java-5x/label/ubuntu/trunk/surefire-integration-tests/target/it-repo/org/apache/maven/surefire/surefire-api/2.7.2-SNAPSHOT/surefire-api-2.7.2-SNAPSHOT.pom
[INFO] Installing /opt/grid/slave/workspace/surefire/jdk/java-5x/label/ubuntu/trunk/surefire-api/target/surefire-api-2.7.2-SNAPSHOT.jar
to /opt/grid/slave/workspace/surefire/jdk/java-5x/label/ubuntu/trunk/surefire-integration-tests/target/it-repo/org/apache/maven/surefire/surefire-api/2.7.2-SNAPSHOT/surefire-api-2.7.2-20110114.100134-29.jar
[INFO] Installing /opt/grid/slave/workspace/surefire/jdk/java-5x/label/ubuntu/trunk/maven-surefire-common/pom.xml
to /opt/grid/slave/workspace/surefire/jdk/java-5x/label/ubuntu/trunk/surefire-integration-tests/target/it-repo/org/apache/maven/surefire/maven-surefire-common/2.7.2-SNAPSHOT/maven-surefire-common-2.7.2-SNAPSHOT.pom
[INFO] Installing /opt/grid/slave/workspace/surefire/jdk/java-5x/label/ubuntu/trunk/maven-surefire-common/target/maven-surefire-common-2.7.2-SNAPSHOT.jar
to /opt/grid/slave/workspace/surefire/jdk/java-5x/label/ubuntu/trunk/surefire-integration-tests/target/it-repo/org/apache/maven/surefire/maven-surefire-common/2.7.2-SNAPSHOT/maven-surefire-common-2.7.2-20110114.100134-29.jar
[INFO] Installing /opt/grid/slave/workspace/surefire/jdk/java-5x/label/ubuntu/trunk/surefire-providers/surefire-testng/pom.xml
to /opt/grid/slave/workspace/surefire/jdk/java-5x/label/ubuntu/trunk/surefire-integration-tests/target/it-repo/org/apache/maven/surefire/surefire-testng/2.7.2-SNAPSHOT/surefire-testng-2.7.2-SNAPSHOT.pom
[INFO] Installing /opt/grid/slave/workspace/surefire/jdk/java-5x/label/ubuntu/trunk/surefire-providers/surefire-testng/target/surefire-testng-2.7.2-SNAPSHOT.jar
to /opt/grid/slave/workspace/surefire/jdk/java-5x/label/ubuntu/trunk/surefire-integration-tests/target/it-repo/org/apache/maven/surefire/surefire-testng/2.7.2-SNAPSHOT/surefire-testng-2.7.2-20110114.100134-29.jar
[INFO] Installing /opt/grid/slave/workspace/surefire/jdk/java-5x/label/ubuntu/trunk/surefire-providers/pom.xml
to /opt/grid/slave/workspace/surefire/jdk/java-5x/label/ubuntu/trunk/surefire-integration-tests/target/it-repo/org/apache/maven/surefire/surefire-providers/2.7.2-SNAPSHOT/surefire-providers-2.7.2-20110114.100134-29.pom
[INFO] Installing /opt/grid/slave/workspace/surefire/jdk/java-5x/label/ubuntu/trunk/surefire-providers/surefire-junit3/dependency-reduced-pom.xml
to /opt/grid/slave/workspace/surefire/jdk/java-5x/label/ubuntu/trunk/surefire-integration-tests/target/it-repo/org/apache/maven/surefire/surefire-junit3/2.7.2-SNAPSHOT/surefire-junit3-2.7.2-SNAPSHOT.pom
[INFO] Installing /opt/grid/slave/workspace/surefire/jdk/java-5x/label/ubuntu/trunk/surefire-providers/surefire-junit3/target/surefire-junit3-2.7.2-SNAPSHOT.jar
to /opt/grid/slave/workspace/surefire/jdk/java-5x/label/ubuntu/trunk/surefire-integration-tests/target/it-repo/org/apache/maven/surefire/surefire-junit3/2.7.2-SNAPSHOT/surefire-junit3-2.7.2-20110114.100134-29.jar
[INFO] Installing /opt/grid/slave/workspace/surefire/jdk/java-5x/label/ubuntu/trunk/surefire-providers/surefire-junit4/dependency-reduced-pom.xml
to /opt/grid/slave/workspace/surefire/jdk/java-5x/label/ubuntu/trunk/surefire-integration-tests/target/it-repo/org/apache/maven/surefire/surefire-junit4/2.7.2-SNAPSHOT/surefire-junit4-2.7.2-SNAPSHOT.pom
[INFO] Installing /opt/grid/slave/workspace/surefire/jdk/java-5x/label/ubuntu/trunk/surefire-providers/surefire-junit4/target/surefire-junit4-2.7.2-SNAPSHOT.jar
to /opt/grid/slave/workspace/surefire/jdk/java-5x/label/ubuntu/trunk/surefire-integration-tests/target/it-repo/org/apache/maven/surefire/surefire-junit4/2.7.2-SNAPSHOT/surefire-junit4-2.7.2-20110114.100134-29.jar
[INFO] Installing /opt/grid/slave/workspace/surefire/jdk/java-5x/label/ubuntu/trunk/surefire-providers/surefire-junit47/dependency-reduced-pom.xml
to /opt/grid/slave/workspace/surefire/jdk/java-5x/label/ubuntu/trunk/surefire-integration-tests/target/it-repo/org/apache/maven/surefire/surefire-junit47/2.7.2-SNAPSHOT/surefire-junit47-2.7.2-SNAPSHOT.pom
[INFO] Installing /opt/grid/slave/workspace/surefire/jdk/java-5x/label/ubuntu/trunk/surefire-providers/surefire-junit47/target/surefire-junit47-2.7.2-SNAPSHOT.jar
to /opt/grid/slave/workspace/surefire/jdk/java-5x/label/ubuntu/trunk/surefire-integration-tests/target/it-repo/org/apache/maven/surefire/surefire-junit47/2.7.2-SNAPSHOT/surefire-junit47-2.7.2-20110114.100134-29.jar
[INFO] Installing /opt/grid/slave/workspace/surefire/jdk/java-5x/label/ubuntu/trunk/surefire-integration-tests/pom.xml
to /opt/grid/slave/workspace/surefire/jdk/java-5x/label/ubuntu/trunk/surefire-integration-tests/target/it-repo/org/apache/maven/surefire/surefire-integration-tests/2.7.2-SNAPSHOT/surefire-integration-tests-2.7.2-SNAPSHOT.pom
[INFO] Installing /opt/grid/slave/workspace/surefire/jdk/java-5x/label/ubuntu/trunk/surefire-integration-tests/target/surefire-integration-tests-2.7.2-SNAPSHOT.jar
to /opt/grid/slave/workspace/surefire/jdk/java-5x/label/ubuntu/trunk/surefire-integration-tests/target/it-repo/org/apache/maven/surefire/surefire-integration-tests/2.7.2-SNAPSHOT/surefire-integration-tests-2.7.2-SNAPSHOT.jar
[WARNING] DEPRECATED [systemProperties]: Use systemPropertyVariables instead.
[INFO] [failsafe:integration-test {execution: default}]
[INFO] Failsafe report directory: /opt/grid/slave/workspace/surefire/jdk/java-5x/label/ubuntu/trunk/surefire-integration-tests/target/failsafe-reports

-------------------------------------------------------
 T E S T S
-------------------------------------------------------
Running org.apache.maven.surefire.its.CheckTestNgListenerReporterIT
Tests run: 1, Failures: 0, Errors: 0, Skipped: 0, Time elapsed: 13.09 sec
Running org.apache.maven.surefire.its.CheckTestNgJdk14IT
Tests run: 2, Failures: 0, Errors: 0, Skipped: 0, Time elapsed: 7.995 sec
Running org.apache.maven.surefire.its.CheckTestFailIfNoTestsForkModeIT
Tests run: 8, Failures: 0, Errors: 0, Skipped: 0, Time elapsed: 58.051 sec
Running org.apache.maven.surefire.its.ResultCountingIT
Tests run: 11, Failures: 0, Errors: 0, Skipped: 0, Time elapsed: 35.064 sec
Running org.apache.maven.surefire.its.JUnit44HamcrestIT
Tests run: 12, Failures: 0, Errors: 0, Skipped: 0, Time elapsed: 16.111 sec
Running org.apache.maven.surefire.its.Surefire146ForkPerTestNoSetupIT
Tests run: 13, Failures: 0, Errors: 0, Skipped: 0, Time elapsed: 11.769 sec
Running org.apache.maven.surefire.its.UmlautDirIT
Tests run: 15, Failures: 0, Errors: 0, Skipped: 0, Time elapsed: 16.705 sec
Running org.apache.maven.surefire.its.JUnit44DepIT
Tests run: 17, Failures: 0, Errors: 0, Skipped: 0, Time elapsed: 18.009 sec
Running org.apache.maven.surefire.its.Surefire42NotExtendingTestCaseIT
Tests run: 18, Failures: 0, Errors: 0, Skipped: 0, Time elapsed: 7.193 sec
Running org.apache.maven.surefire.its.ClassPathOrderIT
Tests run: 19, Failures: 0, Errors: 0, Skipped: 0, Time elapsed: 9.053 sec
Running org.apache.maven.surefire.its.CheckTestNgBeforeMethodFailureIT
Tests run: 20, Failures: 0, Errors: 0, Skipped: 0, Time elapsed: 10.223 sec
Running org.apache.maven.surefire.its.CheckTestNgReportTestIT
Tests run: 21, Failures: 0, Errors: 0, Skipped: 0, Time elapsed: 12.798 sec
Running org.apache.maven.surefire.its.CheckTestNgExecuteErrorIT
Tests run: 22, Failures: 0, Errors: 0, Skipped: 0, Time elapsed: 9.306 sec
Running org.apache.maven.surefire.its.JUnit4ForkAlwaysStaticInitPollutionIT
Tests run: 23, Failures: 0, Errors: 0, Skipped: 0, Time elapsed: 10.489 sec
Running org.apache.maven.surefire.its.Surefire224WellFormedXmlFailuresIT
Tests run: 24, Failures: 0, Errors: 0, Skipped: 0, Time elapsed: 10.852 sec
Running org.apache.maven.surefire.its.Surefire162CharsetProviderIT
Tests run: 25, Failures: 0, Errors: 0, Skipped: 0, Time elapsed: 10.935 sec
Running org.apache.maven.surefire.its.Surefire613TestCountInParallelIT
Tests run: 26, Failures: 0, Errors: 0, Skipped: 0, Time elapsed: 12.163 sec
Running org.apache.maven.surefire.its.UseIsolatedClassLoaderIT
Tests run: 27, Failures: 0, Errors: 0, Skipped: 0, Time elapsed: 12.832 sec
Running org.apache.maven.surefire.its.PlainOldJavaClasspathIT
Tests run: 28, Failures: 0, Errors: 0, Skipped: 0, Time elapsed: 11.616 sec
Running org.apache.maven.surefire.its.ArgLineIT
Tests run: 29, Failures: 0, Errors: 0, Skipped: 0, Time elapsed: 9.002 sec
Running org.apache.maven.surefire.its.CheckTestFailIfNoTestsIT
Tests run: 31, Failures: 0, Errors: 0, Skipped: 0, Time elapsed: 14.933 sec
Running org.apache.maven.surefire.its.Surefire510TestClassPathForkModesIT
Tests run: 33, Failures: 0, Errors: 0, Skipped: 0, Time elapsed: 20.236 sec
Running org.apache.maven.surefire.its.CheckSingleTestIT
Tests run: 37, Failures: 0, Errors: 0, Skipped: 0, Time elapsed: 29.917 sec
Running org.apache.maven.surefire.its.Surefire628ConsoleOutputBeforeAndAfterClassIT
Tests run: 38, Failures: 0, Errors: 0, Skipped: 0, Time elapsed: 13.14 sec
Running org.apache.maven.surefire.its.CheckTestNgBeforeMethodIT
Tests run: 39, Failures: 0, Errors: 0, Skipped: 0, Time elapsed: 8.758 sec
Running org.apache.maven.surefire.its.Surefire408ManualProviderSelectionIT
Tests run: 40, Failures: 0, Errors: 0, Skipped: 0, Time elapsed: 7.966 sec
Running org.apache.maven.surefire.its.PlexusConflictIT
Tests run: 42, Failures: 0, Errors: 0, Skipped: 0, Time elapsed: 18.99 sec
Running org.apache.maven.surefire.its.SiblingAggregatorIT
Tests run: 43, Failures: 0, Errors: 0, Skipped: 0, Time elapsed: 9.279 sec
Running org.apache.maven.surefire.its.Surefire673MockitoIT
Tests run: 44, Failures: 0, Errors: 0, Skipped: 0, Time elapsed: 24.498 sec
Running org.apache.maven.surefire.its.TwoTestCasesIT
Tests run: 48, Failures: 0, Errors: 0, Skipped: 0, Time elapsed: 36.006 sec
Running org.apache.maven.surefire.its.CheckTestNgPathWithSpacesIT
Tests run: 49, Failures: 0, Errors: 0, Skipped: 0, Time elapsed: 9.385 sec
Running org.apache.maven.surefire.its.Junit47concurrencyIT
Tests run: 50, Failures: 0, Errors: 0, Skipped: 0, Time elapsed: 13.693 sec
Running org.apache.maven.surefire.its.Surefire141PluggableProvidersIT
Tests run: 51, Failures: 0, Errors: 0, Skipped: 0, Time elapsed: 23.701 sec
Running org.apache.maven.surefire.its.ClasspathScopeFilteringIT
Tests run: 52, Failures: 0, Errors: 0, Skipped: 0, Time elapsed: 11.509 sec
Running org.apache.maven.surefire.its.Surefire500PuzzlingErrorIT
Tests run: 53, Failures: 1, Errors: 0, Skipped: 0, Time elapsed: 14.594 sec <<< FAILURE!
Running org.apache.maven.surefire.its.ForkConsoleOutputIT
Tests run: 57, Failures: 1, Errors: 0, Skipped: 0, Time elapsed: 47.631 sec <<< FAILURE!
Running org.apache.maven.surefire.its.RunOrderIT
Tests run: 60, Failures: 1, Errors: 0, Skipped: 0, Time elapsed: 26.302 sec <<< FAILURE!
Running org.apache.maven.surefire.its.Surefire377TestNgAndJUnitTogetherIT
Tests run: 61, Failures: 1, Errors: 0, Skipped: 0, Time elapsed: 10.539 sec <<< FAILURE!
Running org.apache.maven.surefire.its.WorkingDirectoryIT
Tests run: 65, Failures: 1, Errors: 0, Skipped: 0, Time elapsed: 28.164 sec <<< FAILURE!
Running org.apache.maven.surefire.its.EnvironmentVariableIT
Tests run: 66, Failures: 1, Errors: 0, Skipped: 0, Time elapsed: 7.604 sec <<< FAILURE!
Running org.apache.maven.surefire.its.CheckTestNgGroupThreadParallelIT
Tests run: 67, Failures: 1, Errors: 0, Skipped: 0, Time elapsed: 10.458 sec <<< FAILURE!
Running org.apache.maven.surefire.its.Surefire621TestCountingJunit3InParallelIT
Tests run: 68, Failures: 1, Errors: 0, Skipped: 0, Time elapsed: 11.345 sec <<< FAILURE!
Running org.apache.maven.surefire.its.ForkModeIT
Tests run: 73, Failures: 1, Errors: 0, Skipped: 0, Time elapsed: 53.602 sec <<< FAILURE!
Running org.apache.maven.surefire.its.AbstractTestCaseIT
Tests run: 74, Failures: 1, Errors: 0, Skipped: 0, Time elapsed: 9.248 sec <<< FAILURE!
Running org.apache.maven.surefire.its.PojoSimpleIT
Tests run: 75, Failures: 1, Errors: 0, Skipped: 0, Time elapsed: 9.548 sec <<< FAILURE!
Running org.apache.maven.surefire.its.DefaultConfigurationIT
Tests run: 76, Failures: 1, Errors: 0, Skipped: 0, Time elapsed: 10.023 sec <<< FAILURE!
Running org.apache.maven.surefire.its.CheckTestNgVersionsIT
Tests run: 92, Failures: 1, Errors: 0, Skipped: 0, Time elapsed: 154.8 sec <<< FAILURE!
Running org.apache.maven.surefire.its.CheckTestNgSuiteXmlIT
Tests run: 94, Failures: 1, Errors: 0, Skipped: 0, Time elapsed: 22.302 sec <<< FAILURE!
Running org.apache.maven.surefire.its.AdditionalClasspathIT
Tests run: 95, Failures: 1, Errors: 0, Skipped: 0, Time elapsed: 9.287 sec <<< FAILURE!
Running org.apache.maven.surefire.its.TimeoutForkedTestIT
Tests run: 96, Failures: 1, Errors: 0, Skipped: 0, Time elapsed: 11.735 sec <<< FAILURE!
Running org.apache.maven.surefire.its.Surefire44InnerClassTestIT
Tests run: 97, Failures: 1, Errors: 0, Skipped: 0, Time elapsed: 10.629 sec <<< FAILURE!
Running org.apache.maven.surefire.its.JUnit4RunListenerIT
Tests run: 99, Failures: 1, Errors: 0, Skipped: 0, Time elapsed: 18.639 sec <<< FAILURE!
Running org.apache.maven.surefire.its.NoRunnableTestsInClassIT
Tests run: 100, Failures: 1, Errors: 0, Skipped: 0, Time elapsed: 9.552 sec <<< FAILURE!
Running org.apache.maven.surefire.its.ReportersIT
Tests run: 101, Failures: 1, Errors: 0, Skipped: 0, Time elapsed: 11.236 sec <<<
FAILURE!
Running org.apache.maven.surefire.its.Junit4IgnoreIT
Tests run: 102, Failures: 1, Errors: 0, Skipped: 0, Time elapsed: 12.952 sec <<<
FAILURE!
Running org.apache.maven.surefire.its.AggregateReportIT
Tests run: 103, Failures: 1, Errors: 0, Skipped: 0, Time elapsed: 14.643 sec <<<
FAILURE!
Running org.apache.maven.surefire.its.CheckTestNgSuiteXmlSingleIT
Tests run: 104, Failures: 1, Errors: 0, Skipped: 0, Time elapsed: 9.541 sec <<< FAILURE!
Running org.apache.maven.surefire.its.IncludesExcludesIT
Tests run: 105, Failures: 1, Errors: 0, Skipped: 0, Time elapsed: 8.269 sec <<< FAILURE!
Running org.apache.maven.surefire.its.ClasspathFilteringIT
Tests run: 106, Failures: 1, Errors: 0, Skipped: 0, Time elapsed: 8.823 sec <<< FAILURE!
Running org.apache.maven.surefire.its.Junit4VersionsIT
Tests run: 115, Failures: 1, Errors: 0, Skipped: 0, Time elapsed: 91.588 sec <<<
FAILURE!
Running org.apache.maven.surefire.its.WorkingDirectoryMissingIT
Tests run: 116, Failures: 1, Errors: 0, Skipped: 0, Time elapsed: 9.55 sec <<< FAILURE!
Running org.apache.maven.surefire.its.Surefire674BuildFailingWhenErrorsIT
Tests run: 117, Failures: 1, Errors: 0, Skipped: 0, Time elapsed: 11.389 sec <<<
FAILURE!
Running org.apache.maven.surefire.its.SystemPropertiesTestIT
Tests run: 119, Failures: 1, Errors: 0, Skipped: 0, Time elapsed: 22.124 sec <<<
FAILURE!

Results :

Failed tests: 
  testBuildFailingWhenErrors(org.apache.maven.surefire.its.Surefire500PuzzlingErrorIT)

Tests run: 119, Failures: 1, Errors: 0, Skipped: 0

[INFO] [failsafe:verify {execution: default}]
[INFO] Failsafe report directory: /opt/grid/slave/workspace/surefire/jdk/java-5x/label/ubuntu/trunk/surefire-integration-tests/target/failsafe-reports
[INFO] ------------------------------------------------------------------------
[ERROR] BUILD FAILURE
[INFO] ------------------------------------------------------------------------
[INFO] There are test failures.

Please refer to /opt/grid/slave/workspace/surefire/jdk/java-5x/label/ubuntu/trunk/surefire-integration-tests/target/failsafe-reports
for the individual test results.
[INFO] ------------------------------------------------------------------------
[INFO] Trace
org.apache.maven.BuildFailureException: There are test failures.

Please refer to /opt/grid/slave/workspace/surefire/jdk/java-5x/label/ubuntu/trunk/surefire-integration-tests/target/failsafe-reports
for the individual test results.
	at org.apache.maven.lifecycle.DefaultLifecycleExecutor.executeGoals(DefaultLifecycleExecutor.java:715)
	at org.apache.maven.lifecycle.DefaultLifecycleExecutor.executeGoalWithLifecycle(DefaultLifecycleExecutor.java:556)
	at org.apache.maven.lifecycle.DefaultLifecycleExecutor.executeGoal(DefaultLifecycleExecutor.java:535)
	at org.apache.maven.lifecycle.DefaultLifecycleExecutor.executeGoalAndHandleFailures(DefaultLifecycleExecutor.java:387)
	at org.apache.maven.lifecycle.DefaultLifecycleExecutor.executeTaskSegments(DefaultLifecycleExecutor.java:348)
	at org.apache.maven.lifecycle.DefaultLifecycleExecutor.execute(DefaultLifecycleExecutor.java:180)
	at org.apache.maven.DefaultMaven.doExecute(DefaultMaven.java:328)
	at org.apache.maven.DefaultMaven.execute(DefaultMaven.java:138)
	at org.apache.maven.cli.MavenCli.main(MavenCli.java:362)
	at org.apache.maven.cli.compat.CompatibleMain.main(CompatibleMain.java:60)
	at sun.reflect.NativeMethodAccessorImpl.invoke0(Native Method)
	at sun.reflect.NativeMethodAccessorImpl.invoke(NativeMethodAccessorImpl.java:39)
	at sun.reflect.DelegatingMethodAccessorImpl.invoke(DelegatingMethodAccessorImpl.java:25)
	at java.lang.reflect.Method.invoke(Method.java:592)
	at org.codehaus.classworlds.Launcher.launchEnhanced(Launcher.java:315)
	at org.codehaus.classworlds.Launcher.launch(Launcher.java:255)
	at org.codehaus.classworlds.Launcher.mainWithExitCode(Launcher.java:430)
	at org.codehaus.classworlds.Launcher.main(Launcher.java:375)
Caused by: org.apache.maven.plugin.MojoFailureException: There are test failures.

Please refer to /opt/grid/slave/workspace/surefire/jdk/java-5x/label/ubuntu/trunk/surefire-integration-tests/target/failsafe-reports
for the individual test results.
	at org.apache.maven.plugin.surefire.SurefireHelper.reportExecution(SurefireHelper.java:74)
	at org.apache.maven.plugin.failsafe.VerifyMojo.execute(VerifyMojo.java:205)
	at org.apache.maven.plugin.DefaultPluginManager.executeMojo(DefaultPluginManager.java:490)
	at org.apache.maven.lifecycle.DefaultLifecycleExecutor.executeGoals(DefaultLifecycleExecutor.java:694)
	... 17 more
[INFO] ------------------------------------------------------------------------
[INFO] Total time: 24 minutes 30 seconds
[INFO] Finished at: Fri Jan 14 04:25:55 CST 2011
[INFO] Final Memory: 80M/390M
[INFO] ------------------------------------------------------------------------


Mime
View raw message